FailedConsole Output

Started by user Asger  Askov-Blekinge (abr)
Building remotely on Local activeMQ in workspace /home/cibuild01/workspace/Bitrepository-******
 > git rev-parse --is-inside-work-tree # timeout=10
Fetching changes from the remote Git repository
 > git config remote.origin.url https://github.com/bitrepository/reference # timeout=10
Fetching upstream changes from https://github.com/bitrepository/reference
 > git --version # timeout=10
 > git -c core.askpass=true fetch --tags --progress https://github.com/bitrepository/reference +refs/heads/master:refs/remotes/origin/master
 > git rev-parse refs/remotes/origin/******^{commit} # timeout=10
 > git rev-parse refs/remotes/origin/origin/******^{commit} # timeout=10
Checking out Revision 8a6328b8db885a3d3a47fe0372a10e6682efd610 (refs/remotes/origin/******)
 > git config core.sparsecheckout # timeout=10
 > git checkout -f 8a6328b8db885a3d3a47fe0372a10e6682efd610
 > git rev-list 8a6328b8db885a3d3a47fe0372a10e6682efd610 # timeout=10
 > git tag -a -f -m Jenkins Build #86 jenkins-Bitrepository-******-86 # timeout=10
Injecting SonarQube environment variables using the configuration: SBForge Sonar
Parsing POMs
Established TCP socket on 46783
maven32-agent.jar already up to date
maven32-interceptor.jar already up to date
maven3-interceptor-commons.jar already up to date
[Bitrepository-******] $ /usr/java/java-1.8.0-oracle-1.8.0.11.x86_64/bin/java -Xmx512m -XX:MaxPermSize=128m -cp /home/cibuild01/maven32-agent.jar:/home/cibuild01/tools/hudson.tasks.Maven_MavenInstallation/Maven3.2/boot/plexus-classworlds-2.5.1.jar:/home/cibuild01/tools/hudson.tasks.Maven_MavenInstallation/Maven3.2/conf/logging jenkins.maven3.agent.Maven32Main /home/cibuild01/tools/hudson.tasks.Maven_MavenInstallation/Maven3.2 /home/cibuild01/slave.jar /home/cibuild01/maven32-interceptor.jar /home/cibuild01/maven3-interceptor-commons.jar 46783
Java HotSpot(TM) 64-Bit Server VM warning: ignoring option MaxPermSize=128m; support was removed in 8.0
<===[JENKINS REMOTING CAPACITY]===>channel started
Executing Maven:  -B -f /home/cibuild01/workspace/Bitrepository-******/pom.xml install org.codehaus.******:******-maven-plugin:2.6:****** -DskipTests -D******.host.url=https://sbforge.org/****** -D******.login=****** -D******.password=****** -D******.jdbc.url=jdbc:postgresql://leda/****** -D******.jdbc.username=****** -D******.jdbc.password=******
[INFO] Scanning for projects...
[INFO] ------------------------------------------------------------------------
[INFO] Reactor Build Order:
[INFO] 
[INFO] Bitrepository
[INFO] Bitrepository Reference Settings
[INFO] Bitrepository Core
[INFO] Bitrepository Client
[INFO] Bitrepository Service
[INFO] Bitrepository Integrity Service
[INFO] Bitrepository Alarm Service
[INFO] Bitrepository Audit Trail Service
[INFO] Bitrepository Reference Pillar
[INFO] Bitrepository Monitoring Service
[INFO] Bitrepository Webclient
[INFO] Bitrepository Integration
[INFO] 
[INFO] Using the builder org.apache.maven.lifecycle.internal.builder.singlethreaded.SingleThreadedBuilder with a thread count of 1
[INFO]                                                                         
[INFO] ------------------------------------------------------------------------
[INFO] Building Bitrepository 1.7-SNAPSHOT
[INFO] ------------------------------------------------------------------------
[INFO] 
[INFO] --- maven-jar-plugin:2.4:test-jar (default) @ bitrepository-parent ---
[WARNING] JAR will be empty - no content was marked for inclusion!
[INFO] Building jar: /home/cibuild01/workspace/Bitrepository-******/target/bitrepository-parent-1.7-SNAPSHOT-tests.jar
[INFO] 
[INFO] --- maven-source-plugin:2.2.1:jar-no-fork (attach-sources-no-fork) @ bitrepository-parent ---
[INFO] 
[INFO] --- maven-install-plugin:2.5.1:install (default-install) @ bitrepository-parent ---
[INFO] Installing /home/cibuild01/workspace/Bitrepository-******/pom.xml to /home/cibuild01/.m2/repository/org/bitrepository/reference/bitrepository-parent/1.7-SNAPSHOT/bitrepository-parent-1.7-SNAPSHOT.pom
[INFO] Installing /home/cibuild01/workspace/Bitrepository-******/target/bitrepository-parent-1.7-SNAPSHOT-tests.jar to /home/cibuild01/.m2/repository/org/bitrepository/reference/bitrepository-parent/1.7-SNAPSHOT/bitrepository-parent-1.7-SNAPSHOT-tests.jar
[JENKINS] Archiving disabled
[INFO]                                                                         
[INFO] ------------------------------------------------------------------------
[INFO] Building Bitrepository Reference Settings 1.7-SNAPSHOT
[INFO] ------------------------------------------------------------------------
[INFO] 
[INFO] --- maven-resources-plugin:2.6:copy-resources (copy-resources) @ bitrepository-reference-settings ---
[INFO] Using 'UTF-8' encoding to copy filtered resources.
[INFO] Copying 2 resources
[INFO] 
[INFO] --- maven-jaxb2-plugin:0.11.0:generate (generate-classes-from-xsds) @ bitrepository-reference-settings ---
[INFO] Sources are not up-to-date, XJC will be executed.
[INFO] 
[INFO] --- maven-resources-plugin:2.6:resources (default-resources) @ bitrepository-reference-settings ---
[INFO] Using 'UTF-8' encoding to copy filtered resources.
[INFO] Copying 2 resources
[INFO] Copying 1 resource
[INFO] Copying 1 resource
[INFO] 
[INFO] --- maven-compiler-plugin:3.1:compile (default-compile) @ bitrepository-reference-settings ---
[INFO] Changes detected - recompiling the module!
[INFO] Compiling 38 source files to /home/cibuild01/workspace/Bitrepository-******/bitrepository-reference-settings/target/classes
[INFO] 
[INFO] --- maven-resources-plugin:2.6:testResources (default-testResources) @ bitrepository-reference-settings ---
[INFO] Using 'UTF-8' encoding to copy filtered resources.
[INFO] skip non existing resourceDirectory /home/cibuild01/workspace/Bitrepository-******/bitrepository-reference-settings/src/test/resources
[INFO] 
[INFO] --- maven-compiler-plugin:3.1:testCompile (default-testCompile) @ bitrepository-reference-settings ---
[INFO] No sources to compile
[INFO] 
[INFO] --- maven-surefire-plugin:2.17:test (default-test) @ bitrepository-reference-settings ---
[INFO] Tests are skipped.
[INFO] 
[INFO] --- maven-jar-plugin:2.4:jar (default-jar) @ bitrepository-reference-settings ---
[INFO] Building jar: /home/cibuild01/workspace/Bitrepository-******/bitrepository-reference-settings/target/bitrepository-reference-settings-1.7-SNAPSHOT.jar
[INFO] 
[INFO] --- maven-jar-plugin:2.4:test-jar (default) @ bitrepository-reference-settings ---
[WARNING] JAR will be empty - no content was marked for inclusion!
[INFO] Building jar: /home/cibuild01/workspace/Bitrepository-******/bitrepository-reference-settings/target/bitrepository-reference-settings-1.7-SNAPSHOT-tests.jar
[INFO] 
[INFO] --- maven-source-plugin:2.2.1:jar-no-fork (attach-sources-no-fork) @ bitrepository-reference-settings ---
[INFO] Building jar: /home/cibuild01/workspace/Bitrepository-******/bitrepository-reference-settings/target/bitrepository-reference-settings-1.7-SNAPSHOT-sources.jar
[INFO] 
[INFO] --- maven-install-plugin:2.5.1:install (default-install) @ bitrepository-reference-settings ---
[INFO] Installing /home/cibuild01/workspace/Bitrepository-******/bitrepository-reference-settings/target/bitrepository-reference-settings-1.7-SNAPSHOT.jar to /home/cibuild01/.m2/repository/org/bitrepository/reference/bitrepository-reference-settings/1.7-SNAPSHOT/bitrepository-reference-settings-1.7-SNAPSHOT.jar
[INFO] Installing /home/cibuild01/workspace/Bitrepository-******/bitrepository-reference-settings/pom.xml to /home/cibuild01/.m2/repository/org/bitrepository/reference/bitrepository-reference-settings/1.7-SNAPSHOT/bitrepository-reference-settings-1.7-SNAPSHOT.pom
[INFO] Installing /home/cibuild01/workspace/Bitrepository-******/bitrepository-reference-settings/target/bitrepository-reference-settings-1.7-SNAPSHOT-tests.jar to /home/cibuild01/.m2/repository/org/bitrepository/reference/bitrepository-reference-settings/1.7-SNAPSHOT/bitrepository-reference-settings-1.7-SNAPSHOT-tests.jar
[INFO] Installing /home/cibuild01/workspace/Bitrepository-******/bitrepository-reference-settings/target/bitrepository-reference-settings-1.7-SNAPSHOT-sources.jar to /home/cibuild01/.m2/repository/org/bitrepository/reference/bitrepository-reference-settings/1.7-SNAPSHOT/bitrepository-reference-settings-1.7-SNAPSHOT-sources.jar
[JENKINS] Archiving disabled
[INFO]                                                                         
[INFO] ------------------------------------------------------------------------
[INFO] Building Bitrepository Core 1.7-SNAPSHOT
[INFO] ------------------------------------------------------------------------
[INFO] 
[INFO] --- maven-resources-plugin:2.6:resources (default-resources) @ bitrepository-core ---
[INFO] Using 'UTF-8' encoding to copy filtered resources.
[INFO] Copying 2 resources
[INFO] 
[INFO] --- maven-compiler-plugin:3.1:compile (default-compile) @ bitrepository-core ---
[INFO] Changes detected - recompiling the module!
[INFO] Compiling 89 source files to /home/cibuild01/workspace/Bitrepository-******/bitrepository-core/target/classes
[INFO] 
[INFO] --- maven-resources-plugin:2.6:testResources (default-testResources) @ bitrepository-core ---
[INFO] Using 'UTF-8' encoding to copy filtered resources.
[INFO] Copying 11 resources
[INFO] 
[INFO] --- maven-compiler-plugin:3.1:testCompile (default-testCompile) @ bitrepository-core ---
[INFO] Nothing to compile - all classes are up to date
[INFO] 
[INFO] --- maven-surefire-plugin:2.17:test (default-test) @ bitrepository-core ---
[INFO] Tests are skipped.
[INFO] 
[INFO] --- maven-jar-plugin:2.4:jar (default-jar) @ bitrepository-core ---
[INFO] Building jar: /home/cibuild01/workspace/Bitrepository-******/bitrepository-core/target/bitrepository-core-1.7-SNAPSHOT.jar
[INFO] 
[INFO] --- maven-jar-plugin:2.4:test-jar (default) @ bitrepository-core ---
[INFO] Building jar: /home/cibuild01/workspace/Bitrepository-******/bitrepository-core/target/bitrepository-core-1.7-SNAPSHOT-tests.jar
[INFO] 
[INFO] --- maven-source-plugin:2.2.1:jar-no-fork (attach-sources-no-fork) @ bitrepository-core ---
[INFO] Building jar: /home/cibuild01/workspace/Bitrepository-******/bitrepository-core/target/bitrepository-core-1.7-SNAPSHOT-sources.jar
[INFO] 
[INFO] --- maven-install-plugin:2.5.1:install (default-install) @ bitrepository-core ---
[INFO] Installing /home/cibuild01/workspace/Bitrepository-******/bitrepository-core/target/bitrepository-core-1.7-SNAPSHOT.jar to /home/cibuild01/.m2/repository/org/bitrepository/reference/bitrepository-core/1.7-SNAPSHOT/bitrepository-core-1.7-SNAPSHOT.jar
[INFO] Installing /home/cibuild01/workspace/Bitrepository-******/bitrepository-core/pom.xml to /home/cibuild01/.m2/repository/org/bitrepository/reference/bitrepository-core/1.7-SNAPSHOT/bitrepository-core-1.7-SNAPSHOT.pom
[INFO] Installing /home/cibuild01/workspace/Bitrepository-******/bitrepository-core/target/bitrepository-core-1.7-SNAPSHOT-tests.jar to /home/cibuild01/.m2/repository/org/bitrepository/reference/bitrepository-core/1.7-SNAPSHOT/bitrepository-core-1.7-SNAPSHOT-tests.jar
[INFO] Installing /home/cibuild01/workspace/Bitrepository-******/bitrepository-core/target/bitrepository-core-1.7-SNAPSHOT-sources.jar to /home/cibuild01/.m2/repository/org/bitrepository/reference/bitrepository-core/1.7-SNAPSHOT/bitrepository-core-1.7-SNAPSHOT-sources.jar
[JENKINS] Archiving disabled
[INFO]                                                                         
[INFO] ------------------------------------------------------------------------
[INFO] Building Bitrepository Client 1.7-SNAPSHOT
[INFO] ------------------------------------------------------------------------
[INFO] 
[INFO] --- maven-resources-plugin:2.6:resources (default-resources) @ bitrepository-client ---
[INFO] Using 'UTF-8' encoding to copy filtered resources.
[INFO] Copying 4 resources
[INFO] 
[INFO] --- maven-compiler-plugin:3.1:compile (default-compile) @ bitrepository-client ---
[INFO] Changes detected - recompiling the module!
[INFO] Compiling 130 source files to /home/cibuild01/workspace/Bitrepository-******/bitrepository-client/target/classes
[WARNING] /home/cibuild01/workspace/Bitrepository-******/bitrepository-client/src/main/java/org/bitrepository/commandline/utils/CommandLineArgumentsHandler.java: /home/cibuild01/workspace/Bitrepository-******/bitrepository-client/src/main/java/org/bitrepository/commandline/utils/CommandLineArgumentsHandler.java uses or overrides a deprecated API.
[WARNING] /home/cibuild01/workspace/Bitrepository-******/bitrepository-client/src/main/java/org/bitrepository/commandline/utils/CommandLineArgumentsHandler.java: Recompile with -Xlint:deprecation for details.
[INFO] 
[INFO] --- maven-resources-plugin:2.6:testResources (default-testResources) @ bitrepository-client ---
[INFO] Using 'UTF-8' encoding to copy filtered resources.
[INFO] skip non existing resourceDirectory /home/cibuild01/workspace/Bitrepository-******/bitrepository-client/src/test/resources
[INFO] 
[INFO] --- maven-compiler-plugin:3.1:testCompile (default-testCompile) @ bitrepository-client ---
[INFO] Nothing to compile - all classes are up to date
[INFO] 
[INFO] --- maven-surefire-plugin:2.17:test (default-test) @ bitrepository-client ---
[INFO] Tests are skipped.
[INFO] 
[INFO] --- maven-jar-plugin:2.4:jar (default-jar) @ bitrepository-client ---
[INFO] Building jar: /home/cibuild01/workspace/Bitrepository-******/bitrepository-client/target/bitrepository-client-1.7-SNAPSHOT.jar
[INFO] 
[INFO] --- maven-jar-plugin:2.4:test-jar (default) @ bitrepository-client ---
[INFO] Building jar: /home/cibuild01/workspace/Bitrepository-******/bitrepository-client/target/bitrepository-client-1.7-SNAPSHOT-tests.jar
[INFO] 
[INFO] --- maven-source-plugin:2.2.1:jar-no-fork (attach-sources-no-fork) @ bitrepository-client ---
[INFO] Building jar: /home/cibuild01/workspace/Bitrepository-******/bitrepository-client/target/bitrepository-client-1.7-SNAPSHOT-sources.jar
[INFO] 
[INFO] --- maven-assembly-plugin:2.4:single (make-assembly) @ bitrepository-client ---
[INFO] Reading assembly descriptor: src/main/assembly/assembly.xml
[INFO] Building tar: /home/cibuild01/workspace/Bitrepository-******/bitrepository-client/target/bitrepository-client-1.7-SNAPSHOT-distribution.tar.gz
[INFO] 
[INFO] --- maven-install-plugin:2.5.1:install (default-install) @ bitrepository-client ---
[INFO] Installing /home/cibuild01/workspace/Bitrepository-******/bitrepository-client/target/bitrepository-client-1.7-SNAPSHOT.jar to /home/cibuild01/.m2/repository/org/bitrepository/reference/bitrepository-client/1.7-SNAPSHOT/bitrepository-client-1.7-SNAPSHOT.jar
[INFO] Installing /home/cibuild01/workspace/Bitrepository-******/bitrepository-client/pom.xml to /home/cibuild01/.m2/repository/org/bitrepository/reference/bitrepository-client/1.7-SNAPSHOT/bitrepository-client-1.7-SNAPSHOT.pom
[INFO] Installing /home/cibuild01/workspace/Bitrepository-******/bitrepository-client/target/bitrepository-client-1.7-SNAPSHOT-tests.jar to /home/cibuild01/.m2/repository/org/bitrepository/reference/bitrepository-client/1.7-SNAPSHOT/bitrepository-client-1.7-SNAPSHOT-tests.jar
[INFO] Installing /home/cibuild01/workspace/Bitrepository-******/bitrepository-client/target/bitrepository-client-1.7-SNAPSHOT-sources.jar to /home/cibuild01/.m2/repository/org/bitrepository/reference/bitrepository-client/1.7-SNAPSHOT/bitrepository-client-1.7-SNAPSHOT-sources.jar
[INFO] Installing /home/cibuild01/workspace/Bitrepository-******/bitrepository-client/target/bitrepository-client-1.7-SNAPSHOT-distribution.tar.gz to /home/cibuild01/.m2/repository/org/bitrepository/reference/bitrepository-client/1.7-SNAPSHOT/bitrepository-client-1.7-SNAPSHOT-distribution.tar.gz
[JENKINS] Archiving disabled
[INFO]                                                                         
[INFO] ------------------------------------------------------------------------
[INFO] Building Bitrepository Service 1.7-SNAPSHOT
[INFO] ------------------------------------------------------------------------
[INFO] 
[INFO] --- maven-resources-plugin:2.6:resources (default-resources) @ bitrepository-service ---
[INFO] Using 'UTF-8' encoding to copy filtered resources.
[INFO] Copying 7 resources
[INFO] 
[INFO] --- maven-compiler-plugin:3.1:compile (default-compile) @ bitrepository-service ---
[INFO] Changes detected - recompiling the module!
[INFO] Compiling 53 source files to /home/cibuild01/workspace/Bitrepository-******/bitrepository-service/target/classes
[INFO] 
[INFO] --- maven-resources-plugin:2.6:testResources (default-testResources) @ bitrepository-service ---
[INFO] Using 'UTF-8' encoding to copy filtered resources.
[INFO] Copying 3 resources
[INFO] 
[INFO] --- maven-compiler-plugin:3.1:testCompile (default-testCompile) @ bitrepository-service ---
[INFO] Nothing to compile - all classes are up to date
[INFO] 
[INFO] --- maven-surefire-plugin:2.17:test (default-test) @ bitrepository-service ---
[INFO] Tests are skipped.
[INFO] 
[INFO] --- maven-jar-plugin:2.4:jar (default-jar) @ bitrepository-service ---
[INFO] Building jar: /home/cibuild01/workspace/Bitrepository-******/bitrepository-service/target/bitrepository-service-1.7-SNAPSHOT.jar
[INFO] 
[INFO] --- maven-jar-plugin:2.4:test-jar (default) @ bitrepository-service ---
[INFO] Building jar: /home/cibuild01/workspace/Bitrepository-******/bitrepository-service/target/bitrepository-service-1.7-SNAPSHOT-tests.jar
[INFO] 
[INFO] --- maven-source-plugin:2.2.1:jar-no-fork (attach-sources-no-fork) @ bitrepository-service ---
[INFO] Building jar: /home/cibuild01/workspace/Bitrepository-******/bitrepository-service/target/bitrepository-service-1.7-SNAPSHOT-sources.jar
[INFO] 
[INFO] --- maven-install-plugin:2.5.1:install (default-install) @ bitrepository-service ---
[INFO] Installing /home/cibuild01/workspace/Bitrepository-******/bitrepository-service/target/bitrepository-service-1.7-SNAPSHOT.jar to /home/cibuild01/.m2/repository/org/bitrepository/reference/bitrepository-service/1.7-SNAPSHOT/bitrepository-service-1.7-SNAPSHOT.jar
[INFO] Installing /home/cibuild01/workspace/Bitrepository-******/bitrepository-service/pom.xml to /home/cibuild01/.m2/repository/org/bitrepository/reference/bitrepository-service/1.7-SNAPSHOT/bitrepository-service-1.7-SNAPSHOT.pom
[INFO] Installing /home/cibuild01/workspace/Bitrepository-******/bitrepository-service/target/bitrepository-service-1.7-SNAPSHOT-tests.jar to /home/cibuild01/.m2/repository/org/bitrepository/reference/bitrepository-service/1.7-SNAPSHOT/bitrepository-service-1.7-SNAPSHOT-tests.jar
[INFO] Installing /home/cibuild01/workspace/Bitrepository-******/bitrepository-service/target/bitrepository-service-1.7-SNAPSHOT-sources.jar to /home/cibuild01/.m2/repository/org/bitrepository/reference/bitrepository-service/1.7-SNAPSHOT/bitrepository-service-1.7-SNAPSHOT-sources.jar
[JENKINS] Archiving disabled
[INFO]                                                                         
[INFO] ------------------------------------------------------------------------
[INFO] Building Bitrepository Integrity Service 1.7-SNAPSHOT
[INFO] ------------------------------------------------------------------------
[INFO] 
[INFO] --- maven-resources-plugin:2.6:resources (default-resources) @ bitrepository-integrity-service ---
[INFO] Using 'UTF-8' encoding to copy filtered resources.
[INFO] Copying 12 resources
[INFO] 
[INFO] --- maven-compiler-plugin:3.1:compile (default-compile) @ bitrepository-integrity-service ---
[INFO] Changes detected - recompiling the module!
[INFO] Compiling 67 source files to /home/cibuild01/workspace/Bitrepository-******/bitrepository-integrity-service/target/classes
[INFO] 
[INFO] --- maven-resources-plugin:2.6:testResources (default-testResources) @ bitrepository-integrity-service ---
[INFO] Using 'UTF-8' encoding to copy filtered resources.
[INFO] Copying 3 resources
[INFO] 
[INFO] --- maven-compiler-plugin:3.1:testCompile (default-testCompile) @ bitrepository-integrity-service ---
[INFO] Changes detected - recompiling the module!
[INFO] Compiling 24 source files to /home/cibuild01/workspace/Bitrepository-******/bitrepository-integrity-service/target/test-classes
[INFO] 
[INFO] --- maven-surefire-plugin:2.17:test (default-test) @ bitrepository-integrity-service ---
[INFO] Tests are skipped.
[INFO] 
[INFO] --- maven-war-plugin:2.4:war (default-war) @ bitrepository-integrity-service ---
[INFO] Packaging webapp
[INFO] Assembling webapp [bitrepository-integrity-service] in [/home/cibuild01/workspace/Bitrepository-******/bitrepository-integrity-service/target/bitrepository-integrity-service-1.7-SNAPSHOT]
[INFO] Processing war project
[INFO] Copying webapp resources [/home/cibuild01/workspace/Bitrepository-******/bitrepository-integrity-service/src/main/webapp]
[INFO] Webapp assembled in [277 msecs]
[INFO] Building war: /home/cibuild01/workspace/Bitrepository-******/bitrepository-integrity-service/target/bitrepository-integrity-service-1.7-SNAPSHOT.war
[INFO] 
[INFO] --- maven-jar-plugin:2.4:test-jar (default) @ bitrepository-integrity-service ---
[INFO] Building jar: /home/cibuild01/workspace/Bitrepository-******/bitrepository-integrity-service/target/bitrepository-integrity-service-1.7-SNAPSHOT-tests.jar
[INFO] 
[INFO] --- maven-source-plugin:2.2.1:jar-no-fork (attach-sources-no-fork) @ bitrepository-integrity-service ---
[INFO] Building jar: /home/cibuild01/workspace/Bitrepository-******/bitrepository-integrity-service/target/bitrepository-integrity-service-1.7-SNAPSHOT-sources.jar
[INFO] 
[INFO] --- maven-assembly-plugin:2.4:single (distribution) @ bitrepository-integrity-service ---
[INFO] Reading assembly descriptor: src/main/assembly/assembly.xml
[INFO] Building tar: /home/cibuild01/workspace/Bitrepository-******/bitrepository-integrity-service/target/bitrepository-integrity-service-1.7-SNAPSHOT-distribution.tar.gz
[INFO] 
[INFO] --- maven-install-plugin:2.5.1:install (default-install) @ bitrepository-integrity-service ---
[INFO] Installing /home/cibuild01/workspace/Bitrepository-******/bitrepository-integrity-service/target/bitrepository-integrity-service-1.7-SNAPSHOT.war to /home/cibuild01/.m2/repository/org/bitrepository/reference/bitrepository-integrity-service/1.7-SNAPSHOT/bitrepository-integrity-service-1.7-SNAPSHOT.war
[INFO] Installing /home/cibuild01/workspace/Bitrepository-******/bitrepository-integrity-service/pom.xml to /home/cibuild01/.m2/repository/org/bitrepository/reference/bitrepository-integrity-service/1.7-SNAPSHOT/bitrepository-integrity-service-1.7-SNAPSHOT.pom
[INFO] Installing /home/cibuild01/workspace/Bitrepository-******/bitrepository-integrity-service/target/bitrepository-integrity-service-1.7-SNAPSHOT-tests.jar to /home/cibuild01/.m2/repository/org/bitrepository/reference/bitrepository-integrity-service/1.7-SNAPSHOT/bitrepository-integrity-service-1.7-SNAPSHOT-tests.jar
[INFO] Installing /home/cibuild01/workspace/Bitrepository-******/bitrepository-integrity-service/target/bitrepository-integrity-service-1.7-SNAPSHOT-sources.jar to /home/cibuild01/.m2/repository/org/bitrepository/reference/bitrepository-integrity-service/1.7-SNAPSHOT/bitrepository-integrity-service-1.7-SNAPSHOT-sources.jar
[INFO] Installing /home/cibuild01/workspace/Bitrepository-******/bitrepository-integrity-service/target/bitrepository-integrity-service-1.7-SNAPSHOT-distribution.tar.gz to /home/cibuild01/.m2/repository/org/bitrepository/reference/bitrepository-integrity-service/1.7-SNAPSHOT/bitrepository-integrity-service-1.7-SNAPSHOT-distribution.tar.gz
[JENKINS] Archiving disabled
[INFO]                                                                         
[INFO] ------------------------------------------------------------------------
[INFO] Building Bitrepository Alarm Service 1.7-SNAPSHOT
[INFO] ------------------------------------------------------------------------
[INFO] 
[INFO] --- maven-resources-plugin:2.6:resources (default-resources) @ bitrepository-alarm-service ---
[INFO] Using 'UTF-8' encoding to copy filtered resources.
[INFO] Copying 5 resources
[INFO] 
[INFO] --- maven-compiler-plugin:3.1:compile (default-compile) @ bitrepository-alarm-service ---
[INFO] Changes detected - recompiling the module!
[INFO] Compiling 26 source files to /home/cibuild01/workspace/Bitrepository-******/bitrepository-alarm-service/target/classes
[INFO] 
[INFO] --- maven-resources-plugin:2.6:testResources (default-testResources) @ bitrepository-alarm-service ---
[INFO] Using 'UTF-8' encoding to copy filtered resources.
[INFO] Copying 2 resources
[INFO] 
[INFO] --- maven-compiler-plugin:3.1:testCompile (default-testCompile) @ bitrepository-alarm-service ---
[INFO] Nothing to compile - all classes are up to date
[INFO] 
[INFO] --- maven-surefire-plugin:2.17:test (default-test) @ bitrepository-alarm-service ---
[INFO] Tests are skipped.
[INFO] 
[INFO] --- maven-war-plugin:2.4:war (default-war) @ bitrepository-alarm-service ---
[INFO] Packaging webapp
[INFO] Assembling webapp [bitrepository-alarm-service] in [/home/cibuild01/workspace/Bitrepository-******/bitrepository-alarm-service/target/bitrepository-alarm-service-1.7-SNAPSHOT]
[INFO] Processing war project
[INFO] Copying webapp resources [/home/cibuild01/workspace/Bitrepository-******/bitrepository-alarm-service/src/main/webapp]
[INFO] Webapp assembled in [160 msecs]
[INFO] Building war: /home/cibuild01/workspace/Bitrepository-******/bitrepository-alarm-service/target/bitrepository-alarm-service-1.7-SNAPSHOT.war
[INFO] 
[INFO] --- maven-jar-plugin:2.4:test-jar (default) @ bitrepository-alarm-service ---
[INFO] Building jar: /home/cibuild01/workspace/Bitrepository-******/bitrepository-alarm-service/target/bitrepository-alarm-service-1.7-SNAPSHOT-tests.jar
[INFO] 
[INFO] --- maven-source-plugin:2.2.1:jar-no-fork (attach-sources-no-fork) @ bitrepository-alarm-service ---
[INFO] Building jar: /home/cibuild01/workspace/Bitrepository-******/bitrepository-alarm-service/target/bitrepository-alarm-service-1.7-SNAPSHOT-sources.jar
[INFO] 
[INFO] --- maven-assembly-plugin:2.4:single (distribution) @ bitrepository-alarm-service ---
[INFO] Reading assembly descriptor: src/main/assembly/assembly.xml
[INFO] Building tar: /home/cibuild01/workspace/Bitrepository-******/bitrepository-alarm-service/target/bitrepository-alarm-service-1.7-SNAPSHOT-distribution.tar.gz
[INFO] 
[INFO] --- maven-install-plugin:2.5.1:install (default-install) @ bitrepository-alarm-service ---
[INFO] Installing /home/cibuild01/workspace/Bitrepository-******/bitrepository-alarm-service/target/bitrepository-alarm-service-1.7-SNAPSHOT.war to /home/cibuild01/.m2/repository/org/bitrepository/reference/bitrepository-alarm-service/1.7-SNAPSHOT/bitrepository-alarm-service-1.7-SNAPSHOT.war
[INFO] Installing /home/cibuild01/workspace/Bitrepository-******/bitrepository-alarm-service/pom.xml to /home/cibuild01/.m2/repository/org/bitrepository/reference/bitrepository-alarm-service/1.7-SNAPSHOT/bitrepository-alarm-service-1.7-SNAPSHOT.pom
[INFO] Installing /home/cibuild01/workspace/Bitrepository-******/bitrepository-alarm-service/target/bitrepository-alarm-service-1.7-SNAPSHOT-tests.jar to /home/cibuild01/.m2/repository/org/bitrepository/reference/bitrepository-alarm-service/1.7-SNAPSHOT/bitrepository-alarm-service-1.7-SNAPSHOT-tests.jar
[INFO] Installing /home/cibuild01/workspace/Bitrepository-******/bitrepository-alarm-service/target/bitrepository-alarm-service-1.7-SNAPSHOT-sources.jar to /home/cibuild01/.m2/repository/org/bitrepository/reference/bitrepository-alarm-service/1.7-SNAPSHOT/bitrepository-alarm-service-1.7-SNAPSHOT-sources.jar
[INFO] Installing /home/cibuild01/workspace/Bitrepository-******/bitrepository-alarm-service/target/bitrepository-alarm-service-1.7-SNAPSHOT-distribution.tar.gz to /home/cibuild01/.m2/repository/org/bitrepository/reference/bitrepository-alarm-service/1.7-SNAPSHOT/bitrepository-alarm-service-1.7-SNAPSHOT-distribution.tar.gz
[JENKINS] Archiving disabled
[INFO]                                                                         
[INFO] ------------------------------------------------------------------------
[INFO] Building Bitrepository Audit Trail Service 1.7-SNAPSHOT
[INFO] ------------------------------------------------------------------------
[INFO] 
[INFO] --- maven-resources-plugin:2.6:resources (default-resources) @ bitrepository-audit-trail-service ---
[INFO] Using 'UTF-8' encoding to copy filtered resources.
[INFO] Copying 9 resources
[INFO] 
[INFO] --- maven-compiler-plugin:3.1:compile (default-compile) @ bitrepository-audit-trail-service ---
[INFO] Changes detected - recompiling the module!
[INFO] Compiling 23 source files to /home/cibuild01/workspace/Bitrepository-******/bitrepository-audit-trail-service/target/classes
[INFO] 
[INFO] --- maven-resources-plugin:2.6:testResources (default-testResources) @ bitrepository-audit-trail-service ---
[INFO] Using 'UTF-8' encoding to copy filtered resources.
[INFO] Copying 3 resources
[INFO] 
[INFO] --- maven-compiler-plugin:3.1:testCompile (default-testCompile) @ bitrepository-audit-trail-service ---
[INFO] Nothing to compile - all classes are up to date
[INFO] 
[INFO] --- maven-surefire-plugin:2.17:test (default-test) @ bitrepository-audit-trail-service ---
[INFO] Tests are skipped.
[INFO] 
[INFO] --- maven-war-plugin:2.4:war (default-war) @ bitrepository-audit-trail-service ---
[INFO] Packaging webapp
[INFO] Assembling webapp [bitrepository-audit-trail-service] in [/home/cibuild01/workspace/Bitrepository-******/bitrepository-audit-trail-service/target/bitrepository-audit-trail-service-1.7-SNAPSHOT]
[INFO] Processing war project
[INFO] Copying webapp resources [/home/cibuild01/workspace/Bitrepository-******/bitrepository-audit-trail-service/src/main/webapp]
[INFO] Webapp assembled in [207 msecs]
[INFO] Building war: /home/cibuild01/workspace/Bitrepository-******/bitrepository-audit-trail-service/target/bitrepository-audit-trail-service-1.7-SNAPSHOT.war
[INFO] 
[INFO] --- maven-jar-plugin:2.4:test-jar (default) @ bitrepository-audit-trail-service ---
[INFO] Building jar: /home/cibuild01/workspace/Bitrepository-******/bitrepository-audit-trail-service/target/bitrepository-audit-trail-service-1.7-SNAPSHOT-tests.jar
[INFO] 
[INFO] --- maven-source-plugin:2.2.1:jar-no-fork (attach-sources-no-fork) @ bitrepository-audit-trail-service ---
[INFO] Building jar: /home/cibuild01/workspace/Bitrepository-******/bitrepository-audit-trail-service/target/bitrepository-audit-trail-service-1.7-SNAPSHOT-sources.jar
[INFO] 
[INFO] --- maven-assembly-plugin:2.4:single (distribution) @ bitrepository-audit-trail-service ---
[INFO] Reading assembly descriptor: src/main/assembly/assembly.xml
[INFO] Building tar: /home/cibuild01/workspace/Bitrepository-******/bitrepository-audit-trail-service/target/bitrepository-audit-trail-service-1.7-SNAPSHOT-distribution.tar.gz
[INFO] 
[INFO] --- maven-install-plugin:2.5.1:install (default-install) @ bitrepository-audit-trail-service ---
[INFO] Installing /home/cibuild01/workspace/Bitrepository-******/bitrepository-audit-trail-service/target/bitrepository-audit-trail-service-1.7-SNAPSHOT.war to /home/cibuild01/.m2/repository/org/bitrepository/reference/bitrepository-audit-trail-service/1.7-SNAPSHOT/bitrepository-audit-trail-service-1.7-SNAPSHOT.war
[INFO] Installing /home/cibuild01/workspace/Bitrepository-******/bitrepository-audit-trail-service/pom.xml to /home/cibuild01/.m2/repository/org/bitrepository/reference/bitrepository-audit-trail-service/1.7-SNAPSHOT/bitrepository-audit-trail-service-1.7-SNAPSHOT.pom
[INFO] Installing /home/cibuild01/workspace/Bitrepository-******/bitrepository-audit-trail-service/target/bitrepository-audit-trail-service-1.7-SNAPSHOT-tests.jar to /home/cibuild01/.m2/repository/org/bitrepository/reference/bitrepository-audit-trail-service/1.7-SNAPSHOT/bitrepository-audit-trail-service-1.7-SNAPSHOT-tests.jar
[INFO] Installing /home/cibuild01/workspace/Bitrepository-******/bitrepository-audit-trail-service/target/bitrepository-audit-trail-service-1.7-SNAPSHOT-sources.jar to /home/cibuild01/.m2/repository/org/bitrepository/reference/bitrepository-audit-trail-service/1.7-SNAPSHOT/bitrepository-audit-trail-service-1.7-SNAPSHOT-sources.jar
[INFO] Installing /home/cibuild01/workspace/Bitrepository-******/bitrepository-audit-trail-service/target/bitrepository-audit-trail-service-1.7-SNAPSHOT-distribution.tar.gz to /home/cibuild01/.m2/repository/org/bitrepository/reference/bitrepository-audit-trail-service/1.7-SNAPSHOT/bitrepository-audit-trail-service-1.7-SNAPSHOT-distribution.tar.gz
[JENKINS] Archiving disabled
[INFO]                                                                         
[INFO] ------------------------------------------------------------------------
[INFO] Building Bitrepository Reference Pillar 1.7-SNAPSHOT
[INFO] ------------------------------------------------------------------------
[INFO] 
[INFO] --- maven-dependency-plugin:2.8:unpack-dependencies (unpack-shared-sqlscripts) @ bitrepository-reference-pillar ---
[INFO] Unpacking /home/cibuild01/workspace/Bitrepository-******/bitrepository-service/target/bitrepository-service-1.7-SNAPSHOT.jar to /home/cibuild01/workspace/Bitrepository-******/bitrepository-reference-pillar/target/classes with includes "**/*.sql" and excludes ""
[INFO] 
[INFO] --- maven-resources-plugin:2.6:resources (default-resources) @ bitrepository-reference-pillar ---
[INFO] Using 'UTF-8' encoding to copy filtered resources.
[INFO] Copying 10 resources
[INFO] 
[INFO] --- maven-compiler-plugin:3.1:compile (default-compile) @ bitrepository-reference-pillar ---
[INFO] Changes detected - recompiling the module!
[INFO] Compiling 44 source files to /home/cibuild01/workspace/Bitrepository-******/bitrepository-reference-pillar/target/classes
[INFO] 
[INFO] --- maven-resources-plugin:2.6:testResources (default-testResources) @ bitrepository-reference-pillar ---
[INFO] Using 'UTF-8' encoding to copy filtered resources.
[INFO] Copying 12 resources
[INFO] 
[INFO] --- maven-compiler-plugin:3.1:testCompile (default-testCompile) @ bitrepository-reference-pillar ---
[INFO] Nothing to compile - all classes are up to date
[INFO] 
[INFO] --- maven-surefire-plugin:2.17:test (default-test) @ bitrepository-reference-pillar ---
[INFO] Tests are skipped.
[INFO] 
[INFO] --- maven-jar-plugin:2.4:jar (default-jar) @ bitrepository-reference-pillar ---
[INFO] Building jar: /home/cibuild01/workspace/Bitrepository-******/bitrepository-reference-pillar/target/bitrepository-reference-pillar-1.7-SNAPSHOT.jar
[INFO] 
[INFO] --- maven-jar-plugin:2.4:test-jar (default) @ bitrepository-reference-pillar ---
[INFO] Building jar: /home/cibuild01/workspace/Bitrepository-******/bitrepository-reference-pillar/target/bitrepository-reference-pillar-1.7-SNAPSHOT-tests.jar
[INFO] 
[INFO] --- maven-source-plugin:2.2.1:jar-no-fork (attach-sources-no-fork) @ bitrepository-reference-pillar ---
[INFO] Building jar: /home/cibuild01/workspace/Bitrepository-******/bitrepository-reference-pillar/target/bitrepository-reference-pillar-1.7-SNAPSHOT-sources.jar
[INFO] 
[INFO] --- maven-assembly-plugin:2.4:single (distribution) @ bitrepository-reference-pillar ---
[INFO] Reading assembly descriptor: src/main/assembly/assembly.xml
[INFO] Reading assembly descriptor: src/test/assembly/assembly.xml
[INFO] Reading assembly descriptor: src/main/assembly/deploy-assembly.xml
[INFO] Reading assembly descriptor: src/test/assembly/test-deploy-assembly.xml
[INFO] Building tar: /home/cibuild01/workspace/Bitrepository-******/bitrepository-reference-pillar/target/bitrepository-reference-pillar-1.7-SNAPSHOT-distribution.tar.gz
[INFO] Building tar: /home/cibuild01/workspace/Bitrepository-******/bitrepository-reference-pillar/target/bitrepository-reference-pillar-1.7-SNAPSHOT-acceptance-test.tar.gz
[WARNING] Entry: bitrepository-reference-pillar-1.7-SNAPSHOT/lib/bitrepository-reference-pillar-1.7-SNAPSHOT-tests.jar longer than 100 characters.
[WARNING] Resulting tar file can only be processed successfully by GNU compatible tar commands
[INFO] Building tar: /home/cibuild01/workspace/Bitrepository-******/bitrepository-reference-pillar/target/bitrepository-reference-pillar-1.7-SNAPSHOT-deploy.tar.gz
[INFO] Building tar: /home/cibuild01/workspace/Bitrepository-******/bitrepository-reference-pillar/target/bitrepository-reference-pillar-1.7-SNAPSHOT-acceptance-test-deploy.tar.gz
[INFO] 
[INFO] --- maven-install-plugin:2.5.1:install (default-install) @ bitrepository-reference-pillar ---
[INFO] Installing /home/cibuild01/workspace/Bitrepository-******/bitrepository-reference-pillar/target/bitrepository-reference-pillar-1.7-SNAPSHOT.jar to /home/cibuild01/.m2/repository/org/bitrepository/reference/bitrepository-reference-pillar/1.7-SNAPSHOT/bitrepository-reference-pillar-1.7-SNAPSHOT.jar
[INFO] Installing /home/cibuild01/workspace/Bitrepository-******/bitrepository-reference-pillar/pom.xml to /home/cibuild01/.m2/repository/org/bitrepository/reference/bitrepository-reference-pillar/1.7-SNAPSHOT/bitrepository-reference-pillar-1.7-SNAPSHOT.pom
[INFO] Installing /home/cibuild01/workspace/Bitrepository-******/bitrepository-reference-pillar/target/bitrepository-reference-pillar-1.7-SNAPSHOT-tests.jar to /home/cibuild01/.m2/repository/org/bitrepository/reference/bitrepository-reference-pillar/1.7-SNAPSHOT/bitrepository-reference-pillar-1.7-SNAPSHOT-tests.jar
[INFO] Installing /home/cibuild01/workspace/Bitrepository-******/bitrepository-reference-pillar/target/bitrepository-reference-pillar-1.7-SNAPSHOT-sources.jar to /home/cibuild01/.m2/repository/org/bitrepository/reference/bitrepository-reference-pillar/1.7-SNAPSHOT/bitrepository-reference-pillar-1.7-SNAPSHOT-sources.jar
[INFO] Installing /home/cibuild01/workspace/Bitrepository-******/bitrepository-reference-pillar/target/bitrepository-reference-pillar-1.7-SNAPSHOT-distribution.tar.gz to /home/cibuild01/.m2/repository/org/bitrepository/reference/bitrepository-reference-pillar/1.7-SNAPSHOT/bitrepository-reference-pillar-1.7-SNAPSHOT-distribution.tar.gz
[INFO] Installing /home/cibuild01/workspace/Bitrepository-******/bitrepository-reference-pillar/target/bitrepository-reference-pillar-1.7-SNAPSHOT-acceptance-test.tar.gz to /home/cibuild01/.m2/repository/org/bitrepository/reference/bitrepository-reference-pillar/1.7-SNAPSHOT/bitrepository-reference-pillar-1.7-SNAPSHOT-acceptance-test.tar.gz
[INFO] Installing /home/cibuild01/workspace/Bitrepository-******/bitrepository-reference-pillar/target/bitrepository-reference-pillar-1.7-SNAPSHOT-deploy.tar.gz to /home/cibuild01/.m2/repository/org/bitrepository/reference/bitrepository-reference-pillar/1.7-SNAPSHOT/bitrepository-reference-pillar-1.7-SNAPSHOT-deploy.tar.gz
[INFO] Installing /home/cibuild01/workspace/Bitrepository-******/bitrepository-reference-pillar/target/bitrepository-reference-pillar-1.7-SNAPSHOT-acceptance-test-deploy.tar.gz to /home/cibuild01/.m2/repository/org/bitrepository/reference/bitrepository-reference-pillar/1.7-SNAPSHOT/bitrepository-reference-pillar-1.7-SNAPSHOT-acceptance-test-deploy.tar.gz
[JENKINS] Archiving disabled
[INFO]                                                                         
[INFO] ------------------------------------------------------------------------
[INFO] Building Bitrepository Monitoring Service 1.7-SNAPSHOT
[INFO] ------------------------------------------------------------------------
[INFO] 
[INFO] --- maven-resources-plugin:2.6:resources (default-resources) @ bitrepository-monitoring-service ---
[INFO] Using 'UTF-8' encoding to copy filtered resources.
[INFO] skip non existing resourceDirectory /home/cibuild01/workspace/Bitrepository-******/bitrepository-monitoring-service/src/main/resources
[INFO] 
[INFO] --- maven-compiler-plugin:3.1:compile (default-compile) @ bitrepository-monitoring-service ---
[INFO] Changes detected - recompiling the module!
[INFO] Compiling 14 source files to /home/cibuild01/workspace/Bitrepository-******/bitrepository-monitoring-service/target/classes
[INFO] 
[INFO] --- maven-resources-plugin:2.6:testResources (default-testResources) @ bitrepository-monitoring-service ---
[INFO] Using 'UTF-8' encoding to copy filtered resources.
[INFO] skip non existing resourceDirectory /home/cibuild01/workspace/Bitrepository-******/bitrepository-monitoring-service/src/test/resources
[INFO] 
[INFO] --- maven-compiler-plugin:3.1:testCompile (default-testCompile) @ bitrepository-monitoring-service ---
[INFO] Nothing to compile - all classes are up to date
[INFO] 
[INFO] --- maven-surefire-plugin:2.17:test (default-test) @ bitrepository-monitoring-service ---
[INFO] Tests are skipped.
[INFO] 
[INFO] --- maven-war-plugin:2.4:war (default-war) @ bitrepository-monitoring-service ---
[INFO] Packaging webapp
[INFO] Assembling webapp [bitrepository-monitoring-service] in [/home/cibuild01/workspace/Bitrepository-******/bitrepository-monitoring-service/target/bitrepository-monitoring-service-1.7-SNAPSHOT]
[INFO] Processing war project
[INFO] Copying webapp resources [/home/cibuild01/workspace/Bitrepository-******/bitrepository-monitoring-service/src/main/webapp]
[INFO] Webapp assembled in [93 msecs]
[INFO] Building war: /home/cibuild01/workspace/Bitrepository-******/bitrepository-monitoring-service/target/bitrepository-monitoring-service-1.7-SNAPSHOT.war
[INFO] 
[INFO] --- maven-jar-plugin:2.4:test-jar (default) @ bitrepository-monitoring-service ---
[INFO] Building jar: /home/cibuild01/workspace/Bitrepository-******/bitrepository-monitoring-service/target/bitrepository-monitoring-service-1.7-SNAPSHOT-tests.jar
[INFO] 
[INFO] --- maven-source-plugin:2.2.1:jar-no-fork (attach-sources-no-fork) @ bitrepository-monitoring-service ---
[INFO] Building jar: /home/cibuild01/workspace/Bitrepository-******/bitrepository-monitoring-service/target/bitrepository-monitoring-service-1.7-SNAPSHOT-sources.jar
[INFO] 
[INFO] --- maven-assembly-plugin:2.4:single (distribution) @ bitrepository-monitoring-service ---
[INFO] Reading assembly descriptor: src/main/assembly/assembly.xml
[INFO] Building tar: /home/cibuild01/workspace/Bitrepository-******/bitrepository-monitoring-service/target/bitrepository-monitoring-service-1.7-SNAPSHOT-distribution.tar.gz
[INFO] 
[INFO] --- maven-install-plugin:2.5.1:install (default-install) @ bitrepository-monitoring-service ---
[INFO] Installing /home/cibuild01/workspace/Bitrepository-******/bitrepository-monitoring-service/target/bitrepository-monitoring-service-1.7-SNAPSHOT.war to /home/cibuild01/.m2/repository/org/bitrepository/reference/bitrepository-monitoring-service/1.7-SNAPSHOT/bitrepository-monitoring-service-1.7-SNAPSHOT.war
[INFO] Installing /home/cibuild01/workspace/Bitrepository-******/bitrepository-monitoring-service/pom.xml to /home/cibuild01/.m2/repository/org/bitrepository/reference/bitrepository-monitoring-service/1.7-SNAPSHOT/bitrepository-monitoring-service-1.7-SNAPSHOT.pom
[INFO] Installing /home/cibuild01/workspace/Bitrepository-******/bitrepository-monitoring-service/target/bitrepository-monitoring-service-1.7-SNAPSHOT-tests.jar to /home/cibuild01/.m2/repository/org/bitrepository/reference/bitrepository-monitoring-service/1.7-SNAPSHOT/bitrepository-monitoring-service-1.7-SNAPSHOT-tests.jar
[INFO] Installing /home/cibuild01/workspace/Bitrepository-******/bitrepository-monitoring-service/target/bitrepository-monitoring-service-1.7-SNAPSHOT-sources.jar to /home/cibuild01/.m2/repository/org/bitrepository/reference/bitrepository-monitoring-service/1.7-SNAPSHOT/bitrepository-monitoring-service-1.7-SNAPSHOT-sources.jar
[INFO] Installing /home/cibuild01/workspace/Bitrepository-******/bitrepository-monitoring-service/target/bitrepository-monitoring-service-1.7-SNAPSHOT-distribution.tar.gz to /home/cibuild01/.m2/repository/org/bitrepository/reference/bitrepository-monitoring-service/1.7-SNAPSHOT/bitrepository-monitoring-service-1.7-SNAPSHOT-distribution.tar.gz
[JENKINS] Archiving disabled
[INFO]                                                                         
[INFO] ------------------------------------------------------------------------
[INFO] Building Bitrepository Webclient 1.7-SNAPSHOT
[INFO] ------------------------------------------------------------------------
[INFO] 
[INFO] --- maven-resources-plugin:2.6:resources (default-resources) @ bitrepository-webclient ---
[INFO] Using 'UTF-8' encoding to copy filtered resources.
[INFO] Copying 2 resources
[INFO] 
[INFO] --- maven-compiler-plugin:3.1:compile (default-compile) @ bitrepository-webclient ---
[INFO] Changes detected - recompiling the module!
[INFO] Compiling 12 source files to /home/cibuild01/workspace/Bitrepository-******/bitrepository-webclient/target/classes
[INFO] 
[INFO] --- maven-resources-plugin:2.6:testResources (default-testResources) @ bitrepository-webclient ---
[INFO] Using 'UTF-8' encoding to copy filtered resources.
[INFO] skip non existing resourceDirectory /home/cibuild01/workspace/Bitrepository-******/bitrepository-webclient/src/test/resources
[INFO] 
[INFO] --- maven-compiler-plugin:3.1:testCompile (default-testCompile) @ bitrepository-webclient ---
[INFO] No sources to compile
[INFO] 
[INFO] --- maven-surefire-plugin:2.17:test (default-test) @ bitrepository-webclient ---
[INFO] Tests are skipped.
[INFO] 
[INFO] --- maven-war-plugin:2.4:war (default-war) @ bitrepository-webclient ---
[INFO] Packaging webapp
[INFO] Assembling webapp [bitrepository-webclient] in [/home/cibuild01/workspace/Bitrepository-******/bitrepository-webclient/target/bitrepository-webclient-1.7-SNAPSHOT]
[INFO] Processing war project
[INFO] Copying webapp webResources [/home/cibuild01/workspace/Bitrepository-******/bitrepository-webclient/src/main/webapp] to [/home/cibuild01/workspace/Bitrepository-******/bitrepository-webclient/target/bitrepository-webclient-1.7-SNAPSHOT]
[INFO] Copying webapp resources [/home/cibuild01/workspace/Bitrepository-******/bitrepository-webclient/src/main/webapp]
[JENKINS] Archiving disabled
[INFO] Webapp assembled in [2258 msecs]
[INFO] Building war: /home/cibuild01/workspace/Bitrepository-******/bitrepository-webclient/target/bitrepository-webclient-1.7-SNAPSHOT.war
[INFO] 
[INFO] --- maven-jar-plugin:2.4:test-jar (default) @ bitrepository-webclient ---
[WARNING] JAR will be empty - no content was marked for inclusion!
[INFO] Building jar: /home/cibuild01/workspace/Bitrepository-******/bitrepository-webclient/target/bitrepository-webclient-1.7-SNAPSHOT-tests.jar
[INFO] 
[INFO] --- maven-source-plugin:2.2.1:jar-no-fork (attach-sources-no-fork) @ bitrepository-webclient ---
[INFO] Building jar: /home/cibuild01/workspace/Bitrepository-******/bitrepository-webclient/target/bitrepository-webclient-1.7-SNAPSHOT-sources.jar
[INFO] 
[INFO] --- maven-assembly-plugin:2.4:single (distribution) @ bitrepository-webclient ---
[INFO] Reading assembly descriptor: src/main/assembly/assembly.xml
[INFO] Building tar: /home/cibuild01/workspace/Bitrepository-******/bitrepository-webclient/target/bitrepository-webclient-1.7-SNAPSHOT-distribution.tar.gz
[INFO] 
[INFO] --- maven-install-plugin:2.5.1:install (default-install) @ bitrepository-webclient ---
[INFO] Installing /home/cibuild01/workspace/Bitrepository-******/bitrepository-webclient/target/bitrepository-webclient-1.7-SNAPSHOT.war to /home/cibuild01/.m2/repository/org/bitrepository/reference/bitrepository-webclient/1.7-SNAPSHOT/bitrepository-webclient-1.7-SNAPSHOT.war
[INFO] Installing /home/cibuild01/workspace/Bitrepository-******/bitrepository-webclient/pom.xml to /home/cibuild01/.m2/repository/org/bitrepository/reference/bitrepository-webclient/1.7-SNAPSHOT/bitrepository-webclient-1.7-SNAPSHOT.pom
[INFO] Installing /home/cibuild01/workspace/Bitrepository-******/bitrepository-webclient/target/bitrepository-webclient-1.7-SNAPSHOT-tests.jar to /home/cibuild01/.m2/repository/org/bitrepository/reference/bitrepository-webclient/1.7-SNAPSHOT/bitrepository-webclient-1.7-SNAPSHOT-tests.jar
[INFO] Installing /home/cibuild01/workspace/Bitrepository-******/bitrepository-webclient/target/bitrepository-webclient-1.7-SNAPSHOT-sources.jar to /home/cibuild01/.m2/repository/org/bitrepository/reference/bitrepository-webclient/1.7-SNAPSHOT/bitrepository-webclient-1.7-SNAPSHOT-sources.jar
[INFO] Installing /home/cibuild01/workspace/Bitrepository-******/bitrepository-webclient/target/bitrepository-webclient-1.7-SNAPSHOT-distribution.tar.gz to /home/cibuild01/.m2/repository/org/bitrepository/reference/bitrepository-webclient/1.7-SNAPSHOT/bitrepository-webclient-1.7-SNAPSHOT-distribution.tar.gz
[INFO]                                                                         
[INFO] ------------------------------------------------------------------------
[INFO] Building Bitrepository Integration 1.7-SNAPSHOT
[INFO] ------------------------------------------------------------------------
[INFO] 
[INFO] --- maven-resources-plugin:2.6:resources (default-resources) @ bitrepository-integration ---
[INFO] Using 'UTF-8' encoding to copy filtered resources.
[INFO] Copying 33 resources
[INFO] 
[INFO] --- maven-compiler-plugin:3.1:compile (default-compile) @ bitrepository-integration ---
[INFO] No sources to compile
[INFO] 
[INFO] --- maven-resources-plugin:2.6:testResources (default-testResources) @ bitrepository-integration ---
[INFO] Using 'UTF-8' encoding to copy filtered resources.
[INFO] Copying 1 resource
[INFO] 
[INFO] --- maven-compiler-plugin:3.1:testCompile (default-testCompile) @ bitrepository-integration ---
[INFO] No sources to compile
[INFO] 
[INFO] --- maven-surefire-plugin:2.17:test (default-test) @ bitrepository-integration ---
[INFO] Tests are skipped.
[INFO] 
[INFO] --- maven-jar-plugin:2.4:jar (default-jar) @ bitrepository-integration ---
[INFO] Building jar: /home/cibuild01/workspace/Bitrepository-******/bitrepository-integration/target/bitrepository-integration-1.7-SNAPSHOT.jar
[INFO] 
[INFO] --- maven-jar-plugin:2.4:test-jar (default) @ bitrepository-integration ---
[INFO] Building jar: /home/cibuild01/workspace/Bitrepository-******/bitrepository-integration/target/bitrepository-integration-1.7-SNAPSHOT-tests.jar
[INFO] 
[INFO] --- maven-source-plugin:2.2.1:jar-no-fork (attach-sources-no-fork) @ bitrepository-integration ---
[INFO] Building jar: /home/cibuild01/workspace/Bitrepository-******/bitrepository-integration/target/bitrepository-integration-1.7-SNAPSHOT-sources.jar
[INFO] 
[INFO] --- maven-assembly-plugin:2.4:single (make-assembly) @ bitrepository-integration ---
[INFO] Reading assembly descriptor: src/main/assembly/assembly.xml
[INFO] Reading assembly descriptor: src/main/assembly/tools-assembly.xml
[INFO] Building tar: /home/cibuild01/workspace/Bitrepository-******/bitrepository-integration/target/bitrepository-integration-1.7-SNAPSHOT-quickstart.tar.gz
[INFO] Building tar: /home/cibuild01/workspace/Bitrepository-******/bitrepository-integration/target/bitrepository-integration-1.7-SNAPSHOT-tools.tar.gz
[WARNING] Entry: bitrepository-integration-1.7-SNAPSHOT/lib/bitrepository-reference-pillar-1.7-SNAPSHOT-distribution.tar.gz longer than 100 characters.
[WARNING] Resulting tar file can only be processed successfully by GNU compatible tar commands
[INFO] 
[INFO] --- maven-install-plugin:2.5.1:install (default-install) @ bitrepository-integration ---
[INFO] Installing /home/cibuild01/workspace/Bitrepository-******/bitrepository-integration/target/bitrepository-integration-1.7-SNAPSHOT.jar to /home/cibuild01/.m2/repository/org/bitrepository/reference/bitrepository-integration/1.7-SNAPSHOT/bitrepository-integration-1.7-SNAPSHOT.jar
[INFO] Installing /home/cibuild01/workspace/Bitrepository-******/bitrepository-integration/pom.xml to /home/cibuild01/.m2/repository/org/bitrepository/reference/bitrepository-integration/1.7-SNAPSHOT/bitrepository-integration-1.7-SNAPSHOT.pom
[INFO] Installing /home/cibuild01/workspace/Bitrepository-******/bitrepository-integration/target/bitrepository-integration-1.7-SNAPSHOT-tests.jar to /home/cibuild01/.m2/repository/org/bitrepository/reference/bitrepository-integration/1.7-SNAPSHOT/bitrepository-integration-1.7-SNAPSHOT-tests.jar
[INFO] Installing /home/cibuild01/workspace/Bitrepository-******/bitrepository-integration/target/bitrepository-integration-1.7-SNAPSHOT-sources.jar to /home/cibuild01/.m2/repository/org/bitrepository/reference/bitrepository-integration/1.7-SNAPSHOT/bitrepository-integration-1.7-SNAPSHOT-sources.jar
[INFO] Installing /home/cibuild01/workspace/Bitrepository-******/bitrepository-integration/target/bitrepository-integration-1.7-SNAPSHOT-quickstart.tar.gz to /home/cibuild01/.m2/repository/org/bitrepository/reference/bitrepository-integration/1.7-SNAPSHOT/bitrepository-integration-1.7-SNAPSHOT-quickstart.tar.gz
[INFO] Installing /home/cibuild01/workspace/Bitrepository-******/bitrepository-integration/target/bitrepository-integration-1.7-SNAPSHOT-tools.tar.gz to /home/cibuild01/.m2/repository/org/bitrepository/reference/bitrepository-integration/1.7-SNAPSHOT/bitrepository-integration-1.7-SNAPSHOT-tools.tar.gz
[JENKINS] Archiving disabled
[INFO]                                                                         
[INFO] ------------------------------------------------------------------------
[INFO] Building Bitrepository 1.7-SNAPSHOT
[INFO] ------------------------------------------------------------------------
[INFO] 
[INFO] --- ******-maven-plugin:2.6:****** (default-cli) @ bitrepository-parent ---
[JENKINS] Archiving disabled
[JENKINS] Archiving disabled
[JENKINS] Archiving disabled
[JENKINS] Archiving disabled
[JENKINS] Archiving disabled
[JENKINS] Archiving disabled
[JENKINS] Archiving disabled
[JENKINS] Archiving disabled
[JENKINS] Archiving disabled
[JENKINS] Archiving disabled
[JENKINS] Archiving disabled
[JENKINS] Archiving disabled
[JENKINS] Archiving disabled
[INFO] ------------------------------------------------------------------------
[INFO] Reactor Summary:
[INFO] 
[INFO] Bitrepository ..................................... FAILURE [  8.614 s]
[INFO] Bitrepository Reference Settings .................. SUCCESS [ 11.463 s]
[INFO] Bitrepository Core ................................ SUCCESS [  2.901 s]
[INFO] Bitrepository Client .............................. SUCCESS [  3.751 s]
[INFO] Bitrepository Service ............................. SUCCESS [  1.479 s]
[INFO] Bitrepository Integrity Service ................... SUCCESS [  8.212 s]
[INFO] Bitrepository Alarm Service ....................... SUCCESS [  3.339 s]
[INFO] Bitrepository Audit Trail Service ................. SUCCESS [  3.843 s]
[INFO] Bitrepository Reference Pillar .................... SUCCESS [  6.856 s]
[INFO] Bitrepository Monitoring Service .................. SUCCESS [  2.983 s]
[INFO] Bitrepository Webclient ........................... SUCCESS [  5.365 s]
[INFO] Bitrepository Integration ......................... SUCCESS [ 16.471 s]
[INFO] ------------------------------------------------------------------------
[INFO] BUILD FAILURE
[INFO] ------------------------------------------------------------------------
[INFO] Total time: 01:30 min
[INFO] Finished at: 2016-01-29T15:17:15+01:00
[INFO] Final Memory: 46M/116M
[INFO] ------------------------------------------------------------------------
[ERROR] Failed to execute goal org.codehaus.******:******-maven-plugin:2.6:****** (default-cli) on project bitrepository-parent: A type incompatibility occured while executing org.codehaus.******:******-maven-plugin:2.6:******: org.slf4j.impl.SimpleLoggerFactory cannot be cast to ch.qos.logback.classic.LoggerContext
[ERROR] -----------------------------------------------------
[ERROR] realm =    plugin>org.codehaus.******:******-maven-plugin:2.6
[ERROR] strategy = org.codehaus.plexus.classworlds.strategy.SelfFirstStrategy
[ERROR] urls[0] = file:/home/cibuild01/.m2/repository/org/codehaus/******/******-maven-plugin/2.6/******-maven-plugin-2.6.jar
[ERROR] urls[1] = file:/home/cibuild01/.m2/repository/org/apache/maven/shared/maven-dependency-tree/1.2/maven-dependency-tree-1.2.jar
[ERROR] urls[2] = file:/home/cibuild01/.m2/repository/org/codehaus/plexus/plexus-utils/1.4.1/plexus-utils-1.4.1.jar
[ERROR] urls[3] = file:/home/cibuild01/.m2/repository/junit/junit/4.8.2/junit-4.8.2.jar
[ERROR] urls[4] = file:/home/cibuild01/.m2/repository/org/codehaus/******/******-batch/2.6/******-batch-2.6.jar
[ERROR] urls[5] = file:/home/cibuild01/.m2/repository/org/codehaus/******/******-core/2.6/******-core-2.6.jar
[ERROR] urls[6] = file:/home/cibuild01/.m2/repository/org/hibernate/hibernate-core/3.3.2.GA/hibernate-core-3.3.2.GA.jar
[ERROR] urls[7] = file:/home/cibuild01/.m2/repository/antlr/antlr/2.7.6/antlr-2.7.6.jar
Waiting for Jenkins to finish collecting data[ERROR] urls[8] = file:/home/cibuild01/.m2/repository/dom4j/dom4j/1.6.1/dom4j-1.6.1.jar
[ERROR] urls[9] = file:/home/cibuild01/.m2/repository/org/hibernate/hibernate-annotations/3.4.0.GA/hibernate-annotations-3.4.0.GA.jar
[ERROR] urls[10] = file:/home/cibuild01/.m2/repository/org/hibernate/ejb3-persistence/1.0.2.GA/ejb3-persistence-1.0.2.GA.jar
[ERROR] urls[11] = file:/home/cibuild01/.m2/repository/org/hibernate/hibernate-commons-annotations/3.1.0.GA/hibernate-commons-annotations-3.1.0.GA.jar
[ERROR] urls[12] = file:/home/cibuild01/.m2/repository/org/hibernate/hibernate-entitymanager/3.4.0.GA/hibernate-entitymanager-3.4.0.GA.jar
[ERROR] urls[13] = file:/home/cibuild01/.m2/repository/javassist/javassist/3.4.GA/javassist-3.4.GA.jar
[ERROR] urls[14] = file:/home/cibuild01/.m2/repository/geronimo-spec/geronimo-spec-jta/1.0-M1/geronimo-spec-jta-1.0-M1.jar
[ERROR] urls[15] = file:/home/cibuild01/.m2/repository/org/hibernate/hibernate-ehcache/3.3.2.GA/hibernate-ehcache-3.3.2.GA.jar
[ERROR] urls[16] = file:/home/cibuild01/.m2/repository/net/sf/ehcache/ehcache/1.2.3/ehcache-1.2.3.jar
[ERROR] urls[17] = file:/home/cibuild01/.m2/repository/org/codehaus/******/******-deprecated/2.6/******-deprecated-2.6.jar
[ERROR] urls[18] = file:/home/cibuild01/.m2/repository/org/codehaus/******/******-java-api/2.6/******-java-api-2.6.jar
[ERROR] urls[19] = file:/home/cibuild01/.m2/repository/org/codehaus/******/******-plugin-api/2.6/******-plugin-api-2.6.jar
[ERROR] urls[20] = file:/home/cibuild01/.m2/repository/org/codehaus/******/******-check-api/2.6/******-check-api-2.6.jar
[ERROR] urls[21] = file:/home/cibuild01/.m2/repository/org/codehaus/******/******-colorizer/2.6/******-colorizer-2.6.jar
[ERROR] urls[22] = file:/home/cibuild01/.m2/repository/org/codehaus/******/******-channel/2.6/******-channel-2.6.jar
[ERROR] urls[23] = file:/home/cibuild01/.m2/repository/org/codehaus/******/******-duplications/2.6/******-duplications-2.6.jar
[ERROR] urls[24] = file:/home/cibuild01/.m2/repository/org/codehaus/******/******-graph/2.6/******-graph-2.6.jar
[ERROR] urls[25] = file:/home/cibuild01/.m2/repository/com/google/collections/google-collections/1.0/google-collections-1.0.jar
[ERROR] urls[26] = file:/home/cibuild01/.m2/repository/org/picocontainer/picocontainer/2.10.2/picocontainer-2.10.2.jar
[ERROR] urls[27] = file:/home/cibuild01/.m2/repository/javax/annotation/jsr250-api/1.0/jsr250-api-1.0.jar
[ERROR] urls[28] = file:/home/cibuild01/.m2/repository/javax/inject/javax.inject/1/javax.inject-1.jar
[ERROR] urls[29] = file:/home/cibuild01/.m2/repository/commons-dbcp/commons-dbcp/1.3/commons-dbcp-1.3.jar
[ERROR] urls[30] = file:/home/cibuild01/.m2/repository/commons-pool/commons-pool/1.5.4/commons-pool-1.5.4.jar
[ERROR] urls[31] = file:/home/cibuild01/.m2/repository/commons-configuration/commons-configuration/1.6/commons-configuration-1.6.jar
[ERROR] urls[32] = file:/home/cibuild01/.m2/repository/commons-digester/commons-digester/1.8/commons-digester-1.8.jar
[ERROR] urls[33] = file:/home/cibuild01/.m2/repository/commons-beanutils/commons-beanutils/1.7.0/commons-beanutils-1.7.0.jar
[ERROR] urls[34] = file:/home/cibuild01/.m2/repository/commons-beanutils/commons-beanutils-core/1.8.0/commons-beanutils-core-1.8.0.jar
[ERROR] urls[35] = file:/home/cibuild01/.m2/repository/commons-io/commons-io/2.0.1/commons-io-2.0.1.jar
[ERROR] urls[36] = file:/home/cibuild01/.m2/repository/commons-collections/commons-collections/3.2.1/commons-collections-3.2.1.jar
[ERROR] urls[37] = file:/home/cibuild01/.m2/repository/commons-codec/commons-codec/1.4/commons-codec-1.4.jar
[ERROR] urls[38] = file:/home/cibuild01/.m2/repository/jfree/jfreechart/1.0.9/jfreechart-1.0.9.jar
[ERROR] urls[39] = file:/home/cibuild01/.m2/repository/jfree/jcommon/1.0.12/jcommon-1.0.12.jar
[ERROR] urls[40] = file:/home/cibuild01/.m2/repository/org/slf4j/jcl-over-slf4j/1.5.6/jcl-over-slf4j-1.5.6.jar
[ERROR] urls[41] = file:/home/cibuild01/.m2/repository/org/slf4j/log4j-over-slf4j/1.5.6/log4j-over-slf4j-1.5.6.jar
[ERROR] urls[42] = file:/home/cibuild01/.m2/repository/com/thoughtworks/xstream/xstream/1.3.1/xstream-1.3.1.jar
[ERROR] urls[43] = file:/home/cibuild01/.m2/repository/xpp3/xpp3/1.1.3.3/xpp3-1.1.3.3.jar
[ERROR] urls[44] = file:/home/cibuild01/.m2/repository/org/codehaus/woodstox/woodstox-core-lgpl/4.0.4/woodstox-core-lgpl-4.0.4.jar
[ERROR] urls[45] = file:/home/cibuild01/.m2/repository/stax/stax-api/1.0.1/stax-api-1.0.1.jar
[ERROR] urls[46] = file:/home/cibuild01/.m2/repository/org/codehaus/woodstox/stax2-api/3.0.1/stax2-api-3.0.1.jar
[ERROR] urls[47] = file:/home/cibuild01/.m2/repository/org/codehaus/staxmate/staxmate/2.0.0/staxmate-2.0.0.jar
[ERROR] urls[48] = file:/home/cibuild01/.m2/repository/xerces/xercesImpl/2.8.1/xercesImpl-2.8.1.jar
[ERROR] urls[49] = file:/home/cibuild01/.m2/repository/xml-apis/xml-apis/1.3.03/xml-apis-1.3.03.jar
[ERROR] urls[50] = file:/home/cibuild01/.m2/repository/xalan/xalan/2.7.1/xalan-2.7.1.jar
[ERROR] urls[51] = file:/home/cibuild01/.m2/repository/xalan/serializer/2.7.1/serializer-2.7.1.jar
[ERROR] urls[52] = file:/home/cibuild01/.m2/repository/org/codehaus/******/******-squid/2.6/******-squid-2.6.jar
[ERROR] urls[53] = file:/home/cibuild01/.m2/repository/commons-lang/commons-lang/2.6/commons-lang-2.6.jar
[ERROR] urls[54] = file:/home/cibuild01/.m2/repository/org/slf4j/slf4j-api/1.5.6/slf4j-api-1.5.6.jar
[ERROR] urls[55] = file:/home/cibuild01/.m2/repository/ch/qos/logback/logback-classic/0.9.15/logback-classic-0.9.15.jar
[ERROR] urls[56] = file:/home/cibuild01/.m2/repository/ch/qos/logback/logback-core/0.9.15/logback-core-0.9.15.jar
[ERROR] Number of foreign imports: 1
[ERROR] import: Entry[import  from realm ClassRealm[maven.api, parent: null]]
[ERROR] 
[ERROR] -----------------------------------------------------
[ERROR] -> [Help 1]
[ERROR] 
[ERROR] To see the full stack trace of the errors, re-run Maven with the -e switch.
[ERROR] Re-run Maven using the -X switch to enable full debug logging.
[ERROR] 
[ERROR] For more information about the errors and possible solutions, please read the following articles:
[ERROR] [Help 1] http://cwiki.apache.org/confluence/display/MAVEN/PluginExecutionException

channel stopped
Sending e-mails to: ktc@statsbiblioteket.dk
Finished: FAILURE