FailedConsole Output

Skipping 43 KB.. Full Log
stall) @ heritrix1-frontier ---
[INFO] Installing /home/cibuild02/workspace/NetarchiveSuite-system-test/harvester/heritrix1/heritrix1-frontier/target/heritrix1-frontier-5.4-SNAPSHOT.jar to /home/cibuild02/.m2/repository/org/netarchivesuite/heritrix1-frontier/5.4-SNAPSHOT/heritrix1-frontier-5.4-SNAPSHOT.jar
[INFO] Installing /home/cibuild02/workspace/NetarchiveSuite-system-test/harvester/heritrix1/heritrix1-frontier/pom.xml to /home/cibuild02/.m2/repository/org/netarchivesuite/heritrix1-frontier/5.4-SNAPSHOT/heritrix1-frontier-5.4-SNAPSHOT.pom
[INFO] Installing /home/cibuild02/workspace/NetarchiveSuite-system-test/harvester/heritrix1/heritrix1-frontier/target/heritrix1-frontier-5.4-SNAPSHOT-sources.jar to /home/cibuild02/.m2/repository/org/netarchivesuite/heritrix1-frontier/5.4-SNAPSHOT/heritrix1-frontier-5.4-SNAPSHOT-sources.jar
[INFO] Installing /home/cibuild02/workspace/NetarchiveSuite-system-test/harvester/heritrix1/heritrix1-frontier/target/heritrix1-frontier-5.4-SNAPSHOT-javadoc.jar to /home/cibuild02/.m2/repository/org/netarchivesuite/heritrix1-frontier/5.4-SNAPSHOT/heritrix1-frontier-5.4-SNAPSHOT-javadoc.jar
[INFO]                                                                         
[INFO] ------------------------------------------------------------------------
[INFO] Building NetarchiveSuite - harvester - core 5.4-SNAPSHOT
[INFO] ------------------------------------------------------------------------
[INFO] 
[INFO] --- maven-clean-plugin:2.5:clean (default-clean) @ harvester-core ---
[INFO] 
[INFO] --- jacoco-maven-plugin:0.7.9:prepare-agent (agent) @ harvester-core ---
[INFO] argLine set to -javaagent:/home/cibuild02/.m2/repository/org/jacoco/org.jacoco.agent/0.7.9/org.jacoco.agent-0.7.9-runtime.jar=destfile=/home/cibuild02/workspace/NetarchiveSuite-system-test/harvester/harvester-core/../target/jacoco.exec,append=true
[INFO] 
[INFO] --- maven-resources-plugin:2.6:resources (default-resources) @ harvester-core ---
[INFO] Using 'UTF-8' encoding to copy filtered resources.
[INFO] Copying 13 resources
[INFO] Copying 3 resources to sql-migration/postgresql/
[INFO] Copying 1 resource to sql-migration/mysql/
[INFO] Copying 2 resources to sql-migration/derby/
[INFO] 
[INFO] --- maven-compiler-plugin:3.1:compile (default-compile) @ harvester-core ---
[INFO] Changes detected - recompiling the module!
[INFO] Compiling 227 source files to /home/cibuild02/workspace/NetarchiveSuite-system-test/harvester/harvester-core/target/classes
[WARNING] /home/cibuild02/workspace/NetarchiveSuite-system-test/harvester/harvester-core/src/main/java/dk/netarkivet/harvester/datamodel/H1HeritrixTemplate.java: /home/cibuild02/workspace/NetarchiveSuite-system-test/harvester/harvester-core/src/main/java/dk/netarkivet/harvester/datamodel/H1HeritrixTemplate.java uses unchecked or unsafe operations.
[WARNING] /home/cibuild02/workspace/NetarchiveSuite-system-test/harvester/harvester-core/src/main/java/dk/netarkivet/harvester/datamodel/H1HeritrixTemplate.java: Recompile with -Xlint:unchecked for details.
[INFO] 
[INFO] --- maven-resources-plugin:2.6:testResources (default-testResources) @ harvester-core ---
[INFO] Using 'UTF-8' encoding to copy filtered resources.
[INFO] Copying 16 resources
[INFO] 
[INFO] --- maven-compiler-plugin:3.1:testCompile (default-testCompile) @ harvester-core ---
[INFO] Changes detected - recompiling the module!
[INFO] Compiling 12 source files to /home/cibuild02/workspace/NetarchiveSuite-system-test/harvester/harvester-core/target/test-classes
[INFO] 
[INFO] --- maven-surefire-plugin:2.17:test (default-test) @ harvester-core ---
[INFO] Tests are skipped.
[INFO] 
[INFO] --- maven-jgit-buildnumber-plugin:1.2.9:extract-buildnumber (git-buildnumber) @ harvester-core ---
[INFO] 
[INFO] --- maven-jar-plugin:2.4:jar (default-jar) @ harvester-core ---
[INFO] Building jar: /home/cibuild02/workspace/NetarchiveSuite-system-test/harvester/harvester-core/target/harvester-core-5.4-SNAPSHOT.jar
[INFO] 
[INFO] --- maven-jar-plugin:2.4:test-jar (default) @ harvester-core ---
[INFO] Building jar: /home/cibuild02/workspace/NetarchiveSuite-system-test/harvester/harvester-core/target/harvester-core-5.4-SNAPSHOT-tests.jar
[INFO] 
[INFO] >>> maven-source-plugin:2.2.1:jar (attach-sources) > generate-sources @ harvester-core >>>
[INFO] 
[INFO] --- jacoco-maven-plugin:0.7.9:prepare-agent (agent) @ harvester-core ---
[INFO] argLine set to -javaagent:/home/cibuild02/.m2/repository/org/jacoco/org.jacoco.agent/0.7.9/org.jacoco.agent-0.7.9-runtime.jar=destfile=/home/cibuild02/workspace/NetarchiveSuite-system-test/harvester/harvester-core/../target/jacoco.exec,append=true
[INFO] 
[INFO] <<< maven-source-plugin:2.2.1:jar (attach-sources) < generate-sources @ harvester-core <<<
[INFO] 
[INFO] --- maven-source-plugin:2.2.1:jar (attach-sources) @ harvester-core ---
[INFO] Building jar: /home/cibuild02/workspace/NetarchiveSuite-system-test/harvester/harvester-core/target/harvester-core-5.4-SNAPSHOT-sources.jar
[INFO] 
[INFO] --- maven-javadoc-plugin:2.10.3:jar (attach-javadocs) @ harvester-core ---
[INFO] 
32 warnings
[WARNING] Javadoc Warnings
[WARNING] /home/cibuild02/workspace/NetarchiveSuite-system-test/harvester/harvester-core/src/main/java/dk/netarkivet/harvester/HarvesterSettings.java:198: warning - Tag @link: reference not found: DefaultJobGenerator
[WARNING] /home/cibuild02/workspace/NetarchiveSuite-system-test/harvester/harvester-core/src/main/java/dk/netarkivet/harvester/HarvesterSettings.java:198: warning - Tag @link: reference not found: FixedDomainConfigurationCountJobGenerator
[WARNING] /home/cibuild02/workspace/NetarchiveSuite-system-test/harvester/harvester-core/src/main/java/dk/netarkivet/harvester/HarvesterSettings.java:183: warning - Tag @link: reference not found: FixedDomainConfigurationCountJobGenerator
[WARNING] /home/cibuild02/workspace/NetarchiveSuite-system-test/harvester/harvester-core/src/main/java/dk/netarkivet/harvester/HarvesterSettings.java:168: warning - Tag @link: reference not found: FixedDomainConfigurationCountJobGenerator
[WARNING] /home/cibuild02/workspace/NetarchiveSuite-system-test/harvester/harvester-core/src/main/java/dk/netarkivet/harvester/HarvesterSettings.java:175: warning - Tag @link: reference not found: FixedDomainConfigurationCountJobGenerator
[WARNING] /home/cibuild02/workspace/NetarchiveSuite-system-test/harvester/harvester-core/src/main/java/dk/netarkivet/harvester/HarvesterSettings.java:323: warning - Tag @link: reference not found: JobDispatcher
[WARNING] /home/cibuild02/workspace/NetarchiveSuite-system-test/harvester/harvester-core/src/main/java/dk/netarkivet/harvester/HarvesterSettings.java:168: warning - Tag @link: reference not found: FixedDomainConfigurationCountJobGenerator
[WARNING] /home/cibuild02/workspace/NetarchiveSuite-system-test/harvester/harvester-core/src/main/java/dk/netarkivet/harvester/HarvesterSettings.java:175: warning - Tag @link: reference not found: FixedDomainConfigurationCountJobGenerator
[WARNING] /home/cibuild02/workspace/NetarchiveSuite-system-test/harvester/harvester-core/src/main/java/dk/netarkivet/harvester/HarvesterSettings.java:183: warning - Tag @link: reference not found: FixedDomainConfigurationCountJobGenerator
[WARNING] /home/cibuild02/workspace/NetarchiveSuite-system-test/harvester/harvester-core/src/main/java/dk/netarkivet/harvester/HarvesterSettings.java:198: warning - Tag @link: reference not found: DefaultJobGenerator
[WARNING] /home/cibuild02/workspace/NetarchiveSuite-system-test/harvester/harvester-core/src/main/java/dk/netarkivet/harvester/HarvesterSettings.java:198: warning - Tag @link: reference not found: FixedDomainConfigurationCountJobGenerator
[WARNING] /home/cibuild02/workspace/NetarchiveSuite-system-test/harvester/harvester-core/src/main/java/dk/netarkivet/harvester/HarvesterSettings.java:198: warning - Tag @link: reference not found: DefaultJobGenerator
[WARNING] /home/cibuild02/workspace/NetarchiveSuite-system-test/harvester/harvester-core/src/main/java/dk/netarkivet/harvester/HarvesterSettings.java:323: warning - Tag @link: reference not found: JobDispatcher
[WARNING] /home/cibuild02/workspace/NetarchiveSuite-system-test/harvester/harvester-core/src/main/java/dk/netarkivet/harvester/HarvesterSettings.java:344: warning - Tag @link: reference not found: TopTotalEnqueuesFilter
[WARNING] /home/cibuild02/workspace/NetarchiveSuite-system-test/harvester/harvester-core/src/main/java/dk/netarkivet/harvester/HarvesterSettings.java:360: warning - Tag @see: reference not found: BnfHeritrixController
[WARNING] /home/cibuild02/workspace/NetarchiveSuite-system-test/harvester/harvester-core/src/main/java/dk/netarkivet/harvester/HarvesterSettings.java:492: warning - Tag @see: reference not found: HarvestDocumentation#documentHarvest(dk.netarkivet.harvester.harvesting.IngestableFiles)
[WARNING] /home/cibuild02/workspace/NetarchiveSuite-system-test/harvester/harvester-core/src/main/java/dk/netarkivet/harvester/HarvesterSettings.java:501: warning - Tag @see: reference not found: HarvestDocumentation#documentHarvest(dk.netarkivet.harvester.harvesting.IngestableFiles)
[WARNING] /home/cibuild02/workspace/NetarchiveSuite-system-test/harvester/harvester-core/src/main/java/dk/netarkivet/harvester/HarvesterSettings.java:510: warning - Tag @see: reference not found: HarvestDocumentation#documentHarvest(dk.netarkivet.harvester.harvesting.IngestableFiles)
[WARNING] /home/cibuild02/workspace/NetarchiveSuite-system-test/harvester/harvester-core/src/main/java/dk/netarkivet/harvester/harvesting/metadata/MetadataFileWriter.java:203: warning - Tag @see: reference not found: org.archive.io.arc.ARCWriter#write(String uri, String contentType, String hostIP, long fetchBeginTimeStamp,
[WARNING] long recordLength, InputStream in)
[WARNING] /home/cibuild02/workspace/NetarchiveSuite-system-test/harvester/harvester-core/src/main/java/dk/netarkivet/harvester/harvesting/metadata/MetadataFileWriter.java:203: warning - Tag @see: reference not found: org.archive.io.arc.ARCWriter#write(String uri, String contentType, String hostIP, long fetchBeginTimeStamp,
[WARNING] long recordLength, InputStream in)
[WARNING] /home/cibuild02/workspace/NetarchiveSuite-system-test/harvester/harvester-core/src/main/java/dk/netarkivet/harvester/harvesting/metadata/MetadataFileWriter.java:203: warning - Tag @see: reference not found: org.archive.io.arc.ARCWriter#write(String uri, String contentType, String hostIP, long fetchBeginTimeStamp,
[WARNING] long recordLength, InputStream in)
[WARNING] /home/cibuild02/workspace/NetarchiveSuite-system-test/harvester/harvester-core/src/main/java/dk/netarkivet/harvester/harvesting/monitor/HarvestMonitor.java:231: warning - @param argument "limit" is not a parameter name.
[WARNING] /home/cibuild02/workspace/NetarchiveSuite-system-test/harvester/harvester-core/src/main/java/dk/netarkivet/harvester/harvesting/monitor/HarvestMonitor.java:250: warning - @param argument "limit" is not a parameter name.
[WARNING] /home/cibuild02/workspace/NetarchiveSuite-system-test/harvester/harvester-core/src/main/java/dk/netarkivet/harvester/harvesting/report/LegacyHarvestReport.java:55: warning - @dsr is an unknown tag.
[WARNING] /home/cibuild02/workspace/NetarchiveSuite-system-test/harvester/harvester-core/src/main/java/dk/netarkivet/harvester/datamodel/eav/EAV.java:105: warning - @return tag has no arguments.
[WARNING] /home/cibuild02/workspace/NetarchiveSuite-system-test/harvester/harvester-core/src/main/java/dk/netarkivet/harvester/webinterface/DomainDefinition.java:421: warning - @return tag cannot be used in method with void return type.
[WARNING] /home/cibuild02/workspace/NetarchiveSuite-system-test/harvester/harvester-core/src/main/java/dk/netarkivet/harvester/HarvesterSettings.java:198: warning - Tag @link: reference not found: DefaultJobGenerator
[WARNING] /home/cibuild02/workspace/NetarchiveSuite-system-test/harvester/harvester-core/src/main/java/dk/netarkivet/harvester/HarvesterSettings.java:198: warning - Tag @link: reference not found: FixedDomainConfigurationCountJobGenerator
[WARNING] /home/cibuild02/workspace/NetarchiveSuite-system-test/harvester/harvester-core/src/main/java/dk/netarkivet/harvester/HarvesterSettings.java:183: warning - Tag @link: reference not found: FixedDomainConfigurationCountJobGenerator
[WARNING] /home/cibuild02/workspace/NetarchiveSuite-system-test/harvester/harvester-core/src/main/java/dk/netarkivet/harvester/HarvesterSettings.java:168: warning - Tag @link: reference not found: FixedDomainConfigurationCountJobGenerator
[WARNING] /home/cibuild02/workspace/NetarchiveSuite-system-test/harvester/harvester-core/src/main/java/dk/netarkivet/harvester/HarvesterSettings.java:175: warning - Tag @link: reference not found: FixedDomainConfigurationCountJobGenerator
[WARNING] /home/cibuild02/workspace/NetarchiveSuite-system-test/harvester/harvester-core/src/main/java/dk/netarkivet/harvester/HarvesterSettings.java:323: warning - Tag @link: reference not found: JobDispatcher
[INFO] Building jar: /home/cibuild02/workspace/NetarchiveSuite-system-test/harvester/harvester-core/target/harvester-core-5.4-SNAPSHOT-javadoc.jar
[INFO] 
[INFO] --- maven-install-plugin:2.4:install (default-install) @ harvester-core ---
[INFO] Installing /home/cibuild02/workspace/NetarchiveSuite-system-test/harvester/harvester-core/target/harvester-core-5.4-SNAPSHOT.jar to /home/cibuild02/.m2/repository/org/netarchivesuite/harvester-core/5.4-SNAPSHOT/harvester-core-5.4-SNAPSHOT.jar
[INFO] Installing /home/cibuild02/workspace/NetarchiveSuite-system-test/harvester/harvester-core/pom.xml to /home/cibuild02/.m2/repository/org/netarchivesuite/harvester-core/5.4-SNAPSHOT/harvester-core-5.4-SNAPSHOT.pom
[INFO] Installing /home/cibuild02/workspace/NetarchiveSuite-system-test/harvester/harvester-core/target/harvester-core-5.4-SNAPSHOT-tests.jar to /home/cibuild02/.m2/repository/org/netarchivesuite/harvester-core/5.4-SNAPSHOT/harvester-core-5.4-SNAPSHOT-tests.jar
[INFO] Installing /home/cibuild02/workspace/NetarchiveSuite-system-test/harvester/harvester-core/target/harvester-core-5.4-SNAPSHOT-sources.jar to /home/cibuild02/.m2/repository/org/netarchivesuite/harvester-core/5.4-SNAPSHOT/harvester-core-5.4-SNAPSHOT-sources.jar
[INFO] Installing /home/cibuild02/workspace/NetarchiveSuite-system-test/harvester/harvester-core/target/harvester-core-5.4-SNAPSHOT-javadoc.jar to /home/cibuild02/.m2/repository/org/netarchivesuite/harvester-core/5.4-SNAPSHOT/harvester-core-5.4-SNAPSHOT-javadoc.jar
[INFO]                                                                         
[INFO] ------------------------------------------------------------------------
[INFO] Building NetarchiveSuite - archive - test 5.4-SNAPSHOT
[INFO] ------------------------------------------------------------------------
[INFO] 
[INFO] --- maven-clean-plugin:2.5:clean (default-clean) @ archive-test ---
[INFO] 
[INFO] --- jacoco-maven-plugin:0.7.9:prepare-agent (agent) @ archive-test ---
[INFO] argLine set to -javaagent:/home/cibuild02/.m2/repository/org/jacoco/org.jacoco.agent/0.7.9/org.jacoco.agent-0.7.9-runtime.jar=destfile=/home/cibuild02/workspace/NetarchiveSuite-system-test/archive/archive-test/../target/jacoco.exec,append=true
[INFO] 
[INFO] --- maven-resources-plugin:2.6:resources (default-resources) @ archive-test ---
[INFO] Using 'UTF-8' encoding to copy filtered resources.
[INFO] skip non existing resourceDirectory /home/cibuild02/workspace/NetarchiveSuite-system-test/archive/archive-test/src/main/resources
[INFO] 
[INFO] --- maven-compiler-plugin:3.1:compile (default-compile) @ archive-test ---
[INFO] No sources to compile
[INFO] 
[INFO] --- maven-resources-plugin:2.6:testResources (default-testResources) @ archive-test ---
[INFO] Using 'UTF-8' encoding to copy filtered resources.
[INFO] Copying 1 resource
[INFO] Copying 280 resources
[INFO] 
[INFO] --- maven-compiler-plugin:3.1:testCompile (default-testCompile) @ archive-test ---
[INFO] Changes detected - recompiling the module!
[INFO] Compiling 78 source files to /home/cibuild02/workspace/NetarchiveSuite-system-test/archive/archive-test/target/test-classes
[WARNING] /home/cibuild02/workspace/NetarchiveSuite-system-test/archive/archive-test/src/test/java/dk/netarkivet/archive/arcrepository/ArcRepositoryTesterStore.java: Some input files use or override a deprecated API.
[WARNING] /home/cibuild02/workspace/NetarchiveSuite-system-test/archive/archive-test/src/test/java/dk/netarkivet/archive/arcrepository/ArcRepositoryTesterStore.java: Recompile with -Xlint:deprecation for details.
[WARNING] /home/cibuild02/workspace/NetarchiveSuite-system-test/archive/archive-test/src/test/java/dk/netarkivet/archive/webinterface/BatchGUITester.java: Some input files use unchecked or unsafe operations.
[WARNING] /home/cibuild02/workspace/NetarchiveSuite-system-test/archive/archive-test/src/test/java/dk/netarkivet/archive/webinterface/BatchGUITester.java: Recompile with -Xlint:unchecked for details.
[INFO] 
[INFO] --- maven-surefire-plugin:2.17:test (default-test) @ archive-test ---
[INFO] Tests are skipped.
[INFO] 
[INFO] --- maven-jgit-buildnumber-plugin:1.2.9:extract-buildnumber (git-buildnumber) @ archive-test ---
[INFO] 
[INFO] --- maven-jar-plugin:2.4:jar (default-jar) @ archive-test ---
[WARNING] JAR will be empty - no content was marked for inclusion!
[INFO] Building jar: /home/cibuild02/workspace/NetarchiveSuite-system-test/archive/archive-test/target/archive-test-5.4-SNAPSHOT.jar
[INFO] 
[INFO] >>> maven-source-plugin:2.2.1:jar (attach-sources) > generate-sources @ archive-test >>>
[INFO] 
[INFO] --- jacoco-maven-plugin:0.7.9:prepare-agent (agent) @ archive-test ---
[INFO] argLine set to -javaagent:/home/cibuild02/.m2/repository/org/jacoco/org.jacoco.agent/0.7.9/org.jacoco.agent-0.7.9-runtime.jar=destfile=/home/cibuild02/workspace/NetarchiveSuite-system-test/archive/archive-test/../target/jacoco.exec,append=true
[INFO] 
[INFO] <<< maven-source-plugin:2.2.1:jar (attach-sources) < generate-sources @ archive-test <<<
[INFO] 
[INFO] --- maven-source-plugin:2.2.1:jar (attach-sources) @ archive-test ---
[INFO] No sources in project. Archive not created.
[INFO] 
[INFO] --- maven-javadoc-plugin:2.10.3:jar (attach-javadocs) @ archive-test ---
[INFO] 
[INFO] --- maven-install-plugin:2.4:install (default-install) @ archive-test ---
[INFO] Installing /home/cibuild02/workspace/NetarchiveSuite-system-test/archive/archive-test/target/archive-test-5.4-SNAPSHOT.jar to /home/cibuild02/.m2/repository/org/netarchivesuite/archive-test/5.4-SNAPSHOT/archive-test-5.4-SNAPSHOT.jar
[INFO] Installing /home/cibuild02/workspace/NetarchiveSuite-system-test/archive/archive-test/pom.xml to /home/cibuild02/.m2/repository/org/netarchivesuite/archive-test/5.4-SNAPSHOT/archive-test-5.4-SNAPSHOT.pom
[INFO]                                                                         
[INFO] ------------------------------------------------------------------------
[INFO] Building NetarchiveSuite - bitpreservation - webapp 5.4-SNAPSHOT
[INFO] ------------------------------------------------------------------------
[INFO] 
[INFO] --- maven-clean-plugin:2.5:clean (default-clean) @ bitpreservation-gui ---
[INFO] 
[INFO] --- maven-resources-plugin:2.6:resources (default-resources) @ bitpreservation-gui ---
[INFO] Using 'UTF-8' encoding to copy filtered resources.
[INFO] skip non existing resourceDirectory /home/cibuild02/workspace/NetarchiveSuite-system-test/archive/bitpreservation-gui/src/main/resources
[INFO] 
[INFO] --- maven-compiler-plugin:3.1:compile (default-compile) @ bitpreservation-gui ---
[INFO] No sources to compile
[INFO] 
[INFO] --- maven-resources-plugin:2.6:testResources (default-testResources) @ bitpreservation-gui ---
[INFO] Using 'UTF-8' encoding to copy filtered resources.
[INFO] skip non existing resourceDirectory /home/cibuild02/workspace/NetarchiveSuite-system-test/archive/bitpreservation-gui/src/test/resources
[INFO] 
[INFO] --- maven-compiler-plugin:3.1:testCompile (default-testCompile) @ bitpreservation-gui ---
[INFO] No sources to compile
[INFO] 
[INFO] --- maven-surefire-plugin:2.17:test (default-test) @ bitpreservation-gui ---
[INFO] Tests are skipped.
[INFO] 
[INFO] --- maven-jgit-buildnumber-plugin:1.2.9:extract-buildnumber (git-buildnumber) @ bitpreservation-gui ---
[INFO] 
[INFO] --- maven-war-plugin:2.2:war (default-war) @ bitpreservation-gui ---
[INFO] Packaging webapp
[INFO] Assembling webapp [bitpreservation-gui] in [/home/cibuild02/workspace/NetarchiveSuite-system-test/archive/bitpreservation-gui/target/BitPreservation]
[INFO] Processing war project
[INFO] Copying webapp resources [/home/cibuild02/workspace/NetarchiveSuite-system-test/archive/bitpreservation-gui/src/main/webapp]
[INFO] Webapp assembled in [80 msecs]
[INFO] Building war: /home/cibuild02/workspace/NetarchiveSuite-system-test/archive/bitpreservation-gui/target/BitPreservation.war
[INFO] WEB-INF/web.xml already added, skipping
[INFO] 
[INFO] >>> maven-source-plugin:2.2.1:jar (attach-sources) > generate-sources @ bitpreservation-gui >>>
[INFO] 
[INFO] <<< maven-source-plugin:2.2.1:jar (attach-sources) < generate-sources @ bitpreservation-gui <<<
[INFO] 
[INFO] --- maven-source-plugin:2.2.1:jar (attach-sources) @ bitpreservation-gui ---
[INFO] No sources in project. Archive not created.
[INFO] 
[INFO] --- maven-javadoc-plugin:2.10.3:jar (attach-javadocs) @ bitpreservation-gui ---
[INFO] 
[INFO] --- maven-install-plugin:2.4:install (default-install) @ bitpreservation-gui ---
[INFO] Installing /home/cibuild02/workspace/NetarchiveSuite-system-test/archive/bitpreservation-gui/target/BitPreservation.war to /home/cibuild02/.m2/repository/org/netarchivesuite/bitpreservation-gui/5.4-SNAPSHOT/bitpreservation-gui-5.4-SNAPSHOT.war
[INFO] Installing /home/cibuild02/workspace/NetarchiveSuite-system-test/archive/bitpreservation-gui/pom.xml to /home/cibuild02/.m2/repository/org/netarchivesuite/bitpreservation-gui/5.4-SNAPSHOT/bitpreservation-gui-5.4-SNAPSHOT.pom
[INFO]                                                                         
[INFO] ------------------------------------------------------------------------
[INFO] Building NetarchiveSuite - heritrix1 extensions 5.4-SNAPSHOT
[INFO] ------------------------------------------------------------------------
[INFO] 
[INFO] --- maven-clean-plugin:2.5:clean (default-clean) @ heritrix1-extensions ---
[INFO] 
[INFO] --- maven-resources-plugin:2.6:resources (default-resources) @ heritrix1-extensions ---
[INFO] Using 'UTF-8' encoding to copy filtered resources.
[INFO] skip non existing resourceDirectory /home/cibuild02/workspace/NetarchiveSuite-system-test/harvester/heritrix1/heritrix1-extensions/src/main/resources
[INFO] 
[INFO] --- maven-compiler-plugin:3.1:compile (default-compile) @ heritrix1-extensions ---
[INFO] Changes detected - recompiling the module!
[INFO] Compiling 10 source files to /home/cibuild02/workspace/NetarchiveSuite-system-test/harvester/heritrix1/heritrix1-extensions/target/classes
[WARNING] /home/cibuild02/workspace/NetarchiveSuite-system-test/harvester/heritrix1/heritrix1-extensions/src/main/java/dk/netarkivet/harvester/tools/TwitterDecidingScope.java: Some input files use unchecked or unsafe operations.
[WARNING] /home/cibuild02/workspace/NetarchiveSuite-system-test/harvester/heritrix1/heritrix1-extensions/src/main/java/dk/netarkivet/harvester/tools/TwitterDecidingScope.java: Recompile with -Xlint:unchecked for details.
[INFO] 
[INFO] --- maven-resources-plugin:2.6:testResources (default-testResources) @ heritrix1-extensions ---
[INFO] Using 'UTF-8' encoding to copy filtered resources.
[INFO] Copying 4 resources
[INFO] 
[INFO] --- maven-compiler-plugin:3.1:testCompile (default-testCompile) @ heritrix1-extensions ---
[INFO] Changes detected - recompiling the module!
[INFO] Compiling 7 source files to /home/cibuild02/workspace/NetarchiveSuite-system-test/harvester/heritrix1/heritrix1-extensions/target/test-classes
[INFO] 
[INFO] --- maven-surefire-plugin:2.17:test (default-test) @ heritrix1-extensions ---
[INFO] Tests are skipped.
[INFO] 
[INFO] --- maven-jgit-buildnumber-plugin:1.2.9:extract-buildnumber (git-buildnumber) @ heritrix1-extensions ---
[INFO] 
[INFO] --- maven-jar-plugin:2.4:jar (default-jar) @ heritrix1-extensions ---
[INFO] Building jar: /home/cibuild02/workspace/NetarchiveSuite-system-test/harvester/heritrix1/heritrix1-extensions/target/heritrix1-extensions-5.4-SNAPSHOT.jar
[INFO] 
[INFO] >>> maven-source-plugin:2.2.1:jar (attach-sources) > generate-sources @ heritrix1-extensions >>>
[INFO] 
[INFO] <<< maven-source-plugin:2.2.1:jar (attach-sources) < generate-sources @ heritrix1-extensions <<<
[INFO] 
[INFO] --- maven-source-plugin:2.2.1:jar (attach-sources) @ heritrix1-extensions ---
[INFO] Building jar: /home/cibuild02/workspace/NetarchiveSuite-system-test/harvester/heritrix1/heritrix1-extensions/target/heritrix1-extensions-5.4-SNAPSHOT-sources.jar
[INFO] 
[INFO] --- maven-javadoc-plugin:2.10.3:jar (attach-javadocs) @ heritrix1-extensions ---
[INFO] Building jar: /home/cibuild02/workspace/NetarchiveSuite-system-test/harvester/heritrix1/heritrix1-extensions/target/heritrix1-extensions-5.4-SNAPSHOT-javadoc.jar
[INFO] 
[INFO] --- maven-install-plugin:2.4:install (default-install) @ heritrix1-extensions ---
[INFO] Installing /home/cibuild02/workspace/NetarchiveSuite-system-test/harvester/heritrix1/heritrix1-extensions/target/heritrix1-extensions-5.4-SNAPSHOT.jar to /home/cibuild02/.m2/repository/org/netarchivesuite/heritrix1-extensions/5.4-SNAPSHOT/heritrix1-extensions-5.4-SNAPSHOT.jar
[INFO] Installing /home/cibuild02/workspace/NetarchiveSuite-system-test/harvester/heritrix1/heritrix1-extensions/pom.xml to /home/cibuild02/.m2/repository/org/netarchivesuite/heritrix1-extensions/5.4-SNAPSHOT/heritrix1-extensions-5.4-SNAPSHOT.pom
[INFO] Installing /home/cibuild02/workspace/NetarchiveSuite-system-test/harvester/heritrix1/heritrix1-extensions/target/heritrix1-extensions-5.4-SNAPSHOT-sources.jar to /home/cibuild02/.m2/repository/org/netarchivesuite/heritrix1-extensions/5.4-SNAPSHOT/heritrix1-extensions-5.4-SNAPSHOT-sources.jar
[INFO] Installing /home/cibuild02/workspace/NetarchiveSuite-system-test/harvester/heritrix1/heritrix1-extensions/target/heritrix1-extensions-5.4-SNAPSHOT-javadoc.jar to /home/cibuild02/.m2/repository/org/netarchivesuite/heritrix1-extensions/5.4-SNAPSHOT/heritrix1-extensions-5.4-SNAPSHOT-javadoc.jar
[INFO]                                                                         
[INFO] ------------------------------------------------------------------------
[INFO] Building NetarchiveSuite - heritrix1 controller 5.4-SNAPSHOT
[INFO] ------------------------------------------------------------------------
[INFO] 
[INFO] --- maven-clean-plugin:2.5:clean (default-clean) @ heritrix1-controller ---
[INFO] 
[INFO] --- maven-resources-plugin:2.6:resources (default-resources) @ heritrix1-controller ---
[INFO] Using 'UTF-8' encoding to copy filtered resources.
[INFO] Copying 1 resource
[INFO] 
[INFO] --- maven-compiler-plugin:3.1:compile (default-compile) @ heritrix1-controller ---
[INFO] Changes detected - recompiling the module!
[INFO] Compiling 21 source files to /home/cibuild02/workspace/NetarchiveSuite-system-test/harvester/heritrix1/heritrix1-controller/target/classes
[INFO] 
[INFO] --- maven-resources-plugin:2.6:testResources (default-testResources) @ heritrix1-controller ---
[INFO] Using 'UTF-8' encoding to copy filtered resources.
[INFO] Copying 104 resources
[INFO] 
[INFO] --- maven-compiler-plugin:3.1:testCompile (default-testCompile) @ heritrix1-controller ---
[INFO] Changes detected - recompiling the module!
[INFO] Compiling 16 source files to /home/cibuild02/workspace/NetarchiveSuite-system-test/harvester/heritrix1/heritrix1-controller/target/test-classes
[WARNING] /home/cibuild02/workspace/NetarchiveSuite-system-test/harvester/heritrix1/heritrix1-controller/src/test/java/dk/netarkivet/externalsoftware/HeritrixTests.java: Some input files use unchecked or unsafe operations.
[WARNING] /home/cibuild02/workspace/NetarchiveSuite-system-test/harvester/heritrix1/heritrix1-controller/src/test/java/dk/netarkivet/externalsoftware/HeritrixTests.java: Recompile with -Xlint:unchecked for details.
[INFO] 
[INFO] --- maven-surefire-plugin:2.17:test (default-test) @ heritrix1-controller ---
[INFO] Tests are skipped.
[INFO] 
[INFO] --- maven-jgit-buildnumber-plugin:1.2.9:extract-buildnumber (git-buildnumber) @ heritrix1-controller ---
[INFO] 
[INFO] --- maven-jar-plugin:2.4:jar (default-jar) @ heritrix1-controller ---
[INFO] Building jar: /home/cibuild02/workspace/NetarchiveSuite-system-test/harvester/heritrix1/heritrix1-controller/target/heritrix1-controller-5.4-SNAPSHOT.jar
[INFO] 
[INFO] >>> maven-source-plugin:2.2.1:jar (attach-sources) > generate-sources @ heritrix1-controller >>>
[INFO] 
[INFO] <<< maven-source-plugin:2.2.1:jar (attach-sources) < generate-sources @ heritrix1-controller <<<
[INFO] 
[INFO] --- maven-source-plugin:2.2.1:jar (attach-sources) @ heritrix1-controller ---
[INFO] Building jar: /home/cibuild02/workspace/NetarchiveSuite-system-test/harvester/heritrix1/heritrix1-controller/target/heritrix1-controller-5.4-SNAPSHOT-sources.jar
[INFO] 
[INFO] --- maven-javadoc-plugin:2.10.3:jar (attach-javadocs) @ heritrix1-controller ---
[INFO] Building jar: /home/cibuild02/workspace/NetarchiveSuite-system-test/harvester/heritrix1/heritrix1-controller/target/heritrix1-controller-5.4-SNAPSHOT-javadoc.jar
[INFO] 
[INFO] --- maven-install-plugin:2.4:install (default-install) @ heritrix1-controller ---
[INFO] Installing /home/cibuild02/workspace/NetarchiveSuite-system-test/harvester/heritrix1/heritrix1-controller/target/heritrix1-controller-5.4-SNAPSHOT.jar to /home/cibuild02/.m2/repository/org/netarchivesuite/heritrix1-controller/5.4-SNAPSHOT/heritrix1-controller-5.4-SNAPSHOT.jar
[INFO] Installing /home/cibuild02/workspace/NetarchiveSuite-system-test/harvester/heritrix1/heritrix1-controller/pom.xml to /home/cibuild02/.m2/repository/org/netarchivesuite/heritrix1-controller/5.4-SNAPSHOT/heritrix1-controller-5.4-SNAPSHOT.pom
[INFO] Installing /home/cibuild02/workspace/NetarchiveSuite-system-test/harvester/heritrix1/heritrix1-controller/target/heritrix1-controller-5.4-SNAPSHOT-sources.jar to /home/cibuild02/.m2/repository/org/netarchivesuite/heritrix1-controller/5.4-SNAPSHOT/heritrix1-controller-5.4-SNAPSHOT-sources.jar
[INFO] Installing /home/cibuild02/workspace/NetarchiveSuite-system-test/harvester/heritrix1/heritrix1-controller/target/heritrix1-controller-5.4-SNAPSHOT-javadoc.jar to /home/cibuild02/.m2/repository/org/netarchivesuite/heritrix1-controller/5.4-SNAPSHOT/heritrix1-controller-5.4-SNAPSHOT-javadoc.jar
[INFO]                                                                         
[INFO] ------------------------------------------------------------------------
[INFO] Building NetarchiveSuite - Harvest Scheduler 5.4-SNAPSHOT
[INFO] ------------------------------------------------------------------------
[INFO] 
[INFO] --- maven-clean-plugin:2.5:clean (default-clean) @ harvest-scheduler ---
[INFO] 
[INFO] --- jacoco-maven-plugin:0.7.9:prepare-agent (agent) @ harvest-scheduler ---
[INFO] argLine set to -javaagent:/home/cibuild02/.m2/repository/org/jacoco/org.jacoco.agent/0.7.9/org.jacoco.agent-0.7.9-runtime.jar=destfile=/home/cibuild02/workspace/NetarchiveSuite-system-test/harvester/harvest-scheduler/../target/jacoco.exec,append=true
[INFO] 
[INFO] --- maven-resources-plugin:2.6:resources (default-resources) @ harvest-scheduler ---
[INFO] Using 'UTF-8' encoding to copy filtered resources.
[INFO] skip non existing resourceDirectory /home/cibuild02/workspace/NetarchiveSuite-system-test/harvester/harvest-scheduler/src/main/resources
[INFO] 
[INFO] --- maven-compiler-plugin:3.1:compile (default-compile) @ harvest-scheduler ---
[INFO] Changes detected - recompiling the module!
[INFO] Compiling 13 source files to /home/cibuild02/workspace/NetarchiveSuite-system-test/harvester/harvest-scheduler/target/classes
[INFO] 
[INFO] --- maven-resources-plugin:2.6:testResources (default-testResources) @ harvest-scheduler ---
[INFO] Using 'UTF-8' encoding to copy filtered resources.
[INFO] skip non existing resourceDirectory /home/cibuild02/workspace/NetarchiveSuite-system-test/harvester/harvest-scheduler/src/test/resources
[INFO] 
[INFO] --- maven-compiler-plugin:3.1:testCompile (default-testCompile) @ harvest-scheduler ---
[INFO] Changes detected - recompiling the module!
[INFO] Compiling 5 source files to /home/cibuild02/workspace/NetarchiveSuite-system-test/harvester/harvest-scheduler/target/test-classes
[INFO] 
[INFO] --- maven-surefire-plugin:2.17:test (default-test) @ harvest-scheduler ---
[INFO] Tests are skipped.
[INFO] 
[INFO] --- maven-jgit-buildnumber-plugin:1.2.9:extract-buildnumber (git-buildnumber) @ harvest-scheduler ---
[INFO] 
[INFO] --- maven-jar-plugin:2.4:jar (default-jar) @ harvest-scheduler ---
[INFO] Building jar: /home/cibuild02/workspace/NetarchiveSuite-system-test/harvester/harvest-scheduler/target/harvest-scheduler-5.4-SNAPSHOT.jar
[INFO] 
[INFO] >>> maven-source-plugin:2.2.1:jar (attach-sources) > generate-sources @ harvest-scheduler >>>
[INFO] 
[INFO] --- jacoco-maven-plugin:0.7.9:prepare-agent (agent) @ harvest-scheduler ---
[INFO] argLine set to -javaagent:/home/cibuild02/.m2/repository/org/jacoco/org.jacoco.agent/0.7.9/org.jacoco.agent-0.7.9-runtime.jar=destfile=/home/cibuild02/workspace/NetarchiveSuite-system-test/harvester/harvest-scheduler/../target/jacoco.exec,append=true
[INFO] 
[INFO] <<< maven-source-plugin:2.2.1:jar (attach-sources) < generate-sources @ harvest-scheduler <<<
[INFO] 
[INFO] --- maven-source-plugin:2.2.1:jar (attach-sources) @ harvest-scheduler ---
[INFO] Building jar: /home/cibuild02/workspace/NetarchiveSuite-system-test/harvester/harvest-scheduler/target/harvest-scheduler-5.4-SNAPSHOT-sources.jar
[INFO] 
[INFO] --- maven-javadoc-plugin:2.10.3:jar (attach-javadocs) @ harvest-scheduler ---
[INFO] Building jar: /home/cibuild02/workspace/NetarchiveSuite-system-test/harvester/harvest-scheduler/target/harvest-scheduler-5.4-SNAPSHOT-javadoc.jar
[INFO] 
[INFO] --- maven-install-plugin:2.4:install (default-install) @ harvest-scheduler ---
[INFO] Installing /home/cibuild02/workspace/NetarchiveSuite-system-test/harvester/harvest-scheduler/target/harvest-scheduler-5.4-SNAPSHOT.jar to /home/cibuild02/.m2/repository/org/netarchivesuite/harvest-scheduler/5.4-SNAPSHOT/harvest-scheduler-5.4-SNAPSHOT.jar
[INFO] Installing /home/cibuild02/workspace/NetarchiveSuite-system-test/harvester/harvest-scheduler/pom.xml to /home/cibuild02/.m2/repository/org/netarchivesuite/harvest-scheduler/5.4-SNAPSHOT/harvest-scheduler-5.4-SNAPSHOT.pom
[INFO] Installing /home/cibuild02/workspace/NetarchiveSuite-system-test/harvester/harvest-scheduler/target/harvest-scheduler-5.4-SNAPSHOT-sources.jar to /home/cibuild02/.m2/repository/org/netarchivesuite/harvest-scheduler/5.4-SNAPSHOT/harvest-scheduler-5.4-SNAPSHOT-sources.jar
[INFO] Installing /home/cibuild02/workspace/NetarchiveSuite-system-test/harvester/harvest-scheduler/target/harvest-scheduler-5.4-SNAPSHOT-javadoc.jar to /home/cibuild02/.m2/repository/org/netarchivesuite/harvest-scheduler/5.4-SNAPSHOT/harvest-scheduler-5.4-SNAPSHOT-javadoc.jar
[INFO]                                                                         
[INFO] ------------------------------------------------------------------------
[INFO] Building NetarchiveSuite - monitor 5.4-SNAPSHOT
[INFO] ------------------------------------------------------------------------
[INFO] 
[INFO] --- maven-clean-plugin:2.5:clean (default-clean) @ monitor ---
[INFO] 
[INFO] --- maven-jgit-buildnumber-plugin:1.2.9:extract-buildnumber (git-buildnumber) @ monitor ---
[INFO] 
[INFO] >>> maven-source-plugin:2.2.1:jar (attach-sources) > generate-sources @ monitor >>>
[INFO] 
[INFO] <<< maven-source-plugin:2.2.1:jar (attach-sources) < generate-sources @ monitor <<<
[INFO] 
[INFO] --- maven-source-plugin:2.2.1:jar (attach-sources) @ monitor ---
[INFO] 
[INFO] --- maven-javadoc-plugin:2.10.3:jar (attach-javadocs) @ monitor ---
[INFO] Not executing Javadoc as the project is not a Java classpath-capable package
[INFO] 
[INFO] --- maven-install-plugin:2.4:install (default-install) @ monitor ---
[INFO] Installing /home/cibuild02/workspace/NetarchiveSuite-system-test/monitor/pom.xml to /home/cibuild02/.m2/repository/org/netarchivesuite/monitor/5.4-SNAPSHOT/monitor-5.4-SNAPSHOT.pom
[INFO]                                                                         
[INFO] ------------------------------------------------------------------------
[INFO] Building NetarchiveSuite - monitor - core 5.4-SNAPSHOT
[INFO] ------------------------------------------------------------------------
[INFO] 
[INFO] --- maven-clean-plugin:2.5:clean (default-clean) @ monitor-core ---
[INFO] 
[INFO] --- jacoco-maven-plugin:0.7.9:prepare-agent (agent) @ monitor-core ---
[INFO] argLine set to -javaagent:/home/cibuild02/.m2/repository/org/jacoco/org.jacoco.agent/0.7.9/org.jacoco.agent-0.7.9-runtime.jar=destfile=/home/cibuild02/workspace/NetarchiveSuite-system-test/monitor/monitor-core/../target/jacoco.exec,append=true
[INFO] 
[INFO] --- maven-resources-plugin:2.6:resources (default-resources) @ monitor-core ---
[INFO] Using 'UTF-8' encoding to copy filtered resources.
[INFO] Copying 7 resources
[INFO] 
[INFO] --- maven-compiler-plugin:3.1:compile (default-compile) @ monitor-core ---
[INFO] Changes detected - recompiling the module!
[INFO] Compiling 23 source files to /home/cibuild02/workspace/NetarchiveSuite-system-test/monitor/monitor-core/target/classes
[WARNING] /home/cibuild02/workspace/NetarchiveSuite-system-test/monitor/monitor-core/src/main/java/dk/netarkivet/monitor/webinterface/JMXSummaryUtils.java: /home/cibuild02/workspace/NetarchiveSuite-system-test/monitor/monitor-core/src/main/java/dk/netarkivet/monitor/webinterface/JMXSummaryUtils.java uses or overrides a deprecated API.
[WARNING] /home/cibuild02/workspace/NetarchiveSuite-system-test/monitor/monitor-core/src/main/java/dk/netarkivet/monitor/webinterface/JMXSummaryUtils.java: Recompile with -Xlint:deprecation for details.
[INFO] 
[INFO] --- maven-resources-plugin:2.6:testResources (default-testResources) @ monitor-core ---
[INFO] Using 'UTF-8' encoding to copy filtered resources.
[INFO] Copying 2 resources
[INFO] 
[INFO] --- maven-compiler-plugin:3.1:testCompile (default-testCompile) @ monitor-core ---
[INFO] Changes detected - recompiling the module!
[INFO] Compiling 6 source files to /home/cibuild02/workspace/NetarchiveSuite-system-test/monitor/monitor-core/target/test-classes
[WARNING] /home/cibuild02/workspace/NetarchiveSuite-system-test/monitor/monitor-core/src/test/java/dk/netarkivet/monitor/jmx/JMXUtilsTester.java:[30,33] com.sun.jndi.rmi.registry.RegistryContextFactory is internal proprietary API and may be removed in a future release
[WARNING] /home/cibuild02/workspace/NetarchiveSuite-system-test/monitor/monitor-core/src/test/java/dk/netarkivet/monitor/jmx/JMXUtilsTester.java:[72,63] com.sun.jndi.rmi.registry.RegistryContextFactory is internal proprietary API and may be removed in a future release
[WARNING] /home/cibuild02/workspace/NetarchiveSuite-system-test/monitor/monitor-core/src/test/java/dk/netarkivet/monitor/jmx/JMXUtilsTester.java:[74,23] com.sun.jndi.rmi.registry.RegistryContextFactory is internal proprietary API and may be removed in a future release
[INFO] 
[INFO] --- maven-surefire-plugin:2.17:test (default-test) @ monitor-core ---
[INFO] Tests are skipped.
[INFO] 
[INFO] --- maven-jgit-buildnumber-plugin:1.2.9:extract-buildnumber (git-buildnumber) @ monitor-core ---
[INFO] 
[INFO] --- maven-jar-plugin:2.4:jar (default-jar) @ monitor-core ---
[INFO] Building jar: /home/cibuild02/workspace/NetarchiveSuite-system-test/monitor/monitor-core/target/monitor-core-5.4-SNAPSHOT.jar
[INFO] 
[INFO] >>> maven-source-plugin:2.2.1:jar (attach-sources) > generate-sources @ monitor-core >>>
[INFO] 
[INFO] --- jacoco-maven-plugin:0.7.9:prepare-agent (agent) @ monitor-core ---
[INFO] argLine set to -javaagent:/home/cibuild02/.m2/repository/org/jacoco/org.jacoco.agent/0.7.9/org.jacoco.agent-0.7.9-runtime.jar=destfile=/home/cibuild02/workspace/NetarchiveSuite-system-test/monitor/monitor-core/../target/jacoco.exec,append=true
[INFO] 
[INFO] <<< maven-source-plugin:2.2.1:jar (attach-sources) < generate-sources @ monitor-core <<<
[INFO] 
[INFO] --- maven-source-plugin:2.2.1:jar (attach-sources) @ monitor-core ---
[INFO] Building jar: /home/cibuild02/workspace/NetarchiveSuite-system-test/monitor/monitor-core/target/monitor-core-5.4-SNAPSHOT-sources.jar
[INFO] 
[INFO] --- maven-javadoc-plugin:2.10.3:jar (attach-javadocs) @ monitor-core ---
[INFO] Building jar: /home/cibuild02/workspace/NetarchiveSuite-system-test/monitor/monitor-core/target/monitor-core-5.4-SNAPSHOT-javadoc.jar
[INFO] 
[INFO] --- maven-install-plugin:2.4:install (default-install) @ monitor-core ---
[INFO] Installing /home/cibuild02/workspace/NetarchiveSuite-system-test/monitor/monitor-core/target/monitor-core-5.4-SNAPSHOT.jar to /home/cibuild02/.m2/repository/org/netarchivesuite/monitor-core/5.4-SNAPSHOT/monitor-core-5.4-SNAPSHOT.jar
[INFO] Installing /home/cibuild02/workspace/NetarchiveSuite-system-test/monitor/monitor-core/pom.xml to /home/cibuild02/.m2/repository/org/netarchivesuite/monitor-core/5.4-SNAPSHOT/monitor-core-5.4-SNAPSHOT.pom
[INFO] Installing /home/cibuild02/workspace/NetarchiveSuite-system-test/monitor/monitor-core/target/monitor-core-5.4-SNAPSHOT-sources.jar to /home/cibuild02/.m2/repository/org/netarchivesuite/monitor-core/5.4-SNAPSHOT/monitor-core-5.4-SNAPSHOT-sources.jar
[INFO] Installing /home/cibuild02/workspace/NetarchiveSuite-system-test/monitor/monitor-core/target/monitor-core-5.4-SNAPSHOT-javadoc.jar to /home/cibuild02/.m2/repository/org/netarchivesuite/monitor-core/5.4-SNAPSHOT/monitor-core-5.4-SNAPSHOT-javadoc.jar
[INFO]                                                                         
[INFO] ------------------------------------------------------------------------
[INFO] Building NetarchiveSuite - wayback 5.4-SNAPSHOT
[INFO] ------------------------------------------------------------------------
[INFO] 
[INFO] --- maven-clean-plugin:2.5:clean (default-clean) @ wayback ---
[INFO] 
[INFO] --- maven-jgit-buildnumber-plugin:1.2.9:extract-buildnumber (git-buildnumber) @ wayback ---
[INFO] 
[INFO] >>> maven-source-plugin:2.2.1:jar (attach-sources) > generate-sources @ wayback >>>
[INFO] 
[INFO] <<< maven-source-plugin:2.2.1:jar (attach-sources) < generate-sources @ wayback <<<
[INFO] 
[INFO] --- maven-source-plugin:2.2.1:jar (attach-sources) @ wayback ---
[INFO] 
[INFO] --- maven-javadoc-plugin:2.10.3:jar (attach-javadocs) @ wayback ---
[INFO] Not executing Javadoc as the project is not a Java classpath-capable package
[INFO] 
[INFO] --- maven-install-plugin:2.4:install (default-install) @ wayback ---
[INFO] Installing /home/cibuild02/workspace/NetarchiveSuite-system-test/wayback/pom.xml to /home/cibuild02/.m2/repository/org/netarchivesuite/wayback/5.4-SNAPSHOT/wayback-5.4-SNAPSHOT.pom
[INFO]                                                                         
[INFO] ------------------------------------------------------------------------
[INFO] Building NetarchiveSuite - wayback - indexer 5.4-SNAPSHOT
[INFO] ------------------------------------------------------------------------
[INFO] 
[INFO] --- maven-clean-plugin:2.5:clean (default-clean) @ wayback-indexer ---
[INFO] 
[INFO] --- jacoco-maven-plugin:0.7.9:prepare-agent (agent) @ wayback-indexer ---
[INFO] argLine set to -javaagent:/home/cibuild02/.m2/repository/org/jacoco/org.jacoco.agent/0.7.9/org.jacoco.agent-0.7.9-runtime.jar=destfile=/home/cibuild02/workspace/NetarchiveSuite-system-test/wayback/wayback-indexer/../target/jacoco.exec,append=true
[INFO] 
[INFO] --- maven-resources-plugin:2.6:resources (default-resources) @ wayback-indexer ---
[INFO] Using 'UTF-8' encoding to copy filtered resources.
[INFO] Copying 1 resource
[INFO] 
[INFO] --- maven-compiler-plugin:3.1:compile (default-compile) @ wayback-indexer ---
[INFO] Changes detected - recompiling the module!
[INFO] Compiling 21 source files to /home/cibuild02/workspace/NetarchiveSuite-system-test/wayback/wayback-indexer/target/classes
[INFO] 
[INFO] --- maven-resources-plugin:2.6:testResources (default-testResources) @ wayback-indexer ---
[INFO] Using 'UTF-8' encoding to copy filtered resources.
[INFO] Copying 1 resource
[INFO] 
[INFO] --- maven-compiler-plugin:3.1:testCompile (default-testCompile) @ wayback-indexer ---
[INFO] Changes detected - recompiling the module!
[INFO] Compiling 2 source files to /home/cibuild02/workspace/NetarchiveSuite-system-test/wayback/wayback-indexer/target/test-classes
[INFO] 
[INFO] --- maven-surefire-plugin:2.17:test (default-test) @ wayback-indexer ---
[INFO] Tests are skipped.
[INFO] 
[INFO] --- maven-jgit-buildnumber-plugin:1.2.9:extract-buildnumber (git-buildnumber) @ wayback-indexer ---
[INFO] 
[INFO] --- maven-jar-plugin:2.4:jar (default-jar) @ wayback-indexer ---
[INFO] Building jar: /home/cibuild02/workspace/NetarchiveSuite-system-test/wayback/wayback-indexer/target/wayback-indexer-5.4-SNAPSHOT.jar
[INFO] 
[INFO] >>> maven-source-plugin:2.2.1:jar (attach-sources) > generate-sources @ wayback-indexer >>>
[INFO] 
[INFO] --- jacoco-maven-plugin:0.7.9:prepare-agent (agent) @ wayback-indexer ---
[INFO] argLine set to -javaagent:/home/cibuild02/.m2/repository/org/jacoco/org.jacoco.agent/0.7.9/org.jacoco.agent-0.7.9-runtime.jar=destfile=/home/cibuild02/workspace/NetarchiveSuite-system-test/wayback/wayback-indexer/../target/jacoco.exec,append=true
[INFO] 
[INFO] <<< maven-source-plugin:2.2.1:jar (attach-sources) < generate-sources @ wayback-indexer <<<
[INFO] 
[INFO] --- maven-source-plugin:2.2.1:jar (attach-sources) @ wayback-indexer ---
[INFO] Building jar: /home/cibuild02/workspace/NetarchiveSuite-system-test/wayback/wayback-indexer/target/wayback-indexer-5.4-SNAPSHOT-sources.jar
[INFO] 
[INFO] --- maven-javadoc-plugin:2.10.3:jar (attach-javadocs) @ wayback-indexer ---
[INFO] Building jar: /home/cibuild02/workspace/NetarchiveSuite-system-test/wayback/wayback-indexer/target/wayback-indexer-5.4-SNAPSHOT-javadoc.jar
[INFO] 
[INFO] --- maven-install-plugin:2.4:install (default-install) @ wayback-indexer ---
[INFO] Installing /home/cibuild02/workspace/NetarchiveSuite-system-test/wayback/wayback-indexer/target/wayback-indexer-5.4-SNAPSHOT.jar to /home/cibuild02/.m2/repository/org/netarchivesuite/wayback-indexer/5.4-SNAPSHOT/wayback-indexer-5.4-SNAPSHOT.jar
[INFO] Installing /home/cibuild02/workspace/NetarchiveSuite-system-test/wayback/wayback-indexer/pom.xml to /home/cibuild02/.m2/repository/org/netarchivesuite/wayback-indexer/5.4-SNAPSHOT/wayback-indexer-5.4-SNAPSHOT.pom
[INFO] Installing /home/cibuild02/workspace/NetarchiveSuite-system-test/wayback/wayback-indexer/target/wayback-indexer-5.4-SNAPSHOT-sources.jar to /home/cibuild02/.m2/repository/org/netarchivesuite/wayback-indexer/5.4-SNAPSHOT/wayback-indexer-5.4-SNAPSHOT-sources.jar
[INFO] Installing /home/cibuild02/workspace/NetarchiveSuite-system-test/wayback/wayback-indexer/target/wayback-indexer-5.4-SNAPSHOT-javadoc.jar to /home/cibuild02/.m2/repository/org/netarchivesuite/wayback-indexer/5.4-SNAPSHOT/wayback-indexer-5.4-SNAPSHOT-javadoc.jar
[INFO]                                                                         
[INFO] ------------------------------------------------------------------------
[INFO] Building NetarchiveSuite - deploy 5.4-SNAPSHOT
[INFO] ------------------------------------------------------------------------
[INFO] 
[INFO] --- maven-clean-plugin:2.5:clean (default-clean) @ deploy ---
[INFO] 
[INFO] --- maven-jgit-buildnumber-plugin:1.2.9:extract-buildnumber (git-buildnumber) @ deploy ---
[INFO] 
[INFO] >>> maven-source-plugin:2.2.1:jar (attach-sources) > generate-sources @ deploy >>>
[INFO] 
[INFO] <<< maven-source-plugin:2.2.1:jar (attach-sources) < generate-sources @ deploy <<<
[INFO] 
[INFO] --- maven-source-plugin:2.2.1:jar (attach-sources) @ deploy ---
[INFO] 
[INFO] --- maven-javadoc-plugin:2.10.3:jar (attach-javadocs) @ deploy ---
[INFO] Not executing Javadoc as the project is not a Java classpath-capable package
[INFO] 
[INFO] --- maven-install-plugin:2.4:install (default-install) @ deploy ---
[INFO] Installing /home/cibuild02/workspace/NetarchiveSuite-system-test/deploy/pom.xml to /home/cibuild02/.m2/repository/org/netarchivesuite/deploy/5.4-SNAPSHOT/deploy-5.4-SNAPSHOT.pom
[INFO]                                                                         
[INFO] ------------------------------------------------------------------------
[INFO] Building NetarchiveSuite - deploy - core 5.4-SNAPSHOT
[INFO] ------------------------------------------------------------------------
[INFO] 
[INFO] --- maven-clean-plugin:2.5:clean (default-clean) @ deploy-core ---
[INFO] 
[INFO] --- jacoco-maven-plugin:0.7.9:prepare-agent (agent) @ deploy-core ---
[INFO] argLine set to -javaagent:/home/cibuild02/.m2/repository/org/jacoco/org.jacoco.agent/0.7.9/org.jacoco.agent-0.7.9-runtime.jar=destfile=/home/cibuild02/workspace/NetarchiveSuite-system-test/deploy/deploy-core/../target/jacoco.exec,append=true
[INFO] 
[INFO] --- maven-resources-plugin:2.6:resources (default-resources) @ deploy-core ---
[INFO] Using 'UTF-8' encoding to copy filtered resources.
[INFO] Copying 1 resource
[INFO] 
[INFO] --- maven-compiler-plugin:3.1:compile (default-compile) @ deploy-core ---
[INFO] Changes detected - recompiling the module!
[INFO] Compiling 16 source files to /home/cibuild02/workspace/NetarchiveSuite-system-test/deploy/deploy-core/target/classes
[INFO] 
[INFO] --- maven-resources-plugin:2.6:testResources (default-testResources) @ deploy-core ---
[INFO] Using 'UTF-8' encoding to copy filtered resources.
[INFO] Copying 8 resources
[INFO] 
[INFO] --- maven-compiler-plugin:3.1:testCompile (default-testCompile) @ deploy-core ---
[INFO] Changes detected - recompiling the module!
[INFO] Compiling 3 source files to /home/cibuild02/workspace/NetarchiveSuite-system-test/deploy/deploy-core/target/test-classes
[INFO] 
[INFO] --- maven-surefire-plugin:2.17:test (default-test) @ deploy-core ---
[INFO] Tests are skipped.
[INFO] 
[INFO] --- maven-jgit-buildnumber-plugin:1.2.9:extract-buildnumber (git-buildnumber) @ deploy-core ---
[INFO] 
[INFO] --- maven-jar-plugin:2.4:jar (default-jar) @ deploy-core ---
[INFO] Building jar: /home/cibuild02/workspace/NetarchiveSuite-system-test/deploy/deploy-core/target/deploy-core-5.4-SNAPSHOT.jar
[INFO] 
[INFO] >>> maven-source-plugin:2.2.1:jar (attach-sources) > generate-sources @ deploy-core >>>
[INFO] 
[INFO] --- jacoco-maven-plugin:0.7.9:prepare-agent (agent) @ deploy-core ---
[INFO] argLine set to -javaagent:/home/cibuild02/.m2/repository/org/jacoco/org.jacoco.agent/0.7.9/org.jacoco.agent-0.7.9-runtime.jar=destfile=/home/cibuild02/workspace/NetarchiveSuite-system-test/deploy/deploy-core/../target/jacoco.exec,append=true
[INFO] 
[INFO] <<< maven-source-plugin:2.2.1:jar (attach-sources) < generate-sources @ deploy-core <<<
[INFO] 
[INFO] --- maven-source-plugin:2.2.1:jar (attach-sources) @ deploy-core ---
[INFO] Building jar: /home/cibuild02/workspace/NetarchiveSuite-system-test/deploy/deploy-core/target/deploy-core-5.4-SNAPSHOT-sources.jar
[INFO] 
[INFO] --- maven-javadoc-plugin:2.10.3:jar (attach-javadocs) @ deploy-core ---
[INFO] Building jar: /home/cibuild02/workspace/NetarchiveSuite-system-test/deploy/deploy-core/target/deploy-core-5.4-SNAPSHOT-javadoc.jar
[INFO] 
[INFO] --- maven-install-plugin:2.4:install (default-install) @ deploy-core ---
[INFO] Installing /home/cibuild02/workspace/NetarchiveSuite-system-test/deploy/deploy-core/target/deploy-core-5.4-SNAPSHOT.jar to /home/cibuild02/.m2/repository/org/netarchivesuite/deploy-core/5.4-SNAPSHOT/deploy-core-5.4-SNAPSHOT.jar
[INFO] Installing /home/cibuild02/workspace/NetarchiveSuite-system-test/deploy/deploy-core/pom.xml to /home/cibuild02/.m2/repository/org/netarchivesuite/deploy-core/5.4-SNAPSHOT/deploy-core-5.4-SNAPSHOT.pom
[INFO] Installing /home/cibuild02/workspace/NetarchiveSuite-system-test/deploy/deploy-core/target/deploy-core-5.4-SNAPSHOT-sources.jar to /home/cibuild02/.m2/repository/org/netarchivesuite/deploy-core/5.4-SNAPSHOT/deploy-core-5.4-SNAPSHOT-sources.jar
[INFO] Installing /home/cibuild02/workspace/NetarchiveSuite-system-test/deploy/deploy-core/target/deploy-core-5.4-SNAPSHOT-javadoc.jar to /home/cibuild02/.m2/repository/org/netarchivesuite/deploy-core/5.4-SNAPSHOT/deploy-core-5.4-SNAPSHOT-javadoc.jar
[INFO]                                                                         
[INFO] ------------------------------------------------------------------------
[INFO] Building NetarchiveSuite - harvester - heritrix3 5.4-SNAPSHOT
[INFO] ------------------------------------------------------------------------
[INFO] 
[INFO] --- maven-clean-plugin:2.5:clean (default-clean) @ heritrix3 ---
[INFO] 
[INFO] --- maven-jgit-buildnumber-plugin:1.2.9:extract-buildnumber (git-buildnumber) @ heritrix3 ---
[INFO] 
[INFO] >>> maven-source-plugin:2.2.1:jar (attach-sources) > generate-sources @ heritrix3 >>>
[INFO] 
[INFO] <<< maven-source-plugin:2.2.1:jar (attach-sources) < generate-sources @ heritrix3 <<<
[INFO] 
[INFO] --- maven-source-plugin:2.2.1:jar (attach-sources) @ heritrix3 ---
[INFO] 
[INFO] --- maven-javadoc-plugin:2.10.3:jar (attach-javadocs) @ heritrix3 ---
[INFO] Not executing Javadoc as the project is not a Java classpath-capable package
[INFO] 
[INFO] --- maven-install-plugin:2.4:install (default-install) @ heritrix3 ---
[INFO] Installing /home/cibuild02/workspace/NetarchiveSuite-system-test/harvester/heritrix3/pom.xml to /home/cibuild02/.m2/repository/org/netarchivesuite/heritrix3/5.4-SNAPSHOT/heritrix3-5.4-SNAPSHOT.pom
[INFO]                                                                         
[INFO] ------------------------------------------------------------------------
[INFO] Building Netarchivesuite - Heritrix3 Extensions 5.4-SNAPSHOT
[INFO] ------------------------------------------------------------------------
[INFO] 
[INFO] --- maven-clean-plugin:2.5:clean (default-clean) @ heritrix3-extensions ---
[INFO] 
[INFO] --- maven-resources-plugin:2.6:resources (default-resources) @ heritrix3-extensions ---
[INFO] Using 'UTF-8' encoding to copy filtered resources.
[INFO] skip non existing resourceDirectory /home/cibuild02/workspace/NetarchiveSuite-system-test/harvester/heritrix3/heritrix3-extensions/src/main/resources
[INFO] 
[INFO] --- maven-compiler-plugin:3.1:compile (default-compile) @ heritrix3-extensions ---
[INFO] Changes detected - recompiling the module!
[INFO] Compiling 14 source files to /home/cibuild02/workspace/NetarchiveSuite-system-test/harvester/heritrix3/heritrix3-extensions/target/classes
[WARNING] /home/cibuild02/workspace/NetarchiveSuite-system-test/harvester/heritrix3/heritrix3-extensions/src/main/java/org/archive/crawler/framework/ToeThread.java: /home/cibuild02/workspace/NetarchiveSuite-system-test/harvester/heritrix3/heritrix3-extensions/src/main/java/org/archive/crawler/framework/ToeThread.java uses or overrides a deprecated API.
[WARNING] /home/cibuild02/workspace/NetarchiveSuite-system-test/harvester/heritrix3/heritrix3-extensions/src/main/java/org/archive/crawler/framework/ToeThread.java: Recompile with -Xlint:deprecation for details.
[INFO] 
[INFO] --- maven-resources-plugin:2.6:testResources (default-testResources) @ heritrix3-extensions ---
[INFO] Using 'UTF-8' encoding to copy filtered resources.
[INFO] skip non existing resourceDirectory /home/cibuild02/workspace/NetarchiveSuite-system-test/harvester/heritrix3/heritrix3-extensions/src/test/resources
[INFO] 
[INFO] --- maven-compiler-plugin:3.1:testCompile (default-testCompile) @ heritrix3-extensions ---
[INFO] Changes detected - recompiling the module!
[INFO] Compiling 9 source files to /home/cibuild02/workspace/NetarchiveSuite-system-test/harvester/heritrix3/heritrix3-extensions/target/test-classes
[WARNING] /home/cibuild02/workspace/NetarchiveSuite-system-test/harvester/heritrix3/heritrix3-extensions/src/test/java/dk/netarkivet/harvester/harvesting/extractor/ExtractorOAITest.java: /home/cibuild02/workspace/NetarchiveSuite-system-test/harvester/heritrix3/heritrix3-extensions/src/test/java/dk/netarkivet/harvester/harvesting/extractor/ExtractorOAITest.java uses or overrides a deprecated API.
[WARNING] /home/cibuild02/workspace/NetarchiveSuite-system-test/harvester/heritrix3/heritrix3-extensions/src/test/java/dk/netarkivet/harvester/harvesting/extractor/ExtractorOAITest.java: Recompile with -Xlint:deprecation for details.
[INFO] 
[INFO] --- maven-surefire-plugin:2.17:test (default-test) @ heritrix3-extensions ---
[INFO] Tests are skipped.
[INFO] 
[INFO] --- maven-jgit-buildnumber-plugin:1.2.9:extract-buildnumber (git-buildnumber) @ heritrix3-extensions ---
[INFO] 
[INFO] --- maven-jar-plugin:2.4:jar (default-jar) @ heritrix3-extensions ---
[INFO] Building jar: /home/cibuild02/workspace/NetarchiveSuite-system-test/harvester/heritrix3/heritrix3-extensions/target/heritrix3-extensions-5.4-SNAPSHOT.jar
[INFO] 
[INFO] >>> maven-source-plugin:2.2.1:jar (attach-sources) > generate-sources @ heritrix3-extensions >>>
[INFO] 
[INFO] <<< maven-source-plugin:2.2.1:jar (attach-sources) < generate-sources @ heritrix3-extensions <<<
[INFO] 
[INFO] --- maven-source-plugin:2.2.1:jar (attach-sources) @ heritrix3-extensions ---
[INFO] Building jar: /home/cibuild02/workspace/NetarchiveSuite-system-test/harvester/heritrix3/heritrix3-extensions/target/heritrix3-extensions-5.4-SNAPSHOT-sources.jar
[INFO] 
[INFO] --- maven-javadoc-plugin:2.10.3:jar (attach-javadocs) @ heritrix3-extensions ---
[INFO] 
1 warning
[WARNING] Javadoc Warnings
[WARNING] /home/cibuild02/workspace/NetarchiveSuite-system-test/harvester/heritrix3/heritrix3-extensions/src/main/java/dk/netarkivet/harvester/harvesting/extractor/IcelandicExtractorJS.java:66: warning - @contributor is an unknown tag.
[INFO] Building jar: /home/cibuild02/workspace/NetarchiveSuite-system-test/harvester/heritrix3/heritrix3-extensions/target/heritrix3-extensions-5.4-SNAPSHOT-javadoc.jar
[INFO] 
[INFO] --- maven-install-plugin:2.4:install (default-install) @ heritrix3-extensions ---
[INFO] Installing /home/cibuild02/workspace/NetarchiveSuite-system-test/harvester/heritrix3/heritrix3-extensions/target/heritrix3-extensions-5.4-SNAPSHOT.jar to /home/cibuild02/.m2/repository/org/netarchivesuite/heritrix3-extensions/5.4-SNAPSHOT/heritrix3-extensions-5.4-SNAPSHOT.jar
[INFO] Installing /home/cibuild02/workspace/NetarchiveSuite-system-test/harvester/heritrix3/heritrix3-extensions/pom.xml to /home/cibuild02/.m2/repository/org/netarchivesuite/heritrix3-extensions/5.4-SNAPSHOT/heritrix3-extensions-5.4-SNAPSHOT.pom
[INFO] Installing /home/cibuild02/workspace/NetarchiveSuite-system-test/harvester/heritrix3/heritrix3-extensions/target/heritrix3-extensions-5.4-SNAPSHOT-sources.jar to /home/cibuild02/.m2/repository/org/netarchivesuite/heritrix3-extensions/5.4-SNAPSHOT/heritrix3-extensions-5.4-SNAPSHOT-sources.jar
[INFO] Installing /home/cibuild02/workspace/NetarchiveSuite-system-test/harvester/heritrix3/heritrix3-extensions/target/heritrix3-extensions-5.4-SNAPSHOT-javadoc.jar to /home/cibuild02/.m2/repository/org/netarchivesuite/heritrix3-extensions/5.4-SNAPSHOT/heritrix3-extensions-5.4-SNAPSHOT-javadoc.jar
[INFO]                                                                         
[INFO] ------------------------------------------------------------------------
[INFO] Building NetarchiveSuite - heritrix3 controller 5.4-SNAPSHOT
[INFO] ------------------------------------------------------------------------
[INFO] 
[INFO] --- maven-clean-plugin:2.5:clean (default-clean) @ heritrix3-controller ---
[INFO] 
[INFO] --- maven-resources-plugin:2.6:resources (default-resources) @ heritrix3-controller ---
[INFO] Using 'UTF-8' encoding to copy filtered resources.
[INFO] Copying 1 resource
[INFO] 
[INFO] --- maven-compiler-plugin:3.1:compile (default-compile) @ heritrix3-controller ---
[INFO] Changes detected - recompiling the module!
[INFO] Compiling 22 source files to /home/cibuild02/workspace/NetarchiveSuite-system-test/harvester/heritrix3/heritrix3-controller/target/classes
[INFO] 
[INFO] --- maven-resources-plugin:2.6:testResources (default-testResources) @ heritrix3-controller ---
[INFO] Using 'UTF-8' encoding to copy filtered resources.
[INFO] Copying 3 resources
[INFO] 
[INFO] --- maven-compiler-plugin:3.1:testCompile (default-testCompile) @ heritrix3-controller ---
[INFO] Changes detected - recompiling the module!
[INFO] Compiling 3 source files to /home/cibuild02/workspace/NetarchiveSuite-system-test/harvester/heritrix3/heritrix3-controller/target/test-classes
[INFO] 
[INFO] --- maven-surefire-plugin:2.17:test (default-test) @ heritrix3-controller ---
[INFO] Tests are skipped.
[INFO] 
[INFO] --- maven-jgit-buildnumber-plugin:1.2.9:extract-buildnumber (git-buildnumber) @ heritrix3-controller ---
[INFO] 
[INFO] --- maven-jar-plugin:2.4:jar (default-jar) @ heritrix3-controller ---
[INFO] Building jar: /home/cibuild02/workspace/NetarchiveSuite-system-test/harvester/heritrix3/heritrix3-controller/target/heritrix3-controller-5.4-SNAPSHOT.jar
[INFO] 
[INFO] >>> maven-source-plugin:2.2.1:jar (attach-sources) > generate-sources @ heritrix3-controller >>>
[INFO] 
[INFO] <<< maven-source-plugin:2.2.1:jar (attach-sources) < generate-sources @ heritrix3-controller <<<
[INFO] 
[INFO] --- maven-source-plugin:2.2.1:jar (attach-sources) @ heritrix3-controller ---
[INFO] Building jar: /home/cibuild02/workspace/NetarchiveSuite-system-test/harvester/heritrix3/heritrix3-controller/target/heritrix3-controller-5.4-SNAPSHOT-sources.jar
[INFO] 
[INFO] --- maven-javadoc-plugin:2.10.3:jar (attach-javadocs) @ heritrix3-controller ---
[INFO] 
3 warnings
[WARNING] Javadoc Warnings
[WARNING] /home/cibuild02/workspace/NetarchiveSuite-system-test/harvester/heritrix3/heritrix3-controller/src/main/java/dk/netarkivet/harvester/heritrix3/Heritrix3Settings.java:174: warning - Tag @see: can't find documentHarvest(dk.netarkivet.harvester.harvesting.IngestableFiles) in dk.netarkivet.harvester.heritrix3.HarvestDocumentation
[WARNING] /home/cibuild02/workspace/NetarchiveSuite-system-test/harvester/heritrix3/heritrix3-controller/src/main/java/dk/netarkivet/harvester/heritrix3/Heritrix3Settings.java:165: warning - Tag @see: can't find documentHarvest(dk.netarkivet.harvester.harvesting.IngestableFiles) in dk.netarkivet.harvester.heritrix3.HarvestDocumentation
[WARNING] /home/cibuild02/workspace/NetarchiveSuite-system-test/harvester/heritrix3/heritrix3-controller/src/main/java/dk/netarkivet/harvester/heritrix3/Heritrix3Settings.java:156: warning - Tag @see: can't find documentHarvest(dk.netarkivet.harvester.harvesting.IngestableFiles) in dk.netarkivet.harvester.heritrix3.HarvestDocumentation
[INFO] Building jar: /home/cibuild02/workspace/NetarchiveSuite-system-test/harvester/heritrix3/heritrix3-controller/target/heritrix3-controller-5.4-SNAPSHOT-javadoc.jar
[INFO] 
[INFO] --- maven-install-plugin:2.4:install (default-install) @ heritrix3-controller ---
[INFO] Installing /home/cibuild02/workspace/NetarchiveSuite-system-test/harvester/heritrix3/heritrix3-controller/target/heritrix3-controller-5.4-SNAPSHOT.jar to /home/cibuild02/.m2/repository/org/netarchivesuite/heritrix3-controller/5.4-SNAPSHOT/heritrix3-controller-5.4-SNAPSHOT.jar
[INFO] Installing /home/cibuild02/workspace/NetarchiveSuite-system-test/harvester/heritrix3/heritrix3-controller/pom.xml to /home/cibuild02/.m2/repository/org/netarchivesuite/heritrix3-controller/5.4-SNAPSHOT/heritrix3-controller-5.4-SNAPSHOT.pom
[INFO] Installing /home/cibuild02/workspace/NetarchiveSuite-system-test/harvester/heritrix3/heritrix3-controller/target/heritrix3-controller-5.4-SNAPSHOT-sources.jar to /home/cibuild02/.m2/repository/org/netarchivesuite/heritrix3-controller/5.4-SNAPSHOT/heritrix3-controller-5.4-SNAPSHOT-sources.jar
[INFO] Installing /home/cibuild02/workspace/NetarchiveSuite-system-test/harvester/heritrix3/heritrix3-controller/target/heritrix3-controller-5.4-SNAPSHOT-javadoc.jar to /home/cibuild02/.m2/repository/org/netarchivesuite/heritrix3-controller/5.4-SNAPSHOT/heritrix3-controller-5.4-SNAPSHOT-javadoc.jar
[INFO]                                                                         
[INFO] ------------------------------------------------------------------------
[INFO] Building NetarchiveSuite - Status - Webapp 5.4-SNAPSHOT
[INFO] ------------------------------------------------------------------------
[INFO] 
[INFO] --- maven-clean-plugin:2.5:clean (default-clean) @ status-gui ---
[INFO] 
[INFO] --- maven-resources-plugin:2.6:resources (default-resources) @ status-gui ---
[INFO] Using 'UTF-8' encoding to copy filtered resources.
[INFO] skip non existing resourceDirectory /home/cibuild02/workspace/NetarchiveSuite-system-test/monitor/status-gui/src/main/resources
[INFO] 
[INFO] --- maven-compiler-plugin:3.1:compile (default-compile) @ status-gui ---
[INFO] No sources to compile
[INFO] 
[INFO] --- maven-resources-plugin:2.6:testResources (default-testResources) @ status-gui ---
[INFO] Using 'UTF-8' encoding to copy filtered resources.
[INFO] skip non existing resourceDirectory /home/cibuild02/workspace/NetarchiveSuite-system-test/monitor/status-gui/src/test/resources
[INFO] 
[INFO] --- maven-compiler-plugin:3.1:testCompile (default-testCompile) @ status-gui ---
[INFO] No sources to compile
[INFO] 
[INFO] --- maven-surefire-plugin:2.17:test (default-test) @ status-gui ---
[INFO] Tests are skipped.
[INFO] 
[INFO] --- maven-jgit-buildnumber-plugin:1.2.9:extract-buildnumber (git-buildnumber) @ status-gui ---
[INFO] 
[INFO] --- maven-war-plugin:2.2:war (default-war) @ status-gui ---
[INFO] Packaging webapp
[INFO] Assembling webapp [status-gui] in [/home/cibuild02/workspace/NetarchiveSuite-system-test/monitor/status-gui/target/Status]
[INFO] Processing war project
[INFO] Copying webapp resources [/home/cibuild02/workspace/NetarchiveSuite-system-test/monitor/status-gui/src/main/webapp]
[INFO] Webapp assembled in [261 msecs]
[INFO] Building war: /home/cibuild02/workspace/NetarchiveSuite-system-test/monitor/status-gui/target/Status.war
[INFO] WEB-INF/web.xml already added, skipping
[INFO] 
[INFO] >>> maven-source-plugin:2.2.1:jar (attach-sources) > generate-sources @ status-gui >>>
[INFO] 
[INFO] <<< maven-source-plugin:2.2.1:jar (attach-sources) < generate-sources @ status-gui <<<
[INFO] 
[INFO] --- maven-source-plugin:2.2.1:jar (attach-sources) @ status-gui ---
[INFO] No sources in project. Archive not created.
[INFO] 
[INFO] --- maven-javadoc-plugin:2.10.3:jar (attach-javadocs) @ status-gui ---
[INFO] 
[INFO] --- maven-install-plugin:2.4:install (default-install) @ status-gui ---
[INFO] Installing /home/cibuild02/workspace/NetarchiveSuite-system-test/monitor/status-gui/target/Status.war to /home/cibuild02/.m2/repository/org/netarchivesuite/status-gui/5.4-SNAPSHOT/status-gui-5.4-SNAPSHOT.war
[INFO] Installing /home/cibuild02/workspace/NetarchiveSuite-system-test/monitor/status-gui/pom.xml to /home/cibuild02/.m2/repository/org/netarchivesuite/status-gui/5.4-SNAPSHOT/status-gui-5.4-SNAPSHOT.pom
[INFO]                                                                         
[INFO] ------------------------------------------------------------------------
[INFO] Building NetarchiveSuite - qa - webapp 5.4-SNAPSHOT
[INFO] ------------------------------------------------------------------------
[INFO] 
[INFO] --- maven-clean-plugin:2.5:clean (default-clean) @ qa-gui ---
[INFO] 
[INFO] --- maven-resources-plugin:2.6:resources (default-resources) @ qa-gui ---
[INFO] Using 'UTF-8' encoding to copy filtered resources.
[INFO] skip non existing resourceDirectory /home/cibuild02/workspace/NetarchiveSuite-system-test/harvester/qa-gui/src/main/resources
[INFO] 
[INFO] --- maven-compiler-plugin:3.1:compile (default-compile) @ qa-gui ---
[INFO] No sources to compile
[INFO] 
[INFO] --- maven-resources-plugin:2.6:testResources (default-testResources) @ qa-gui ---
[INFO] Using 'UTF-8' encoding to copy filtered resources.
[INFO] skip non existing resourceDirectory /home/cibuild02/workspace/NetarchiveSuite-system-test/harvester/qa-gui/src/test/resources
[INFO] 
[INFO] --- maven-compiler-plugin:3.1:testCompile (default-testCompile) @ qa-gui ---
[INFO] No sources to compile
[INFO] 
[INFO] --- maven-surefire-plugin:2.17:test (default-test) @ qa-gui ---
[INFO] Tests are skipped.
[INFO] 
[INFO] --- maven-jgit-buildnumber-plugin:1.2.9:extract-buildnumber (git-buildnumber) @ qa-gui ---
[INFO] 
[INFO] --- maven-war-plugin:2.2:war (default-war) @ qa-gui ---
[INFO] Packaging webapp
[INFO] Assembling webapp [qa-gui] in [/home/cibuild02/workspace/NetarchiveSuite-system-test/harvester/qa-gui/target/QA]
[INFO] Processing war project
[INFO] Copying webapp resources [/home/cibuild02/workspace/NetarchiveSuite-system-test/harvester/qa-gui/src/main/webapp]
[INFO] Webapp assembled in [36 msecs]
[INFO] Building war: /home/cibuild02/workspace/NetarchiveSuite-system-test/harvester/qa-gui/target/QA.war
[INFO] WEB-INF/web.xml already added, skipping
[INFO] 
[INFO] >>> maven-source-plugin:2.2.1:jar (attach-sources) > generate-sources @ qa-gui >>>
[INFO] 
[INFO] <<< maven-source-plugin:2.2.1:jar (attach-sources) < generate-sources @ qa-gui <<<
[INFO] 
[INFO] --- maven-source-plugin:2.2.1:jar (attach-sources) @ qa-gui ---
[INFO] No sources in project. Archive not created.
[INFO] 
[INFO] --- maven-javadoc-plugin:2.10.3:jar (attach-javadocs) @ qa-gui ---
[INFO] 
[INFO] --- maven-install-plugin:2.4:install (default-install) @ qa-gui ---
[INFO] Installing /home/cibuild02/workspace/NetarchiveSuite-system-test/harvester/qa-gui/target/QA.war to /home/cibuild02/.m2/repository/org/netarchivesuite/qa-gui/5.4-SNAPSHOT/qa-gui-5.4-SNAPSHOT.war
[INFO] Installing /home/cibuild02/workspace/NetarchiveSuite-system-test/harvester/qa-gui/pom.xml to /home/cibuild02/.m2/repository/org/netarchivesuite/qa-gui/5.4-SNAPSHOT/qa-gui-5.4-SNAPSHOT.pom
[INFO]                                                                         
[INFO] ------------------------------------------------------------------------
[INFO] Building NetarchiveSuite - history - webapp 5.4-SNAPSHOT
[INFO] ------------------------------------------------------------------------
[INFO] 
[INFO] --- maven-clean-plugin:2.5:clean (default-clean) @ history-gui ---
[INFO] 
[INFO] --- maven-resources-plugin:2.6:resources (default-resources) @ history-gui ---
[INFO] Using 'UTF-8' encoding to copy filtered resources.
[INFO] skip non existing resourceDirectory /home/cibuild02/workspace/NetarchiveSuite-system-test/harvester/history-gui/src/main/resources
[INFO] 
[INFO] --- maven-compiler-plugin:3.1:compile (default-compile) @ history-gui ---
[INFO] No sources to compile
[INFO] 
[INFO] --- maven-resources-plugin:2.6:testResources (default-testResources) @ history-gui ---
[INFO] Using 'UTF-8' encoding to copy filtered resources.
[INFO] skip non existing resourceDirectory /home/cibuild02/workspace/NetarchiveSuite-system-test/harvester/history-gui/src/test/resources
[INFO] 
[INFO] --- maven-compiler-plugin:3.1:testCompile (default-testCompile) @ history-gui ---
[INFO] No sources to compile
[INFO] 
[INFO] --- maven-surefire-plugin:2.17:test (default-test) @ history-gui ---
[INFO] Tests are skipped.
[INFO] 
[INFO] --- maven-jgit-buildnumber-plugin:1.2.9:extract-buildnumber (git-buildnumber) @ history-gui ---
[INFO] 
[INFO] --- maven-war-plugin:2.2:war (default-war) @ history-gui ---
[INFO] Packaging webapp
[INFO] Assembling webapp [history-gui] in [/home/cibuild02/workspace/NetarchiveSuite-system-test/harvester/history-gui/target/History]
[INFO] Processing war project
[INFO] Copying webapp resources [/home/cibuild02/workspace/NetarchiveSuite-system-test/harvester/history-gui/src/main/webapp]
[INFO] Webapp assembled in [112 msecs]
[INFO] Building war: /home/cibuild02/workspace/NetarchiveSuite-system-test/harvester/history-gui/target/History.war
[INFO] WEB-INF/web.xml already added, skipping
[INFO] 
[INFO] >>> maven-source-plugin:2.2.1:jar (attach-sources) > generate-sources @ history-gui >>>
[INFO] 
[INFO] <<< maven-source-plugin:2.2.1:jar (attach-sources) < generate-sources @ history-gui <<<
[INFO] 
[INFO] --- maven-source-plugin:2.2.1:jar (attach-sources) @ history-gui ---
[INFO] No sources in project. Archive not created.
[INFO] 
[INFO] --- maven-javadoc-plugin:2.10.3:jar (attach-javadocs) @ history-gui ---
[INFO] 
[INFO] --- maven-install-plugin:2.4:install (default-install) @ history-gui ---
[INFO] Installing /home/cibuild02/workspace/NetarchiveSuite-system-test/harvester/history-gui/target/History.war to /home/cibuild02/.m2/repository/org/netarchivesuite/history-gui/5.4-SNAPSHOT/history-gui-5.4-SNAPSHOT.war
[INFO] Installing /home/cibuild02/workspace/NetarchiveSuite-system-test/harvester/history-gui/pom.xml to /home/cibuild02/.m2/repository/org/netarchivesuite/history-gui/5.4-SNAPSHOT/history-gui-5.4-SNAPSHOT.pom
[INFO]                                                                         
[INFO] ------------------------------------------------------------------------
[INFO] Building NetarchiveSuite - harvestDefinition - webapp 5.4-SNAPSHOT
[INFO] ------------------------------------------------------------------------
[INFO] 
[INFO] --- maven-clean-plugin:2.5:clean (default-clean) @ harvestdefinition-gui ---
[INFO] 
[INFO] --- maven-resources-plugin:2.6:resources (default-resources) @ harvestdefinition-gui ---
[INFO] Using 'UTF-8' encoding to copy filtered resources.
[INFO] skip non existing resourceDirectory /home/cibuild02/workspace/NetarchiveSuite-system-test/harvester/harvestdefinition-gui/src/main/resources
[INFO] 
[INFO] --- maven-compiler-plugin:3.1:compile (default-compile) @ harvestdefinition-gui ---
[INFO] No sources to compile
[INFO] 
[INFO] --- maven-resources-plugin:2.6:testResources (default-testResources) @ harvestdefinition-gui ---
[INFO] Using 'UTF-8' encoding to copy filtered resources.
[INFO] skip non existing resourceDirectory /home/cibuild02/workspace/NetarchiveSuite-system-test/harvester/harvestdefinition-gui/src/test/resources
[INFO] 
[INFO] --- maven-compiler-plugin:3.1:testCompile (default-testCompile) @ harvestdefinition-gui ---
[INFO] No sources to compile
[INFO] 
[INFO] --- maven-surefire-plugin:2.17:test (default-test) @ harvestdefinition-gui ---
[INFO] Tests are skipped.
[INFO] 
[INFO] --- maven-jgit-buildnumber-plugin:1.2.9:extract-buildnumber (git-buildnumber) @ harvestdefinition-gui ---
[INFO] 
[INFO] --- maven-war-plugin:2.2:war (default-war) @ harvestdefinition-gui ---
[INFO] Packaging webapp
[INFO] Assembling webapp [harvestdefinition-gui] in [/home/cibuild02/workspace/NetarchiveSuite-system-test/harvester/harvestdefinition-gui/target/HarvestDefinition]
[INFO] Processing war project
[INFO] Copying webapp resources [/home/cibuild02/workspace/NetarchiveSuite-system-test/harvester/harvestdefinition-gui/src/main/webapp]
[INFO] Webapp assembled in [106 msecs]
[INFO] Building war: /home/cibuild02/workspace/NetarchiveSuite-system-test/harvester/harvestdefinition-gui/target/HarvestDefinition.war
[INFO] WEB-INF/web.xml already added, skipping
[INFO] 
[INFO] >>> maven-source-plugin:2.2.1:jar (attach-sources) > generate-sources @ harvestdefinition-gui >>>
[INFO] 
[INFO] <<< maven-source-plugin:2.2.1:jar (attach-sources) < generate-sources @ harvestdefinition-gui <<<
[INFO] 
[INFO] --- maven-source-plugin:2.2.1:jar (attach-sources) @ harvestdefinition-gui ---
[INFO] No sources in project. Archive not created.
[INFO] 
[INFO] --- maven-javadoc-plugin:2.10.3:jar (attach-javadocs) @ harvestdefinition-gui ---
[INFO] 
[INFO] --- maven-install-plugin:2.4:install (default-install) @ harvestdefinition-gui ---
[INFO] Installing /home/cibuild02/workspace/NetarchiveSuite-system-test/harvester/harvestdefinition-gui/target/HarvestDefinition.war to /home/cibuild02/.m2/repository/org/netarchivesuite/harvestdefinition-gui/5.4-SNAPSHOT/harvestdefinition-gui-5.4-SNAPSHOT.war
[INFO] Installing /home/cibuild02/workspace/NetarchiveSuite-system-test/harvester/harvestdefinition-gui/pom.xml to /home/cibuild02/.m2/repository/org/netarchivesuite/harvestdefinition-gui/5.4-SNAPSHOT/harvestdefinition-gui-5.4-SNAPSHOT.pom
[INFO]                                                                         
[INFO] ------------------------------------------------------------------------
[INFO] Building NetarchiveSuite - harvestChannel - webapp 5.4-SNAPSHOT
[INFO] ------------------------------------------------------------------------
[INFO] 
[INFO] --- maven-clean-plugin:2.5:clean (default-clean) @ harvestchannel-gui ---
[INFO] 
[INFO] --- maven-resources-plugin:2.6:resources (default-resources) @ harvestchannel-gui ---
[INFO] Using 'UTF-8' encoding to copy filtered resources.
[INFO] skip non existing resourceDirectory /home/cibuild02/workspace/NetarchiveSuite-system-test/harvester/harvestchannel-gui/src/main/resources
[INFO] 
[INFO] --- maven-compiler-plugin:3.1:compile (default-compile) @ harvestchannel-gui ---
[INFO] No sources to compile
[INFO] 
[INFO] --- maven-resources-plugin:2.6:testResources (default-testResources) @ harvestchannel-gui ---
[INFO] Using 'UTF-8' encoding to copy filtered resources.
[INFO] skip non existing resourceDirectory /home/cibuild02/workspace/NetarchiveSuite-system-test/harvester/harvestchannel-gui/src/test/resources
[INFO] 
[INFO] --- maven-compiler-plugin:3.1:testCompile (default-testCompile) @ harvestchannel-gui ---
[INFO] No sources to compile
[INFO] 
[INFO] --- maven-surefire-plugin:2.17:test (default-test) @ harvestchannel-gui ---
[INFO] Tests are skipped.
[INFO] 
[INFO] --- maven-jgit-buildnumber-plugin:1.2.9:extract-buildnumber (git-buildnumber) @ harvestchannel-gui ---
[INFO] 
[INFO] --- maven-war-plugin:2.2:war (default-war) @ harvestchannel-gui ---
[INFO] Packaging webapp
[INFO] Assembling webapp [harvestchannel-gui] in [/home/cibuild02/workspace/NetarchiveSuite-system-test/harvester/harvestchannel-gui/target/HarvestChannel]
[INFO] Processing war project
[INFO] Copying webapp resources [/home/cibuild02/workspace/NetarchiveSuite-system-test/harvester/harvestchannel-gui/src/main/webapp]
[INFO] Webapp assembled in [47 msecs]
[INFO] Building war: /home/cibuild02/workspace/NetarchiveSuite-system-test/harvester/harvestchannel-gui/target/HarvestChannel.war
[INFO] WEB-INF/web.xml already added, skipping
[INFO] 
[INFO] >>> maven-source-plugin:2.2.1:jar (attach-sources) > generate-sources @ harvestchannel-gui >>>
[INFO] 
[INFO] <<< maven-source-plugin:2.2.1:jar (attach-sources) < generate-sources @ harvestchannel-gui <<<
[INFO] 
[INFO] --- maven-source-plugin:2.2.1:jar (attach-sources) @ harvestchannel-gui ---
[INFO] No sources in project. Archive not created.
[INFO] 
[INFO] --- maven-javadoc-plugin:2.10.3:jar (attach-javadocs) @ harvestchannel-gui ---
[INFO] 
[INFO] --- maven-install-plugin:2.4:install (default-install) @ harvestchannel-gui ---
[INFO] Installing /home/cibuild02/workspace/NetarchiveSuite-system-test/harvester/harvestchannel-gui/target/HarvestChannel.war to /home/cibuild02/.m2/repository/org/netarchivesuite/harvestchannel-gui/5.4-SNAPSHOT/harvestchannel-gui-5.4-SNAPSHOT.war
[INFO] Installing /home/cibuild02/workspace/NetarchiveSuite-system-test/harvester/harvestchannel-gui/pom.xml to /home/cibuild02/.m2/repository/org/netarchivesuite/harvestchannel-gui/5.4-SNAPSHOT/harvestchannel-gui-5.4-SNAPSHOT.pom
[INFO]                                                                         
[INFO] ------------------------------------------------------------------------
[INFO] Building NetarchiveSuite - deploy - distribution 5.4-SNAPSHOT
[INFO] ------------------------------------------------------------------------
[INFO] 
[INFO] --- maven-clean-plugin:2.5:clean (default-clean) @ distribution ---
[INFO] 
[INFO] --- maven-jgit-buildnumber-plugin:1.2.9:extract-buildnumber (git-buildnumber) @ distribution ---
[INFO] 
[INFO] --- maven-assembly-plugin:2.4.1:single (distro-assembly) @ distribution ---
[INFO] Reading assembly descriptor: src/main/assembly/distribution.xml
[INFO] Building zip: /home/cibuild02/workspace/NetarchiveSuite-system-test/deploy/distribution/target/NetarchiveSuite-5.4-SNAPSHOT.zip
[INFO] 
[INFO] >>> maven-source-plugin:2.2.1:jar (attach-sources) > generate-sources @ distribution >>>
[INFO] 
[INFO] <<< maven-source-plugin:2.2.1:jar (attach-sources) < generate-sources @ distribution <<<
[INFO] 
[INFO] --- maven-source-plugin:2.2.1:jar (attach-sources) @ distribution ---
[INFO] 
[INFO] --- maven-javadoc-plugin:2.10.3:jar (attach-javadocs) @ distribution ---
[INFO] Not executing Javadoc as the project is not a Java classpath-capable package
[INFO] 
[INFO] --- maven-install-plugin:2.4:install (default-install) @ distribution ---
[INFO] Installing /home/cibuild02/workspace/NetarchiveSuite-system-test/deploy/distribution/pom.xml to /home/cibuild02/.m2/repository/org/netarchivesuite/distribution/5.4-SNAPSHOT/distribution-5.4-SNAPSHOT.pom
[INFO] Installing /home/cibuild02/workspace/NetarchiveSuite-system-test/deploy/distribution/target/NetarchiveSuite-5.4-SNAPSHOT.zip to /home/cibuild02/.m2/repository/org/netarchivesuite/distribution/5.4-SNAPSHOT/distribution-5.4-SNAPSHOT.zip
[INFO]                                                                         
[INFO] ------------------------------------------------------------------------
[INFO] Building NetarchiveSuite - deploy - test 5.4-SNAPSHOT
[INFO] ------------------------------------------------------------------------
[INFO] 
[INFO] --- maven-clean-plugin:2.5:clean (default-clean) @ deploy-test ---
[INFO] 
[INFO] --- jacoco-maven-plugin:0.7.9:prepare-agent (agent) @ deploy-test ---
[INFO] argLine set to -javaagent:/home/cibuild02/.m2/repository/org/jacoco/org.jacoco.agent/0.7.9/org.jacoco.agent-0.7.9-runtime.jar=destfile=/home/cibuild02/workspace/NetarchiveSuite-system-test/deploy/deploy-test/../target/jacoco.exec,append=true
[INFO] 
[INFO] --- maven-resources-plugin:2.6:resources (default-resources) @ deploy-test ---
[INFO] Using 'UTF-8' encoding to copy filtered resources.
[INFO] skip non existing resourceDirectory /home/cibuild02/workspace/NetarchiveSuite-system-test/deploy/deploy-test/src/main/resources
[INFO] 
[INFO] --- maven-compiler-plugin:3.1:compile (default-compile) @ deploy-test ---
[INFO] No sources to compile
[INFO] 
[INFO] --- maven-resources-plugin:2.6:testResources (default-testResources) @ deploy-test ---
[INFO] Using 'UTF-8' encoding to copy filtered resources.
[INFO] Copying 2 resources
[INFO] Copying 502 resources
[INFO] 
[INFO] --- maven-compiler-plugin:3.1:testCompile (default-testCompile) @ deploy-test ---
[INFO] Changes detected - recompiling the module!
[INFO] Compiling 11 source files to /home/cibuild02/workspace/NetarchiveSuite-system-test/deploy/deploy-test/target/test-classes
[INFO] 
[INFO] --- maven-surefire-plugin:2.17:test (default-test) @ deploy-test ---
[INFO] Tests are skipped.
[INFO] 
[INFO] --- maven-jgit-buildnumber-plugin:1.2.9:extract-buildnumber (git-buildnumber) @ deploy-test ---
[INFO] 
[INFO] --- maven-jar-plugin:2.4:jar (default-jar) @ deploy-test ---
[WARNING] JAR will be empty - no content was marked for inclusion!
[INFO] Building jar: /home/cibuild02/workspace/NetarchiveSuite-system-test/deploy/deploy-test/target/deploy-test-5.4-SNAPSHOT.jar
[INFO] 
[INFO] >>> maven-source-plugin:2.2.1:jar (attach-sources) > generate-sources @ deploy-test >>>
[INFO] 
[INFO] --- jacoco-maven-plugin:0.7.9:prepare-agent (agent) @ deploy-test ---
[INFO] argLine set to -javaagent:/home/cibuild02/.m2/repository/org/jacoco/org.jacoco.agent/0.7.9/org.jacoco.agent-0.7.9-runtime.jar=destfile=/home/cibuild02/workspace/NetarchiveSuite-system-test/deploy/deploy-test/../target/jacoco.exec,append=true
[INFO] 
[INFO] <<< maven-source-plugin:2.2.1:jar (attach-sources) < generate-sources @ deploy-test <<<
[INFO] 
[INFO] --- maven-source-plugin:2.2.1:jar (attach-sources) @ deploy-test ---
[INFO] No sources in project. Archive not created.
[INFO] 
[INFO] --- maven-javadoc-plugin:2.10.3:jar (attach-javadocs) @ deploy-test ---
[INFO] 
[INFO] --- maven-install-plugin:2.4:install (default-install) @ deploy-test ---
[INFO] Installing /home/cibuild02/workspace/NetarchiveSuite-system-test/deploy/deploy-test/target/deploy-test-5.4-SNAPSHOT.jar to /home/cibuild02/.m2/repository/org/netarchivesuite/deploy-test/5.4-SNAPSHOT/deploy-test-5.4-SNAPSHOT.jar
[INFO] Installing /home/cibuild02/workspace/NetarchiveSuite-system-test/deploy/deploy-test/pom.xml to /home/cibuild02/.m2/repository/org/netarchivesuite/deploy-test/5.4-SNAPSHOT/deploy-test-5.4-SNAPSHOT.pom
[INFO]                                                                         
[INFO] ------------------------------------------------------------------------
[INFO] Building Netarchivesuite - Heritrix3 Bundler 5.4-SNAPSHOT
[INFO] ------------------------------------------------------------------------
Downloading: https://sbforge.org/nexus/content/groups/public/is/landsbokasafn/crawl-rss/crawl-rss/0.0.1-SNAPSHOT/maven-metadata.xml
2/2 KB   
         
Downloaded: https://sbforge.org/nexus/content/groups/public/is/landsbokasafn/crawl-rss/crawl-rss/0.0.1-SNAPSHOT/maven-metadata.xml (2 KB at 1.7 KB/sec)
[INFO] 
[INFO] --- maven-clean-plugin:2.5:clean (default-clean) @ heritrix3-bundler ---
[INFO] 
[INFO] --- maven-jgit-buildnumber-plugin:1.2.9:extract-buildnumber (git-buildnumber) @ heritrix3-bundler ---
[INFO] 
[INFO] --- maven-assembly-plugin:2.4.1:single (distro-assembly) @ heritrix3-bundler ---
[INFO] Reading assembly descriptor: src/main/assembly/distribution.xml
[WARNING] The following patterns were never triggered in this artifact exclusion filter:
o  'org.eclipse.jetty:*:jar'
o  'org.eclipse.jetty.websocket:*:jar'
o  'org.eclipse.jetty.orbit:*:jar'
o  'org.glassfish:*:jar'
o  'org.glassfish.web:*:jar'
o  'javax.servlet:*:jar'
o  'org.ow2.asm:*:jar'
o  'org.apache.httpcomponents:httpclient:jar:4.2.5'
o  'org.apache.httpcomponents:httpcore:jar:4.2.4'

[INFO] Building zip: /home/cibuild02/workspace/NetarchiveSuite-system-test/harvester/heritrix3/heritrix3-bundler/target/NetarchiveSuite-heritrix3-bundler-5.4-SNAPSHOT.zip
[INFO] 
[INFO] >>> maven-source-plugin:2.2.1:jar (attach-sources) > generate-sources @ heritrix3-bundler >>>
[INFO] 
[INFO] <<< maven-source-plugin:2.2.1:jar (attach-sources) < generate-sources @ heritrix3-bundler <<<
[INFO] 
[INFO] --- maven-source-plugin:2.2.1:jar (attach-sources) @ heritrix3-bundler ---
[INFO] 
[INFO] --- maven-javadoc-plugin:2.10.3:jar (attach-javadocs) @ heritrix3-bundler ---
[INFO] Not executing Javadoc as the project is not a Java classpath-capable package
[INFO] 
[INFO] --- maven-install-plugin:2.4:install (default-install) @ heritrix3-bundler ---
[INFO] Installing /home/cibuild02/workspace/NetarchiveSuite-system-test/harvester/heritrix3/heritrix3-bundler/pom.xml to /home/cibuild02/.m2/repository/org/netarchivesuite/heritrix3-bundler/5.4-SNAPSHOT/heritrix3-bundler-5.4-SNAPSHOT.pom
[INFO] Installing /home/cibuild02/workspace/NetarchiveSuite-system-test/harvester/heritrix3/heritrix3-bundler/target/NetarchiveSuite-heritrix3-bundler-5.4-SNAPSHOT.zip to /home/cibuild02/.m2/repository/org/netarchivesuite/heritrix3-bundler/5.4-SNAPSHOT/heritrix3-bundler-5.4-SNAPSHOT.zip
[INFO]                                                                         
[INFO] ------------------------------------------------------------------------
[INFO] Building NetarchiveSuite - harvester - test 5.4-SNAPSHOT
[INFO] ------------------------------------------------------------------------
[INFO] 
[INFO] --- maven-clean-plugin:2.5:clean (default-clean) @ harvester-test ---
[INFO] 
[INFO] --- jacoco-maven-plugin:0.7.9:prepare-agent (agent) @ harvester-test ---
[INFO] argLine set to -javaagent:/home/cibuild02/.m2/repository/org/jacoco/org.jacoco.agent/0.7.9/org.jacoco.agent-0.7.9-runtime.jar=destfile=/home/cibuild02/workspace/NetarchiveSuite-system-test/harvester/harvester-test/../target/jacoco.exec,append=true
[INFO] 
[INFO] --- maven-resources-plugin:2.6:resources (default-resources) @ harvester-test ---
[INFO] Using 'UTF-8' encoding to copy filtered resources.
[INFO] skip non existing resourceDirectory /home/cibuild02/workspace/NetarchiveSuite-system-test/harvester/harvester-test/src/main/resources
[INFO] 
[INFO] --- maven-compiler-plugin:3.1:compile (default-compile) @ harvester-test ---
[INFO] No sources to compile
[INFO] 
[INFO] --- maven-resources-plugin:2.6:testResources (default-testResources) @ harvester-test ---
[INFO] Using 'UTF-8' encoding to copy filtered resources.
[INFO] Copying 13 resources
[INFO] Copying 441 resources
[INFO] 
[INFO] --- maven-compiler-plugin:3.1:testCompile (default-testCompile) @ harvester-test ---
[INFO] Changes detected - recompiling the module!
[INFO] Compiling 124 source files to /home/cibuild02/workspace/NetarchiveSuite-system-test/harvester/harvester-test/target/test-classes
[WARNING] /home/cibuild02/workspace/NetarchiveSuite-system-test/harvester/harvester-test/src/test/java/dk/netarkivet/viewerproxy/distribute/HTTPControllerServerTester.java: Some input files use or override a deprecated API.
[WARNING] /home/cibuild02/workspace/NetarchiveSuite-system-test/harvester/harvester-test/src/test/java/dk/netarkivet/viewerproxy/distribute/HTTPControllerServerTester.java: Recompile with -Xlint:deprecation for details.
[WARNING] /home/cibuild02/workspace/NetarchiveSuite-system-test/harvester/harvester-test/src/test/java/dk/netarkivet/harvester/indexserver/CombiningMultiFileBasedCacheTester.java: /home/cibuild02/workspace/NetarchiveSuite-system-test/harvester/harvester-test/src/test/java/dk/netarkivet/harvester/indexserver/CombiningMultiFileBasedCacheTester.java uses unchecked or unsafe operations.
[WARNING] /home/cibuild02/workspace/NetarchiveSuite-system-test/harvester/harvester-test/src/test/java/dk/netarkivet/harvester/indexserver/CombiningMultiFileBasedCacheTester.java: Recompile with -Xlint:unchecked for details.
[INFO] 
[INFO] --- maven-surefire-plugin:2.17:test (default-test) @ harvester-test ---
[INFO] Tests are skipped.
[INFO] 
[INFO] --- maven-jgit-buildnumber-plugin:1.2.9:extract-buildnumber (git-buildnumber) @ harvester-test ---
[INFO] 
[INFO] --- maven-jar-plugin:2.4:jar (default-jar) @ harvester-test ---
[WARNING] JAR will be empty - no content was marked for inclusion!
[INFO] Building jar: /home/cibuild02/workspace/NetarchiveSuite-system-test/harvester/harvester-test/target/harvester-test-5.4-SNAPSHOT.jar
[INFO] 
[INFO] >>> maven-source-plugin:2.2.1:jar (attach-sources) > generate-sources @ harvester-test >>>
[INFO] 
[INFO] --- jacoco-maven-plugin:0.7.9:prepare-agent (agent) @ harvester-test ---
[INFO] argLine set to -javaagent:/home/cibuild02/.m2/repository/org/jacoco/org.jacoco.agent/0.7.9/org.jacoco.agent-0.7.9-runtime.jar=destfile=/home/cibuild02/workspace/NetarchiveSuite-system-test/harvester/harvester-test/../target/jacoco.exec,append=true
[INFO] 
[INFO] <<< maven-source-plugin:2.2.1:jar (attach-sources) < generate-sources @ harvester-test <<<
[INFO] 
[INFO] --- maven-source-plugin:2.2.1:jar (attach-sources) @ harvester-test ---
[INFO] No sources in project. Archive not created.
[INFO] 
[INFO] --- maven-javadoc-plugin:2.10.3:jar (attach-javadocs) @ harvester-test ---
[INFO] 
[INFO] --- maven-install-plugin:2.4:install (default-install) @ harvester-test ---
[INFO] Installing /home/cibuild02/workspace/NetarchiveSuite-system-test/harvester/harvester-test/target/harvester-test-5.4-SNAPSHOT.jar to /home/cibuild02/.m2/repository/org/netarchivesuite/harvester-test/5.4-SNAPSHOT/harvester-test-5.4-SNAPSHOT.jar
[INFO] Installing /home/cibuild02/workspace/NetarchiveSuite-system-test/harvester/harvester-test/pom.xml to /home/cibuild02/.m2/repository/org/netarchivesuite/harvester-test/5.4-SNAPSHOT/harvester-test-5.4-SNAPSHOT.pom
[INFO]                                                                         
[INFO] ------------------------------------------------------------------------
[INFO] Building NetarchiveSuite - monitor - test 5.4-SNAPSHOT
[INFO] ------------------------------------------------------------------------
[INFO] 
[INFO] --- maven-clean-plugin:2.5:clean (default-clean) @ monitor-test ---
[INFO] 
[INFO] --- jacoco-maven-plugin:0.7.9:prepare-agent (agent) @ monitor-test ---
[INFO] argLine set to -javaagent:/home/cibuild02/.m2/repository/org/jacoco/org.jacoco.agent/0.7.9/org.jacoco.agent-0.7.9-runtime.jar=destfile=/home/cibuild02/workspace/NetarchiveSuite-system-test/monitor/monitor-test/../target/jacoco.exec,append=true
[INFO] 
[INFO] --- maven-resources-plugin:2.6:resources (default-resources) @ monitor-test ---
[INFO] Using 'UTF-8' encoding to copy filtered resources.
[INFO] skip non existing resourceDirectory /home/cibuild02/workspace/NetarchiveSuite-system-test/monitor/monitor-test/src/main/resources
[INFO] 
[INFO] --- maven-compiler-plugin:3.1:compile (default-compile) @ monitor-test ---
[INFO] No sources to compile
[INFO] 
[INFO] --- maven-resources-plugin:2.6:testResources (default-testResources) @ monitor-test ---
[INFO] Using 'UTF-8' encoding to copy filtered resources.
[INFO] Copying 1 resource
[INFO] Copying 8 resources
[INFO] 
[INFO] --- maven-compiler-plugin:3.1:testCompile (default-testCompile) @ monitor-test ---
[INFO] Changes detected - recompiling the module!
[INFO] Compiling 4 source files to /home/cibuild02/workspace/NetarchiveSuite-system-test/monitor/monitor-test/target/test-classes
[INFO] 
[INFO] --- maven-surefire-plugin:2.17:test (default-test) @ monitor-test ---
[INFO] Tests are skipped.
[INFO] 
[INFO] --- maven-jgit-buildnumber-plugin:1.2.9:extract-buildnumber (git-buildnumber) @ monitor-test ---
[INFO] 
[INFO] --- maven-jar-plugin:2.4:jar (default-jar) @ monitor-test ---
[WARNING] JAR will be empty - no content was marked for inclusion!
[INFO] Building jar: /home/cibuild02/workspace/NetarchiveSuite-system-test/monitor/monitor-test/target/monitor-test-5.4-SNAPSHOT.jar
[INFO] 
[INFO] >>> maven-source-plugin:2.2.1:jar (attach-sources) > generate-sources @ monitor-test >>>
[INFO] 
[INFO] --- jacoco-maven-plugin:0.7.9:prepare-agent (agent) @ monitor-test ---
[INFO] argLine set to -javaagent:/home/cibuild02/.m2/repository/org/jacoco/org.jacoco.agent/0.7.9/org.jacoco.agent-0.7.9-runtime.jar=destfile=/home/cibuild02/workspace/NetarchiveSuite-system-test/monitor/monitor-test/../target/jacoco.exec,append=true
[INFO] 
[INFO] <<< maven-source-plugin:2.2.1:jar (attach-sources) < generate-sources @ monitor-test <<<
[INFO] 
[INFO] --- maven-source-plugin:2.2.1:jar (attach-sources) @ monitor-test ---
[INFO] No sources in project. Archive not created.
[INFO] 
[INFO] --- maven-javadoc-plugin:2.10.3:jar (attach-javadocs) @ monitor-test ---
[INFO] 
[INFO] --- maven-install-plugin:2.4:install (default-install) @ monitor-test ---
[INFO] Installing /home/cibuild02/workspace/NetarchiveSuite-system-test/monitor/monitor-test/target/monitor-test-5.4-SNAPSHOT.jar to /home/cibuild02/.m2/repository/org/netarchivesuite/monitor-test/5.4-SNAPSHOT/monitor-test-5.4-SNAPSHOT.jar
[INFO] Installing /home/cibuild02/workspace/NetarchiveSuite-system-test/monitor/monitor-test/pom.xml to /home/cibuild02/.m2/repository/org/netarchivesuite/monitor-test/5.4-SNAPSHOT/monitor-test-5.4-SNAPSHOT.pom
[INFO]                                                                         
[INFO] ------------------------------------------------------------------------
[INFO] Building NetarchiveSuite - wayback resourceStore 5.4-SNAPSHOT
[INFO] ------------------------------------------------------------------------
[INFO] 
[INFO] --- maven-clean-plugin:2.5:clean (default-clean) @ wayback-resourcestore ---
[INFO] 
[INFO] --- jacoco-maven-plugin:0.7.9:prepare-agent (agent) @ wayback-resourcestore ---
[INFO] argLine set to -javaagent:/home/cibuild02/.m2/repository/org/jacoco/org.jacoco.agent/0.7.9/org.jacoco.agent-0.7.9-runtime.jar=destfile=/home/cibuild02/workspace/NetarchiveSuite-system-test/wayback/wayback-resourcestore/../target/jacoco.exec,append=true
[INFO] 
[INFO] --- maven-resources-plugin:2.6:resources (default-resources) @ wayback-resourcestore ---
[INFO] Using 'UTF-8' encoding to copy filtered resources.
[INFO] skip non existing resourceDirectory /home/cibuild02/workspace/NetarchiveSuite-system-test/wayback/wayback-resourcestore/src/main/resources
[INFO] 
[INFO] --- maven-compiler-plugin:3.1:compile (default-compile) @ wayback-resourcestore ---
[INFO] Changes detected - recompiling the module!
[INFO] Compiling 7 source files to /home/cibuild02/workspace/NetarchiveSuite-system-test/wayback/wayback-resourcestore/target/classes
[INFO] 
[INFO] --- maven-resources-plugin:2.6:testResources (default-testResources) @ wayback-resourcestore ---
[INFO] Using 'UTF-8' encoding to copy filtered resources.
[INFO] skip non existing resourceDirectory /home/cibuild02/workspace/NetarchiveSuite-system-test/wayback/wayback-resourcestore/src/test/resources
[INFO] 
[INFO] --- maven-compiler-plugin:3.1:testCompile (default-testCompile) @ wayback-resourcestore ---
[INFO] Changes detected - recompiling the module!
[INFO] Compiling 4 source files to /home/cibuild02/workspace/NetarchiveSuite-system-test/wayback/wayback-resourcestore/target/test-classes
[INFO] 
[INFO] --- maven-surefire-plugin:2.17:test (default-test) @ wayback-resourcestore ---
[INFO] Tests are skipped.
[INFO] 
[INFO] --- maven-jgit-buildnumber-plugin:1.2.9:extract-buildnumber (git-buildnumber) @ wayback-resourcestore ---
[INFO] 
[INFO] --- maven-jar-plugin:2.4:jar (default-jar) @ wayback-resourcestore ---
[INFO] Building jar: /home/cibuild02/workspace/NetarchiveSuite-system-test/wayback/wayback-resourcestore/target/wayback-resourcestore-5.4-SNAPSHOT.jar
[INFO] 
[INFO] >>> maven-source-plugin:2.2.1:jar (attach-sources) > generate-sources @ wayback-resourcestore >>>
[INFO] 
[INFO] --- jacoco-maven-plugin:0.7.9:prepare-agent (agent) @ wayback-resourcestore ---
[INFO] argLine set to -javaagent:/home/cibuild02/.m2/repository/org/jacoco/org.jacoco.agent/0.7.9/org.jacoco.agent-0.7.9-runtime.jar=destfile=/home/cibuild02/workspace/NetarchiveSuite-system-test/wayback/wayback-resourcestore/../target/jacoco.exec,append=true
[INFO] 
[INFO] <<< maven-source-plugin:2.2.1:jar (attach-sources) < generate-sources @ wayback-resourcestore <<<
[INFO] 
[INFO] --- maven-source-plugin:2.2.1:jar (attach-sources) @ wayback-resourcestore ---
[INFO] Building jar: /home/cibuild02/workspace/NetarchiveSuite-system-test/wayback/wayback-resourcestore/target/wayback-resourcestore-5.4-SNAPSHOT-sources.jar
[INFO] 
[INFO] --- maven-javadoc-plugin:2.10.3:jar (attach-javadocs) @ wayback-resourcestore ---
[INFO] Building jar: /home/cibuild02/workspace/NetarchiveSuite-system-test/wayback/wayback-resourcestore/target/wayback-resourcestore-5.4-SNAPSHOT-javadoc.jar
[INFO] 
[INFO] --- maven-install-plugin:2.4:install (default-install) @ wayback-resourcestore ---
[INFO] Installing /home/cibuild02/workspace/NetarchiveSuite-system-test/wayback/wayback-resourcestore/target/wayback-resourcestore-5.4-SNAPSHOT.jar to /home/cibuild02/.m2/repository/org/netarchivesuite/wayback-resourcestore/5.4-SNAPSHOT/wayback-resourcestore-5.4-SNAPSHOT.jar
[INFO] Installing /home/cibuild02/workspace/NetarchiveSuite-system-test/wayback/wayback-resourcestore/pom.xml to /home/cibuild02/.m2/repository/org/netarchivesuite/wayback-resourcestore/5.4-SNAPSHOT/wayback-resourcestore-5.4-SNAPSHOT.pom
[INFO] Installing /home/cibuild02/workspace/NetarchiveSuite-system-test/wayback/wayback-resourcestore/target/wayback-resourcestore-5.4-SNAPSHOT-sources.jar to /home/cibuild02/.m2/repository/org/netarchivesuite/wayback-resourcestore/5.4-SNAPSHOT/wayback-resourcestore-5.4-SNAPSHOT-sources.jar
[INFO] Installing /home/cibuild02/workspace/NetarchiveSuite-system-test/wayback/wayback-resourcestore/target/wayback-resourcestore-5.4-SNAPSHOT-javadoc.jar to /home/cibuild02/.m2/repository/org/netarchivesuite/wayback-resourcestore/5.4-SNAPSHOT/wayback-resourcestore-5.4-SNAPSHOT-javadoc.jar
[INFO]                                                                         
[INFO] ------------------------------------------------------------------------
[INFO] Building NetarchiveSuite - wayback - test 5.4-SNAPSHOT
[INFO] ------------------------------------------------------------------------
[INFO] 
[INFO] --- maven-clean-plugin:2.5:clean (default-clean) @ wayback-test ---
[INFO] 
[INFO] --- jacoco-maven-plugin:0.7.9:prepare-agent (agent) @ wayback-test ---
[INFO] argLine set to -javaagent:/home/cibuild02/.m2/repository/org/jacoco/org.jacoco.agent/0.7.9/org.jacoco.agent-0.7.9-runtime.jar=destfile=/home/cibuild02/workspace/NetarchiveSuite-system-test/wayback/wayback-test/../target/jacoco.exec,append=true
[INFO] 
[INFO] --- maven-resources-plugin:2.6:resources (default-resources) @ wayback-test ---
[INFO] Using 'UTF-8' encoding to copy filtered resources.
[INFO] skip non existing resourceDirectory /home/cibuild02/workspace/NetarchiveSuite-system-test/wayback/wayback-test/src/main/resources
[INFO] 
[INFO] --- maven-compiler-plugin:3.1:compile (default-compile) @ wayback-test ---
[INFO] No sources to compile
[INFO] 
[INFO] --- maven-resources-plugin:2.6:testResources (default-testResources) @ wayback-test ---
[INFO] Using 'UTF-8' encoding to copy filtered resources.
[INFO] Copying 1 resource
[INFO] Copying 28 resources
[INFO] 
[INFO] --- maven-compiler-plugin:3.1:testCompile (default-testCompile) @ wayback-test ---
[INFO] Changes detected - recompiling the module!
[INFO] Compiling 15 source files to /home/cibuild02/workspace/NetarchiveSuite-system-test/wayback/wayback-test/target/test-classes
[INFO] 
[INFO] --- maven-surefire-plugin:2.17:test (default-test) @ wayback-test ---
[INFO] Tests are skipped.
[INFO] 
[INFO] --- maven-jgit-buildnumber-plugin:1.2.9:extract-buildnumber (git-buildnumber) @ wayback-test ---
[INFO] 
[INFO] --- maven-jar-plugin:2.4:jar (default-jar) @ wayback-test ---
[WARNING] JAR will be empty - no content was marked for inclusion!
[INFO] Building jar: /home/cibuild02/workspace/NetarchiveSuite-system-test/wayback/wayback-test/target/wayback-test-5.4-SNAPSHOT.jar
[INFO] 
[INFO] >>> maven-source-plugin:2.2.1:jar (attach-sources) > generate-sources @ wayback-test >>>
[INFO] 
[INFO] --- jacoco-maven-plugin:0.7.9:prepare-agent (agent) @ wayback-test ---
[INFO] argLine set to -javaagent:/home/cibuild02/.m2/repository/org/jacoco/org.jacoco.agent/0.7.9/org.jacoco.agent-0.7.9-runtime.jar=destfile=/home/cibuild02/workspace/NetarchiveSuite-system-test/wayback/wayback-test/../target/jacoco.exec,append=true
[INFO] 
[INFO] <<< maven-source-plugin:2.2.1:jar (attach-sources) < generate-sources @ wayback-test <<<
[INFO] 
[INFO] --- maven-source-plugin:2.2.1:jar (attach-sources) @ wayback-test ---
[INFO] No sources in project. Archive not created.
[INFO] 
[INFO] --- maven-javadoc-plugin:2.10.3:jar (attach-javadocs) @ wayback-test ---
[INFO] 
[INFO] --- maven-install-plugin:2.4:install (default-install) @ wayback-test ---
[INFO] Installing /home/cibuild02/workspace/NetarchiveSuite-system-test/wayback/wayback-test/target/wayback-test-5.4-SNAPSHOT.jar to /home/cibuild02/.m2/repository/org/netarchivesuite/wayback-test/5.4-SNAPSHOT/wayback-test-5.4-SNAPSHOT.jar
[INFO] Installing /home/cibuild02/workspace/NetarchiveSuite-system-test/wayback/wayback-test/pom.xml to /home/cibuild02/.m2/repository/org/netarchivesuite/wayback-test/5.4-SNAPSHOT/wayback-test-5.4-SNAPSHOT.pom
[INFO]                                                                         
[INFO] ------------------------------------------------------------------------
[INFO] Building NetarchiveSuite - integration tests 5.4-SNAPSHOT
[INFO] ------------------------------------------------------------------------
[INFO] 
[INFO] --- maven-clean-plugin:2.5:clean (default-clean) @ integration-test ---
[INFO] 
[INFO] --- maven-jgit-buildnumber-plugin:1.2.9:extract-buildnumber (git-buildnumber) @ integration-test ---
[INFO] 
[INFO] >>> maven-source-plugin:2.2.1:jar (attach-sources) > generate-sources @ integration-test >>>
[INFO] 
[INFO] <<< maven-source-plugin:2.2.1:jar (attach-sources) < generate-sources @ integration-test <<<
[INFO] 
[INFO] --- maven-source-plugin:2.2.1:jar (attach-sources) @ integration-test ---
[INFO] 
[INFO] --- maven-javadoc-plugin:2.10.3:jar (attach-javadocs) @ integration-test ---
[INFO] Not executing Javadoc as the project is not a Java classpath-capable package
[INFO] 
[INFO] --- maven-install-plugin:2.4:install (default-install) @ integration-test ---
[INFO] Installing /home/cibuild02/workspace/NetarchiveSuite-system-test/integration-test/pom.xml to /home/cibuild02/.m2/repository/org/netarchivesuite/integration-test/5.4-SNAPSHOT/integration-test-5.4-SNAPSHOT.pom
[INFO]                                                                         
[INFO] ------------------------------------------------------------------------
[INFO] Building NetarchiveSuite System test 5.4-SNAPSHOT
[INFO] ------------------------------------------------------------------------
[INFO] 
[INFO] --- maven-clean-plugin:2.5:clean (default-clean) @ system-test ---
[INFO] 
[INFO] --- maven-resources-plugin:2.6:resources (default-resources) @ system-test ---
[INFO] Using 'UTF-8' encoding to copy filtered resources.
[INFO] skip non existing resourceDirectory /home/cibuild02/workspace/NetarchiveSuite-system-test/integration-test/system-test/src/main/resources
[INFO] 
[INFO] --- maven-compiler-plugin:3.1:compile (default-compile) @ system-test ---
[INFO] No sources to compile
[INFO] 
[INFO] --- maven-resources-plugin:2.6:testResources (default-testResources) @ system-test ---
[INFO] Using 'UTF-8' encoding to copy filtered resources.
[INFO] Copying 4 resources
[INFO] 
[INFO] --- maven-compiler-plugin:3.1:testCompile (default-testCompile) @ system-test ---
[INFO] Changes detected - recompiling the module!
[INFO] Compiling 33 source files to /home/cibuild02/workspace/NetarchiveSuite-system-test/integration-test/system-test/target/test-classes
[INFO] 
[INFO] --- maven-surefire-plugin:2.17:test (default-test) @ system-test ---
[INFO] Tests are skipped.
[INFO] 
[INFO] --- maven-jgit-buildnumber-plugin:1.2.9:extract-buildnumber (git-buildnumber) @ system-test ---
[INFO] 
[INFO] --- maven-jar-plugin:2.4:jar (default-jar) @ system-test ---
[WARNING] JAR will be empty - no content was marked for inclusion!
[INFO] Building jar: /home/cibuild02/workspace/NetarchiveSuite-system-test/integration-test/system-test/target/system-test-5.4-SNAPSHOT.jar
[INFO] 
[INFO] >>> maven-source-plugin:2.2.1:jar (attach-sources) > generate-sources @ system-test >>>
[INFO] 
[INFO] <<< maven-source-plugin:2.2.1:jar (attach-sources) < generate-sources @ system-test <<<
[INFO] 
[INFO] --- maven-source-plugin:2.2.1:jar (attach-sources) @ system-test ---
[INFO] No sources in project. Archive not created.
[INFO] 
[INFO] --- maven-javadoc-plugin:2.10.3:jar (attach-javadocs) @ system-test ---
[INFO] 
[INFO] --- maven-install-plugin:2.4:install (default-install) @ system-test ---
[INFO] Installing /home/cibuild02/workspace/NetarchiveSuite-system-test/integration-test/system-test/target/system-test-5.4-SNAPSHOT.jar to /home/cibuild02/.m2/repository/org/netarchivesuite/system-test/5.4-SNAPSHOT/system-test-5.4-SNAPSHOT.jar
[INFO] Installing /home/cibuild02/workspace/NetarchiveSuite-system-test/integration-test/system-test/pom.xml to /home/cibuild02/.m2/repository/org/netarchivesuite/system-test/5.4-SNAPSHOT/system-test-5.4-SNAPSHOT.pom
[INFO] ------------------------------------------------------------------------
[INFO] Reactor Summary:
[INFO] 
[INFO] NetarchiveSuite .................................... SUCCESS [  6.371 s]
[INFO] NetarchiveSuite - build-tools ...................... SUCCESS [  1.858 s]
[INFO] NetarchiveSuite - common ........................... SUCCESS [  0.043 s]
[INFO] NetarchiveSuite - test utils ....................... SUCCESS [  5.529 s]
[INFO] NetarchiveSuite - common - core .................... SUCCESS [ 19.484 s]
[INFO] NetarchiveSuite - common - test .................... SUCCESS [ 11.564 s]
[INFO] NetarchiveSuite - archive .......................... SUCCESS [  0.040 s]
[INFO] NetarchiveSuite - archive - core ................... SUCCESS [ 11.563 s]
[INFO] NetarchiveSuite - harvester ........................ SUCCESS [  0.043 s]
[INFO] NetarchiveSuite - harvester - heritrix1 ............ SUCCESS [  0.035 s]
[INFO] NetarchiveSuite - heritrix1 frontier ............... SUCCESS [  3.813 s]
[INFO] NetarchiveSuite - harvester - core ................. SUCCESS [ 18.404 s]
[INFO] NetarchiveSuite - archive - test ................... SUCCESS [  3.309 s]
[INFO] NetarchiveSuite - bitpreservation - webapp ......... SUCCESS [  1.133 s]
[INFO] NetarchiveSuite - heritrix1 extensions ............. SUCCESS [  5.615 s]
[INFO] NetarchiveSuite - heritrix1 controller ............. SUCCESS [  7.510 s]
[INFO] NetarchiveSuite - Harvest Scheduler ................ SUCCESS [  4.659 s]
[INFO] NetarchiveSuite - monitor .......................... SUCCESS [  0.052 s]
[INFO] NetarchiveSuite - monitor - core ................... SUCCESS [  4.951 s]
[INFO] NetarchiveSuite - wayback .......................... SUCCESS [  0.473 s]
[INFO] NetarchiveSuite - wayback - indexer ................ SUCCESS [  5.450 s]
[INFO] NetarchiveSuite - deploy ........................... SUCCESS [  0.027 s]
[INFO] NetarchiveSuite - deploy - core .................... SUCCESS [  6.521 s]
[INFO] NetarchiveSuite - harvester - heritrix3 ............ SUCCESS [  0.057 s]
[INFO] Netarchivesuite - Heritrix3 Extensions ............. SUCCESS [  8.722 s]
[INFO] NetarchiveSuite - heritrix3 controller ............. SUCCESS [  6.002 s]
[INFO] NetarchiveSuite - Status - Webapp .................. SUCCESS [  0.483 s]
[INFO] NetarchiveSuite - qa - webapp ...................... SUCCESS [  0.116 s]
[INFO] NetarchiveSuite - history - webapp ................. SUCCESS [  0.307 s]
[INFO] NetarchiveSuite - harvestDefinition - webapp ....... SUCCESS [  0.373 s]
[INFO] NetarchiveSuite - harvestChannel - webapp .......... SUCCESS [  0.167 s]
[INFO] NetarchiveSuite - deploy - distribution ............ SUCCESS [ 18.553 s]
[INFO] NetarchiveSuite - deploy - test .................... SUCCESS [  2.078 s]
[INFO] Netarchivesuite - Heritrix3 Bundler ................ SUCCESS [ 14.504 s]
[INFO] NetarchiveSuite - harvester - test ................. SUCCESS [  4.236 s]
[INFO] NetarchiveSuite - monitor - test ................... SUCCESS [  0.299 s]
[INFO] NetarchiveSuite - wayback resourceStore ............ SUCCESS [  4.718 s]
[INFO] NetarchiveSuite - wayback - test ................... SUCCESS [  0.794 s]
[INFO] NetarchiveSuite - integration tests ................ SUCCESS [  0.057 s]
[INFO] NetarchiveSuite System test ........................ SUCCESS [  1.780 s]
[INFO] ------------------------------------------------------------------------
[INFO] BUILD SUCCESS
[INFO] ------------------------------------------------------------------------
[INFO] Total time: 03:03 min
[INFO] Finished at: 2017-11-02T00:03:26+01:00
[INFO] Final Memory: 97M/232M
[INFO] ------------------------------------------------------------------------
+ scp ./deploy/distribution/target/NetarchiveSuite-5.4-SNAPSHOT.zip devel@kb-prod-udv-001.kb.dk:nas_versions/NetarchiveSuite-SystemTest.zip
+ scp ./harvester/heritrix3/heritrix3-bundler/target/NetarchiveSuite-heritrix3-bundler-5.4-SNAPSHOT.zip devel@kb-prod-udv-001.kb.dk:nas_versions/bundler/NetarchiveSuite-heritrix3-bundler-systemtest.zip
Parsing POMs
Established TCP socket on 46304
maven32-agent.jar already up to date
maven32-interceptor.jar already up to date
maven3-interceptor-commons.jar already up to date
[NetarchiveSuite-system-test] $ /home/cibuild02/tools/hudson.model.JDK/Java8/bin/java -Dmaven.test.failure.ignore=false -cp /home/cibuild02/maven32-agent.jar:/home/cibuild02/tools/hudson.tasks.Maven_MavenInstallation/Maven3.2/boot/plexus-classworlds-2.5.2.jar:/home/cibuild02/tools/hudson.tasks.Maven_MavenInstallation/Maven3.2/conf/logging jenkins.maven3.agent.Maven32Main /home/cibuild02/tools/hudson.tasks.Maven_MavenInstallation/Maven3.2 /home/cibuild02/slave.jar /home/cibuild02/maven32-interceptor.jar /home/cibuild02/maven3-interceptor-commons.jar 46304
<===[JENKINS REMOTING CAPACITY]===>channel started
Executing Maven:  -B -f /home/cibuild02/workspace/NetarchiveSuite-system-test/pom.xml clean integration-test -PsystemTest -rf :system-test -Dorg.slf4j.simpleLogger.defaultloglevel=info -Dsystemtest.h3zip=/home/devel/nas_versions/bundler/NetarchiveSuite-heritrix3-bundler-systemtest.zip -Dsystemtest.mailreceivers=csr@statsbiblioteket.dk
[INFO] Scanning for projects...
[INFO]                                                                         
[INFO] ------------------------------------------------------------------------
[INFO] Building NetarchiveSuite System test 5.4-SNAPSHOT
[INFO] ------------------------------------------------------------------------
[INFO] 
[INFO] --- maven-clean-plugin:2.5:clean (default-clean) @ system-test ---
[INFO] Deleting /home/cibuild02/workspace/NetarchiveSuite-system-test/integration-test/system-test/target
[INFO] 
[INFO] --- maven-resources-plugin:2.6:resources (default-resources) @ system-test ---
[INFO] Using 'UTF-8' encoding to copy filtered resources.
[INFO] skip non existing resourceDirectory /home/cibuild02/workspace/NetarchiveSuite-system-test/integration-test/system-test/src/main/resources
[INFO] 
[INFO] --- maven-compiler-plugin:3.1:compile (default-compile) @ system-test ---
[INFO] No sources to compile
[INFO] 
[INFO] --- maven-resources-plugin:2.6:testResources (default-testResources) @ system-test ---
[INFO] Using 'UTF-8' encoding to copy filtered resources.
[INFO] Copying 4 resources
[INFO] 
[INFO] --- maven-compiler-plugin:3.1:testCompile (default-testCompile) @ system-test ---
[INFO] Changes detected - recompiling the module!
[INFO] Compiling 33 source files to /home/cibuild02/workspace/NetarchiveSuite-system-test/integration-test/system-test/target/test-classes
[INFO] 
[INFO] --- maven-surefire-plugin:2.17:test (default-test) @ system-test ---
[INFO] Tests are skipped.
[INFO] 
[INFO] --- maven-jgit-buildnumber-plugin:1.2.9:extract-buildnumber (git-buildnumber) @ system-test ---
[INFO] Cannot extract Git info, maybe custom build with 'pl' argument is running
[INFO] 
[INFO] --- maven-jar-plugin:2.4:jar (default-jar) @ system-test ---
[WARNING] JAR will be empty - no content was marked for inclusion!
[INFO] Building jar: /home/cibuild02/workspace/NetarchiveSuite-system-test/integration-test/system-test/target/system-test-5.4-SNAPSHOT.jar
[INFO] 
[INFO] --- maven-dependency-plugin:2.8:copy (copy-distribution-zip) @ system-test ---
[INFO] Configured Artifact: org.netarchivesuite:distribution:5.4-SNAPSHOT:zip
[INFO] Copying distribution-5.4-SNAPSHOT.zip to /home/cibuild02/workspace/NetarchiveSuite-system-test/integration-test/system-test/target/NetarchiveSuite-SystemTest.zip
[INFO] 
[INFO] --- maven-antrun-plugin:1.8:run (default) @ system-test ---
[INFO] Executing tasks

main:

deploy2test:
      [scp] Connecting to kb-prod-udv-001.kb.dk:22
      [scp] done.
[INFO] Executed tasks
[INFO] 
[INFO] --- maven-surefire-plugin:2.17:test (surefire-it) @ system-test ---
[INFO] Surefire report directory: /home/cibuild02/workspace/NetarchiveSuite-system-test/integration-test/system-test/target/surefire-reports

-------------------------------------------------------
 T E S T S
-------------------------------------------------------
Running TestSuite
[main] INFO org.jaccept.TestEventManager - Loading properties from file:/home/cibuild02/workspace/NetarchiveSuite-system-test/integration-test/system-test/target/test-classes/jaccept.properties
[main] INFO org.jaccept.TestEventManager - Adding clients: org.jaccept.StdOutLogger
[main] INFO org.jaccept.TestEventManager - Adding JAccept client org.jaccept.StdOutLogger
Starting test project NetarchiveSuite System test
  Suite: Full Functional Acceptance Test
[main] INFO dk.netarkivet.systemtest.environment.TestEnvironmentController - Running JSch command (on null): RemoteCommand 
	source /etc/bashrc;source /etc/profile;source ~/.bash_profile;true;export PORT=8071;export MAILRECEIVERS=csr@statsbiblioteket.dk;export TESTX=SystemTest;true;export H3ZIP=/home/devel/nas_versions/bundler/NetarchiveSuite-heritrix3-bundler-systemtest.zip;
	all_test.sh
[main] WARN dk.netarkivet.systemtest.environment.TestEnvironmentController - ssh error: The system cannot find the file specified.
[main] WARN dk.netarkivet.systemtest.environment.TestEnvironmentController - ssh error: The system cannot find the path specified.
[main] WARN dk.netarkivet.systemtest.environment.TestEnvironmentController - ssh error: The system cannot find the path specified.
[main] WARN dk.netarkivet.systemtest.environment.TestEnvironmentController - ssh error: The system cannot find the path specified.
[main] WARN dk.netarkivet.systemtest.environment.TestEnvironmentController - ssh error: The system cannot find the file specified.
[main] WARN dk.netarkivet.systemtest.environment.TestEnvironmentController - ssh error: The system cannot find the path specified.
[main] WARN dk.netarkivet.systemtest.environment.TestEnvironmentController - ssh error: The volume does not contain a recognized file system.
[main] WARN dk.netarkivet.systemtest.environment.TestEnvironmentController - ssh error: Please make sure that all required file system drivers are loaded and that the volume is not corrupted.
[main] WARN dk.netarkivet.systemtest.environment.TestEnvironmentController - ssh error: The system cannot find the file specified.
[main] WARN dk.netarkivet.systemtest.environment.TestEnvironmentController - ssh error: The system cannot find the file specified.
[main] WARN dk.netarkivet.systemtest.environment.TestEnvironmentController - ssh error: The system cannot find the file specified.
[main] WARN dk.netarkivet.systemtest.environment.TestEnvironmentController - ssh error: cp: writing `./NetarchiveSuite-SystemTest.zip': No space left on device
[main] WARN dk.netarkivet.systemtest.environment.TestEnvironmentController - ssh error: cp: writing `./NetarchiveSuite-heritrix3-bundler.zip': No space left on device
[main] WARN dk.netarkivet.systemtest.environment.TestEnvironmentController - ssh error: [NetarchiveSuite-SystemTest.zip]
[main] WARN dk.netarkivet.systemtest.environment.TestEnvironmentController - ssh error:   End-of-central-directory signature not found.  Either this file is not
[main] WARN dk.netarkivet.systemtest.environment.TestEnvironmentController - ssh error:   a zipfile, or it constitutes one disk of a multi-part archive.  In the
[main] WARN dk.netarkivet.systemtest.environment.TestEnvironmentController - ssh error:   latter case the central directory and zipfile comment will be found on
[main] WARN dk.netarkivet.systemtest.environment.TestEnvironmentController - ssh error:   the last disk(s) of this archive.
[main] WARN dk.netarkivet.systemtest.environment.TestEnvironmentController - ssh error: unzip:  cannot find zipfile directory in one of NetarchiveSuite-SystemTest.zip or
[main] WARN dk.netarkivet.systemtest.environment.TestEnvironmentController - ssh error:         NetarchiveSuite-SystemTest.zip.zip, and cannot find NetarchiveSuite-SystemTest.zip.ZIP, period.
[main] WARN dk.netarkivet.systemtest.environment.TestEnvironmentController - ssh error: mkdir: cannot create directory `/home/devel/prepared_software/SystemTest/settings': No space left on device
[main] WARN dk.netarkivet.systemtest.environment.TestEnvironmentController - ssh error: cp: writing `/home/devel/prepared_software/SystemTest/settings': No space left on device
[main] WARN dk.netarkivet.systemtest.environment.TestEnvironmentController - ssh error: cp: writing `/home/devel/prepared_software/SystemTest/settings': No space left on device
[main] WARN dk.netarkivet.systemtest.environment.TestEnvironmentController - ssh error: cp: accessing `/home/devel/prepared_software/SystemTest/settings/temp.xml': Not a directory
[main] WARN dk.netarkivet.systemtest.environment.TestEnvironmentController - ssh error: /home/devel/bin/prepare_test.sh: line 42: /home/devel/prepared_software/SystemTest/settings/deploy_config.xml: Not a directory
[main] WARN dk.netarkivet.systemtest.environment.TestEnvironmentController - ssh error: cat: /home/devel/prepared_software/SystemTest/settings/temp.xml: Not a directory
[main] WARN dk.netarkivet.systemtest.environment.TestEnvironmentController - ssh error: Java HotSpot(TM) 64-Bit Server VM warning: Insufficient space for shared memory file:
[main] WARN dk.netarkivet.systemtest.environment.TestEnvironmentController - ssh error:    /tmp/hsperfdata_devel/7715
[main] WARN dk.netarkivet.systemtest.environment.TestEnvironmentController - ssh error: Try using the -Djava.io.tmpdir= option to select an alternate temp location.
[main] WARN dk.netarkivet.systemtest.environment.TestEnvironmentController - ssh error: Error: Could not find or load main class dk.netarkivet.deploy.DeployApplication
[main] WARN dk.netarkivet.systemtest.environment.TestEnvironmentController - ssh error: chmod: cannot access `/home/devel/prepared_software/SystemTest/*.sh': No such file or directory
[main] WARN dk.netarkivet.systemtest.environment.TestEnvironmentController - ssh error: DEBUG:  transaction ID wrap limit is 2257721481, limited by database "test2056_harvestdb"
[main] WARN dk.netarkivet.systemtest.environment.TestEnvironmentController - ssh error: DEBUG:  transaction ID wrap limit is 2257721481, limited by database "test2056_harvestdb"
[main] WARN dk.netarkivet.systemtest.environment.TestEnvironmentController - ssh error: bin/setup_admindb.sh: line 6: SystemTest/scripts/sql/createArchiveDB.pgsql: No such file or directory
[main] WARN dk.netarkivet.systemtest.environment.TestEnvironmentController - ssh error: DEBUG:  transaction ID wrap limit is 2257721481, limited by database "test2056_harvestdb"
[main] WARN dk.netarkivet.systemtest.environment.TestEnvironmentController - ssh error: DEBUG:  transaction ID wrap limit is 2257721481, limited by database "test2056_harvestdb"
[main] WARN dk.netarkivet.systemtest.environment.TestEnvironmentController - ssh error: bin/setup_harvestdb.sh: line 4: /home/devel/SystemTest/scripts/postgresql/netarchivesuite_init.sql: No such file or directory
[main] WARN dk.netarkivet.systemtest.environment.TestEnvironmentController - ssh error: ERROR:  relation "config_seedlists" does not exist
[main] WARN dk.netarkivet.systemtest.environment.TestEnvironmentController - ssh error: invalid command \.
[main] WARN dk.netarkivet.systemtest.environment.TestEnvironmentController - ssh error: ERROR:  syntax error at or near "1"
[main] WARN dk.netarkivet.systemtest.environment.TestEnvironmentController - ssh error: LINE 1: 1 1
[main] WARN dk.netarkivet.systemtest.environment.TestEnvironmentController - ssh error:         ^
[main] WARN dk.netarkivet.systemtest.environment.TestEnvironmentController - ssh error: invalid command \.
[main] WARN dk.netarkivet.systemtest.environment.TestEnvironmentController - ssh error: ERROR:  syntax error at or near "1"
[main] WARN dk.netarkivet.systemtest.environment.TestEnvironmentController - ssh error: LINE 1: 1 defaultconfig  1 4 2000 100 0 500000000
[main] WARN dk.netarkivet.systemtest.environment.TestEnvironmentController - ssh error:         ^
[main] WARN dk.netarkivet.systemtest.environment.TestEnvironmentController - ssh error: ERROR:  relation "domains" does not exist
[main] WARN dk.netarkivet.systemtest.environment.TestEnvironmentController - ssh error: invalid command \N
[main] WARN dk.netarkivet.systemtest.environment.TestEnvironmentController - ssh error: invalid command \N
[main] WARN dk.netarkivet.systemtest.environment.TestEnvironmentController - ssh error: invalid command \N
[main] WARN dk.netarkivet.systemtest.environment.TestEnvironmentController - ssh error: invalid command \N
[main] WARN dk.netarkivet.systemtest.environment.TestEnvironmentController - ssh error: invalid command \N
[main] WARN dk.netarkivet.systemtest.environment.TestEnvironmentController - ssh error: invalid command \N
[main] WARN dk.netarkivet.systemtest.environment.TestEnvironmentController - ssh error: invalid command \N
[main] WARN dk.netarkivet.systemtest.environment.TestEnvironmentController - ssh error: invalid command \N
[main] WARN dk.netarkivet.systemtest.environment.TestEnvironmentController - ssh error: invalid command \N
[main] WARN dk.netarkivet.systemtest.environment.TestEnvironmentController - ssh error: invalid command \N
[main] WARN dk.netarkivet.systemtest.environment.TestEnvironmentController - ssh error: invalid command \N
[main] WARN dk.netarkivet.systemtest.environment.TestEnvironmentController - ssh error: invalid command \N
[main] WARN dk.netarkivet.systemtest.environment.TestEnvironmentController - ssh error: invalid command \N
[main] WARN dk.netarkivet.systemtest.environment.TestEnvironmentController - ssh error: invalid command \N
[main] WARN dk.netarkivet.systemtest.environment.TestEnvironmentController - ssh error: invalid command \N
[main] WARN dk.netarkivet.systemtest.environment.TestEnvironmentController - ssh error: invalid command \N
[main] WARN dk.netarkivet.systemtest.environment.TestEnvironmentController - ssh error: invalid command \.
[main] WARN dk.netarkivet.systemtest.environment.TestEnvironmentController - ssh error: ERROR:  syntax error at or near "1"
[main] WARN dk.netarkivet.systemtest.environment.TestEnvironmentController - ssh error: LINE 1: 1 kb.dk  1  1 
[main] WARN dk.netarkivet.systemtest.environment.TestEnvironmentController - ssh error:         ^
[main] WARN dk.netarkivet.systemtest.environment.TestEnvironmentController - ssh error: ERROR:  relation "harvestchannel" does not exist
[main] WARN dk.netarkivet.systemtest.environment.TestEnvironmentController - ssh error: invalid command \.
[main] WARN dk.netarkivet.systemtest.environment.TestEnvironmentController - ssh error: ERROR:  syntax error at or near "1"
[main] WARN dk.netarkivet.systemtest.environment.TestEnvironmentController - ssh error: LINE 1: 1 LOWPRIORITY t t Channel for snapshot harvests
[main] WARN dk.netarkivet.systemtest.environment.TestEnvironmentController - ssh error:         ^
[main] WARN dk.netarkivet.systemtest.environment.TestEnvironmentController - ssh error: ERROR:  relation "ordertemplates" does not exist
[main] WARN dk.netarkivet.systemtest.environment.TestEnvironmentController - ssh error: invalid command \n<!--
[main] WARN dk.netarkivet.systemtest.environment.TestEnvironmentController - ssh error: invalid command \n<!--
[main] WARN dk.netarkivet.systemtest.environment.TestEnvironmentController - ssh error: invalid command \.
[main] WARN dk.netarkivet.systemtest.environment.TestEnvironmentController - ssh error: ERROR:  syntax error at or near "2"
[main] WARN dk.netarkivet.systemtest.environment.TestEnvironmentController - ssh error: LINE 1: 2 default_obeyrobots <?xml version="1.0" encoding="UTF-8"?>
[main] WARN dk.netarkivet.systemtest.environment.TestEnvironmentController - ssh error:         ^
[main] WARN dk.netarkivet.systemtest.environment.TestEnvironmentController - ssh error: ERROR:  relation "schedules" does not exist
[main] WARN dk.netarkivet.systemtest.environment.TestEnvironmentController - ssh error: invalid command \N
[main] WARN dk.netarkivet.systemtest.environment.TestEnvironmentController - ssh error: invalid command \N
[main] WARN dk.netarkivet.systemtest.environment.TestEnvironmentController - ssh error: invalid command \N
[main] WARN dk.netarkivet.systemtest.environment.TestEnvironmentController - ssh error: invalid command \N
[main] WARN dk.netarkivet.systemtest.environment.TestEnvironmentController - ssh error: invalid command \.
[main] WARN dk.netarkivet.systemtest.environment.TestEnvironmentController - ssh error: ERROR:  syntax error at or near "1"
[main] WARN dk.netarkivet.systemtest.environment.TestEnvironmentController - ssh error: LINE 1: 1 Once_a_day En gang om dagen, med det samme 
[main] WARN dk.netarkivet.systemtest.environment.TestEnvironmentController - ssh error:         ^
[main] WARN dk.netarkivet.systemtest.environment.TestEnvironmentController - ssh error: ERROR:  relation "schemaversions" does not exist
[main] WARN dk.netarkivet.systemtest.environment.TestEnvironmentController - ssh error: invalid command \.
[main] WARN dk.netarkivet.systemtest.environment.TestEnvironmentController - ssh error: ERROR:  syntax error at or near "domains"
[main] WARN dk.netarkivet.systemtest.environment.TestEnvironmentController - ssh error: LINE 1: domains 3
[main] WARN dk.netarkivet.systemtest.environment.TestEnvironmentController - ssh error:         ^
[main] WARN dk.netarkivet.systemtest.environment.TestEnvironmentController - ssh error: invalid command \n
[main] WARN dk.netarkivet.systemtest.environment.TestEnvironmentController - ssh error: invalid command \n
[main] WARN dk.netarkivet.systemtest.environment.TestEnvironmentController - ssh error: invalid command \n
[main] WARN dk.netarkivet.systemtest.environment.TestEnvironmentController - ssh error: invalid command \n
[main] WARN dk.netarkivet.systemtest.environment.TestEnvironmentController - ssh error: invalid command \n
[main] WARN dk.netarkivet.systemtest.environment.TestEnvironmentController - ssh error: invalid command \n
[main] WARN dk.netarkivet.systemtest.environment.TestEnvironmentController - ssh error: invalid command \n
[main] WARN dk.netarkivet.systemtest.environment.TestEnvironmentController - ssh error: invalid command \n
[main] WARN dk.netarkivet.systemtest.environment.TestEnvironmentController - ssh error: invalid command \n
[main] WARN dk.netarkivet.systemtest.environment.TestEnvironmentController - ssh error: invalid command \n
[main] WARN dk.netarkivet.systemtest.environment.TestEnvironmentController - ssh error: invalid command \n
[main] WARN dk.netarkivet.systemtest.environment.TestEnvironmentController - ssh error: invalid command \n
[main] WARN dk.netarkivet.systemtest.environment.TestEnvironmentController - ssh error: invalid command \n
[main] WARN dk.netarkivet.systemtest.environment.TestEnvironmentController - ssh error: invalid command \n
[main] WARN dk.netarkivet.systemtest.environment.TestEnvironmentController - ssh error: invalid command \n
[main] WARN dk.netarkivet.systemtest.environment.TestEnvironmentController - ssh error: invalid command \n
[main] WARN dk.netarkivet.systemtest.environment.TestEnvironmentController - ssh error: invalid command \.
[main] WARN dk.netarkivet.systemtest.environment.TestEnvironmentController - ssh error: ERROR:  syntax error at or near "1"
[main] WARN dk.netarkivet.systemtest.environment.TestEnvironmentController - ssh error: LINE 1: 1 defaultseeds  1 www.kb.dk
[main] WARN dk.netarkivet.systemtest.environment.TestEnvironmentController - ssh error:         ^
[main] WARN dk.netarkivet.systemtest.environment.TestEnvironmentController - ssh error: Error: Could not find or load main class dk.netarkivet.harvester.tools.HarvestTemplateApplication
[main] INFO dk.netarkivet.systemtest.environment.TestEnvironmentController - Command finished in 14 seconds. Exit code was 0
          Stimuli: Waiting for GUI to start.
............................................................        Added fixture: Selecting English as language
      Test starting: updateTemplateTest
      Test starting: domainCreationTest
      Test starting: usedConfigurationFilteringTest
      Test starting: usedSeedListsFilteringTest
      Test starting: extendedDomainStringFieldTest
      Test starting: jobSplittingTest
      Test starting: selectiveHarvestListingTest
      Test starting: snapshotTest
      Test starting: generalTest
[main] INFO dk.netarkivet.systemtest.environment.TestEnvironmentController - Running JSch command (on kb-test-adm-001.kb.dk): RemoteCommand sshTunneling=ssh kb-test-adm-001.kb.dk 
	source /etc/bashrc;source /etc/profile;source ~/.bash_profile;true;export PORT=8071;export MAILRECEIVERS=csr@statsbiblioteket.dk;export TESTX=SystemTest;true;export H3ZIP=/home/devel/nas_versions/bundler/NetarchiveSuite-heritrix3-bundler-systemtest.zip;
	cd SystemTest;if [ -f conf/settings_GUIApplication.xml.original ]; then echo conf/settings_GUIApplication.xml.original exist, moving back.; conf/kill_GUIApplication.sh; sleep 20;cp conf/settings_GUIApplication.xml.original conf/settings_GUIApplication.xml;  conf/start_GUIApplication.sh; fi
[main] WARN dk.netarkivet.systemtest.environment.TestEnvironmentController - ssh error: bash: line 0: cd: SystemTest: No such file or directory
[main] INFO dk.netarkivet.systemtest.environment.TestEnvironmentController - Command finished in 1 seconds. Exit code was 0
          Stimuli: Waiting for GUI to start.
........................................................................................................................      Test starting: historySortedTablePagingTest
[main] INFO dk.netarkivet.systemtest.environment.TestEnvironmentController - Running JSch command (on kb-test-adm-001.kb.dk): RemoteCommand sshTunneling=ssh kb-test-adm-001.kb.dk 
	source /etc/bashrc;source /etc/profile;source ~/.bash_profile;true;export PORT=8071;export MAILRECEIVERS=csr@statsbiblioteket.dk;export TESTX=SystemTest;true;export H3ZIP=/home/devel/nas_versions/bundler/NetarchiveSuite-heritrix3-bundler-systemtest.zip;
	cd SystemTest;if [ -f conf/settings_GUIApplication.xml.original ]; then echo conf/settings_GUIApplication.xml.original exist, moving back.; conf/kill_GUIApplication.sh; sleep 20;cp conf/settings_GUIApplication.xml.original conf/settings_GUIApplication.xml;  conf/start_GUIApplication.sh; fi
[main] WARN dk.netarkivet.systemtest.environment.TestEnvironmentController - ssh error: bash: line 0: cd: SystemTest: No such file or directory
[main] INFO dk.netarkivet.systemtest.environment.TestEnvironmentController - Command finished in 1 seconds. Exit code was 0
          Stimuli: Waiting for GUI to start.
........................................................................................................................[main] INFO dk.netarkivet.systemtest.environment.TestEnvironmentController - Running JSch command (on kb-test-adm-001.kb.dk): RemoteCommand sshTunneling=ssh kb-test-adm-001.kb.dk 
	source /etc/bashrc;source /etc/profile;source ~/.bash_profile;true;export PORT=8071;export MAILRECEIVERS=csr@statsbiblioteket.dk;export TESTX=SystemTest;true;export H3ZIP=/home/devel/nas_versions/bundler/NetarchiveSuite-heritrix3-bundler-systemtest.zip;
	cd SystemTest;if [ -f conf/settings_GUIApplication.xml.original ]; then echo conf/settings_GUIApplication.xml.original exist, moving back.; conf/kill_GUIApplication.sh; sleep 20;cp conf/settings_GUIApplication.xml.original conf/settings_GUIApplication.xml;  conf/start_GUIApplication.sh; fi
[main] WARN dk.netarkivet.systemtest.environment.TestEnvironmentController - ssh error: bash: line 0: cd: SystemTest: No such file or directory
[main] INFO dk.netarkivet.systemtest.environment.TestEnvironmentController - Command finished in 1 seconds. Exit code was 0
          Stimuli: Waiting for GUI to start.
........................................................................................................................      Test starting: historyTablePagingTest
[main] INFO dk.netarkivet.systemtest.environment.TestEnvironmentController - Running JSch command (on kb-test-adm-001.kb.dk): RemoteCommand sshTunneling=ssh kb-test-adm-001.kb.dk 
	source /etc/bashrc;source /etc/profile;source ~/.bash_profile;true;export PORT=8071;export MAILRECEIVERS=csr@statsbiblioteket.dk;export TESTX=SystemTest;true;export H3ZIP=/home/devel/nas_versions/bundler/NetarchiveSuite-heritrix3-bundler-systemtest.zip;
	cd SystemTest;if [ -f conf/settings_GUIApplication.xml.original ]; then echo conf/settings_GUIApplication.xml.original exist, moving back.; conf/kill_GUIApplication.sh; sleep 20;cp conf/settings_GUIApplication.xml.original conf/settings_GUIApplication.xml;  conf/start_GUIApplication.sh; fi
[main] WARN dk.netarkivet.systemtest.environment.TestEnvironmentController - ssh error: bash: line 0: cd: SystemTest: No such file or directory
[main] INFO dk.netarkivet.systemtest.environment.TestEnvironmentController - Command finished in 1 seconds. Exit code was 0
          Stimuli: Waiting for GUI to start.
........................................................................................................................[main] INFO dk.netarkivet.systemtest.environment.TestEnvironmentController - Running JSch command (on kb-test-adm-001.kb.dk): RemoteCommand sshTunneling=ssh kb-test-adm-001.kb.dk 
	source /etc/bashrc;source /etc/profile;source ~/.bash_profile;true;export PORT=8071;export MAILRECEIVERS=csr@statsbiblioteket.dk;export TESTX=SystemTest;true;export H3ZIP=/home/devel/nas_versions/bundler/NetarchiveSuite-heritrix3-bundler-systemtest.zip;
	cd SystemTest;if [ -f conf/settings_GUIApplication.xml.original ]; then echo conf/settings_GUIApplication.xml.original exist, moving back.; conf/kill_GUIApplication.sh; sleep 20;cp conf/settings_GUIApplication.xml.original conf/settings_GUIApplication.xml;  conf/start_GUIApplication.sh; fi
[main] WARN dk.netarkivet.systemtest.environment.TestEnvironmentController - ssh error: bash: line 0: cd: SystemTest: No such file or directory
[main] INFO dk.netarkivet.systemtest.environment.TestEnvironmentController - Command finished in 1 seconds. Exit code was 0
          Stimuli: Waiting for GUI to start.
........................................................................................................................      Test starting: sortableHistoryTableTest
[main] INFO dk.netarkivet.systemtest.environment.TestEnvironmentController - Running JSch command (on kb-test-adm-001.kb.dk): RemoteCommand sshTunneling=ssh kb-test-adm-001.kb.dk 
	source /etc/bashrc;source /etc/profile;source ~/.bash_profile;true;export PORT=8071;export MAILRECEIVERS=csr@statsbiblioteket.dk;export TESTX=SystemTest;true;export H3ZIP=/home/devel/nas_versions/bundler/NetarchiveSuite-heritrix3-bundler-systemtest.zip;
	cd SystemTest;if [ -f conf/settings_GUIApplication.xml.original ]; then echo conf/settings_GUIApplication.xml.original exist, moving back.; conf/kill_GUIApplication.sh; sleep 20;cp conf/settings_GUIApplication.xml.original conf/settings_GUIApplication.xml;  conf/start_GUIApplication.sh; fi
[main] WARN dk.netarkivet.systemtest.environment.TestEnvironmentController - ssh error: bash: line 0: cd: SystemTest: No such file or directory
[main] INFO dk.netarkivet.systemtest.environment.TestEnvironmentController - Command finished in 1 seconds. Exit code was 0
          Stimuli: Waiting for GUI to start.
........................................................................................................................      Finished testcase
          Stimuli: Deactivating all harvests
          Stimuli: Loading HarvestDefinition/Definitions-selective-harvests.jsp
org.openqa.selenium.NoSuchElementException: Unable to locate element: {"method":"link text","selector":"Create new selective harvest definition"}
Command duration or timeout: 1.11 seconds
For documentation on this error, please visit: http://seleniumhq.org/exceptions/no_such_element.html
Build info: version: '2.53.0', revision: '35ae25b1534ae328c771e0856c93e187490ca824', time: '2016-03-15 10:43:46'
System info: host: 'ci-build-002', ip: '130.225.27.166', os.name: 'Linux', os.arch: 'amd64', os.version: '3.10.0-514.21.2.el7.x86_64', java.version: '1.8.0_121'
Driver info: org.openqa.selenium.firefox.FirefoxDriver
Capabilities [{applicationCacheEnabled=true, rotatable=false, handlesAlerts=true, databaseEnabled=true, version=52.4.0, platform=LINUX, nativeEvents=false, acceptSslCerts=true, webStorageEnabled=true, locationContextEnabled=true, browserName=firefox, takesScreenshot=true, javascriptEnabled=true, cssSelectorsEnabled=true}]
Session ID: 41c00043-46f9-4907-bc96-d96ff5aa4a0f
*** Element info: {Using=link text, value=Create new selective harvest definition}
	at sun.reflect.NativeConstructorAccessorImpl.newInstance0(Native Method)
	at sun.reflect.NativeConstructorAccessorImpl.newInstance(NativeConstructorAccessorImpl.java:62)
	at sun.reflect.DelegatingConstructorAccessorImpl.newInstance(DelegatingConstructorAccessorImpl.java:45)
	at java.lang.reflect.Constructor.newInstance(Constructor.java:423)
	at org.openqa.selenium.remote.ErrorHandler.createThrowable(ErrorHandler.java:206)
	at org.openqa.selenium.remote.ErrorHandler.throwIfResponseFailed(ErrorHandler.java:158)
	at org.openqa.selenium.remote.RemoteWebDriver.execute(RemoteWebDriver.java:678)
	at org.openqa.selenium.remote.RemoteWebDriver.findElement(RemoteWebDriver.java:363)
	at org.openqa.selenium.remote.RemoteWebDriver.findElementByLinkText(RemoteWebDriver.java:428)
	at org.openqa.selenium.By$ByLinkText.findElement(By.java:246)
	at org.openqa.selenium.remote.RemoteWebDriver.findElement(RemoteWebDriver.java:355)
	at dk.netarkivet.systemtest.page.SelectiveHarvestPageHelper.deactivateAllHarvests(SelectiveHarvestPageHelper.java:122)
	at dk.netarkivet.systemtest.SeleniumTest.shutdown(SeleniumTest.java:132)
	at sun.reflect.NativeMethodAccessorImpl.invoke0(Native Method)
	at sun.reflect.NativeMethodAccessorImpl.invoke(NativeMethodAccessorImpl.java:62)
	at sun.reflect.DelegatingMethodAccessorImpl.invoke(DelegatingMethodAccessorImpl.java:43)
	at java.lang.reflect.Method.invoke(Method.java:498)
	at org.testng.internal.MethodInvocationHelper.invokeMethod(MethodInvocationHelper.java:85)
	at org.testng.internal.Invoker.invokeConfigurationMethod(Invoker.java:552)
	at org.testng.internal.Invoker.invokeConfigurations(Invoker.java:215)
	at org.testng.internal.Invoker.invokeConfigurations(Invoker.java:140)
	at org.testng.SuiteRunner.privateRun(SuiteRunner.java:322)
	at org.testng.SuiteRunner.run(SuiteRunner.java:254)
	at org.testng.SuiteRunnerWorker.runSuite(SuiteRunnerWorker.java:52)
	at org.testng.SuiteRunnerWorker.run(SuiteRunnerWorker.java:86)
	at org.testng.TestNG.runSuitesSequentially(TestNG.java:1224)
	at org.testng.TestNG.runSuitesLocally(TestNG.java:1149)
	at org.testng.TestNG.run(TestNG.java:1057)
	at org.apache.maven.surefire.testng.TestNGExecutor.run(TestNGExecutor.java:293)
	at org.apache.maven.surefire.testng.TestNGXmlTestSuite.execute(TestNGXmlTestSuite.java:84)
	at org.apache.maven.surefire.testng.TestNGProvider.invoke(TestNGProvider.java:91)
	at org.apache.maven.surefire.booter.ForkedBooter.invokeProviderInSameClassLoader(ForkedBooter.java:200)
	at org.apache.maven.surefire.booter.ForkedBooter.runSuitesInProcess(ForkedBooter.java:153)
	at org.apache.maven.surefire.booter.ForkedBooter.main(ForkedBooter.java:103)
Caused by: org.openqa.selenium.NoSuchElementException: Unable to locate element: {"method":"link text","selector":"Create new selective harvest definition"}
For documentation on this error, please visit: http://seleniumhq.org/exceptions/no_such_element.html
Build info: version: '2.53.0', revision: '35ae25b1534ae328c771e0856c93e187490ca824', time: '2016-03-15 10:43:46'
System info: host: 'ci-build-002', ip: '130.225.27.166', os.name: 'Linux', os.arch: 'amd64', os.version: '3.10.0-514.21.2.el7.x86_64', java.version: '1.8.0_121'
Driver info: driver.version: unknown
	at <anonymous class>.FirefoxDriver.prototype.findElementInternal_(file:///tmp/anonymous901811185224818881webdriver-profile/extensions/fxdriver@googlecode.com/components/driver-component.js:10770)
	at <anonymous class>.fxdriver.Timer.prototype.setTimeout/<.notify(file:///tmp/anonymous901811185224818881webdriver-profile/extensions/fxdriver@googlecode.com/components/driver-component.js:625)
  Finished suite
Finished project
Tests run: 39, Failures: 1, Errors: 0, Skipped: 38, Time elapsed: 964.914 sec <<< FAILURE! - in TestSuite
setupTest(dk.netarkivet.systemtest.functional.HarvesterStartStopTest)  Time elapsed: 90.563 sec  <<< FAILURE!
org.openqa.selenium.NoSuchElementException: Unable to locate element: {"method":"link text","selector":"English"}
Command duration or timeout: 1.09 seconds
For documentation on this error, please visit: http://seleniumhq.org/exceptions/no_such_element.html
Build info: version: '2.53.0', revision: '35ae25b1534ae328c771e0856c93e187490ca824', time: '2016-03-15 10:43:46'
System info: host: 'ci-build-002', ip: '130.225.27.166', os.name: 'Linux', os.arch: 'amd64', os.version: '3.10.0-514.21.2.el7.x86_64', java.version: '1.8.0_121'
Driver info: org.openqa.selenium.firefox.FirefoxDriver
Capabilities [{applicationCacheEnabled=true, rotatable=false, handlesAlerts=true, databaseEnabled=true, version=52.4.0, platform=LINUX, nativeEvents=false, acceptSslCerts=true, webStorageEnabled=true, locationContextEnabled=true, browserName=firefox, takesScreenshot=true, javascriptEnabled=true, cssSelectorsEnabled=true}]
Session ID: 41c00043-46f9-4907-bc96-d96ff5aa4a0f
*** Element info: {Using=link text, value=English}
	at sun.reflect.NativeConstructorAccessorImpl.newInstance0(Native Method)
	at sun.reflect.NativeConstructorAccessorImpl.newInstance(NativeConstructorAccessorImpl.java:62)
	at sun.reflect.DelegatingConstructorAccessorImpl.newInstance(DelegatingConstructorAccessorImpl.java:45)
	at java.lang.reflect.Constructor.newInstance(Constructor.java:423)
	at org.openqa.selenium.remote.ErrorHandler.createThrowable(ErrorHandler.java:206)
	at org.openqa.selenium.remote.ErrorHandler.throwIfResponseFailed(ErrorHandler.java:158)
	at org.openqa.selenium.remote.RemoteWebDriver.execute(RemoteWebDriver.java:678)
	at org.openqa.selenium.remote.RemoteWebDriver.findElement(RemoteWebDriver.java:363)
	at org.openqa.selenium.remote.RemoteWebDriver.findElementByLinkText(RemoteWebDriver.java:428)
	at org.openqa.selenium.By$ByLinkText.findElement(By.java:246)
	at org.openqa.selenium.remote.RemoteWebDriver.findElement(RemoteWebDriver.java:355)
	at dk.netarkivet.systemtest.SeleniumTest.initialiseSelenium(SeleniumTest.java:121)
	at dk.netarkivet.systemtest.SeleniumTest.setupTest(SeleniumTest.java:69)
	at sun.reflect.NativeMethodAccessorImpl.invoke0(Native Method)
	at sun.reflect.NativeMethodAccessorImpl.invoke(NativeMethodAccessorImpl.java:62)
	at sun.reflect.DelegatingMethodAccessorImpl.invoke(DelegatingMethodAccessorImpl.java:43)
	at java.lang.reflect.Method.invoke(Method.java:498)
	at org.testng.internal.MethodInvocationHelper.invokeMethod(MethodInvocationHelper.java:85)
	at org.testng.internal.Invoker.invokeConfigurationMethod(Invoker.java:552)
	at org.testng.internal.Invoker.invokeConfigurations(Invoker.java:215)
	at org.testng.internal.Invoker.invokeConfigurations(Invoker.java:140)
	at org.testng.SuiteRunner.privateRun(SuiteRunner.java:291)
	at org.testng.SuiteRunner.run(SuiteRunner.java:254)
	at org.testng.SuiteRunnerWorker.runSuite(SuiteRunnerWorker.java:52)
	at org.testng.SuiteRunnerWorker.run(SuiteRunnerWorker.java:86)
	at org.testng.TestNG.runSuitesSequentially(TestNG.java:1224)
	at org.testng.TestNG.runSuitesLocally(TestNG.java:1149)
	at org.testng.TestNG.run(TestNG.java:1057)
	at org.apache.maven.surefire.testng.TestNGExecutor.run(TestNGExecutor.java:293)
	at org.apache.maven.surefire.testng.TestNGXmlTestSuite.execute(TestNGXmlTestSuite.java:84)
	at org.apache.maven.surefire.testng.TestNGProvider.invoke(TestNGProvider.java:91)
	at org.apache.maven.surefire.booter.ForkedBooter.invokeProviderInSameClassLoader(ForkedBooter.java:200)
	at org.apache.maven.surefire.booter.ForkedBooter.runSuitesInProcess(ForkedBooter.java:153)
	at org.apache.maven.surefire.booter.ForkedBooter.main(ForkedBooter.java:103)
Caused by: org.openqa.selenium.NoSuchElementException: Unable to locate element: {"method":"link text","selector":"English"}
For documentation on this error, please visit: http://seleniumhq.org/exceptions/no_such_element.html
Build info: version: '2.53.0', revision: '35ae25b1534ae328c771e0856c93e187490ca824', time: '2016-03-15 10:43:46'
System info: host: 'ci-build-002', ip: '130.225.27.166', os.name: 'Linux', os.arch: 'amd64', os.version: '3.10.0-514.21.2.el7.x86_64', java.version: '1.8.0_121'
Driver info: driver.version: unknown
	at <anonymous class>.FirefoxDriver.prototype.findElementInternal_(file:///tmp/anonymous901811185224818881webdriver-profile/extensions/fxdriver@googlecode.com/components/driver-component.js:10770)
	at <anonymous class>.fxdriver.Timer.prototype.setTimeout/<.notify(file:///tmp/anonymous901811185224818881webdriver-profile/extensions/fxdriver@googlecode.com/components/driver-component.js:625)


Results :

Failed tests: 
  HarvesterStartStopTest>SeleniumTest.setupTest:69->SeleniumTest.initialiseSelenium:121 » NoSuchElement

Tests run: 39, Failures: 1, Errors: 0, Skipped: 38

[JENKINS] Recording test results
log4j:WARN No appenders could be found for logger (org.apache.commons.beanutils.converters.BooleanConverter).
log4j:WARN Please initialize the log4j system properly.
[JENKINS] Archiving disabled
[JENKINS] Archiving disabled[INFO] ------------------------------------------------------------------------

[INFO] BUILD FAILURE
[INFO] ------------------------------------------------------------------------
[INFO] Total time: 16:42 min
[INFO] Finished at: 2017-11-02T00:20:45+01:00
[INFO] Final Memory: 33M/80M
[INFO] ------------------------------------------------------------------------
[ERROR] Failed to execute goal org.apache.maven.plugins:maven-surefire-plugin:2.17:test (surefire-it) on project system-test: There are test failures.
[ERROR] 
[ERROR] Please refer to /home/cibuild02/workspace/NetarchiveSuite-system-test/integration-test/system-test/target/surefire-reports for the individual test results.
[ERROR] -> [Help 1]
[ERROR] 
[ERROR] To see the full stack trace of the errors, re-run Maven with the -e switch.
[ERROR] Re-run Maven using the -X switch to enable full debug logging.
[ERROR] 
[ERROR] For more information about the errors and possible solutions, please read the following articles:
[ERROR] [Help 1] http://cwiki.apache.org/confluence/display/MAVEN/MojoFailureException
channel stopped
Sending e-mails to: csr@statsbiblioteket.dk
Warning: you have no plugins providing access control for builds, so falling back to legacy behavior of permitting any downstream builds to be triggered
Finished: FAILURE