FailedConsole Output

Started by user Colin Rosenthal (csr)
Building remotely on NetarchiveSuite in workspace /home/cibuild02/workspace/Netarkivet-db-migration-pligt-test
 > git rev-parse --is-inside-work-tree # timeout=10
Fetching changes from the remote Git repository
 > git config remote.origin.url https://github.com/netarchivesuite/netarchivesuite.git # timeout=10
Fetching upstream changes from https://github.com/netarchivesuite/netarchivesuite.git
 > git --version # timeout=10
 > git -c core.askpass=true fetch --tags --progress https://github.com/netarchivesuite/netarchivesuite.git +refs/heads/*:refs/remotes/origin/*
 > git rev-parse refs/remotes/origin/master^{commit} # timeout=10
 > git rev-parse refs/remotes/origin/origin/master^{commit} # timeout=10
Checking out Revision 334efe5e5af796980ab14428389a3fcc09137eb2 (refs/remotes/origin/master)
 > git config core.sparsecheckout # timeout=10
 > git checkout -f 334efe5e5af796980ab14428389a3fcc09137eb2
 > git rev-list 3a4b8afbdbc5284d9402299072e7c82be2374a40 # timeout=10
[Netarkivet-db-migration-pligt-test] $ /bin/sh -xe /tmp/hudson5995134360603072047.sh
[Netarkivet-db-migration-pligt-test] $ /home/cibuild02/tools/hudson.tasks.Maven_MavenInstallation/Maven3/bin/mvn -Dstresstest.minchecksumtime=0 -Dsystemtest.backupage=720 -Dsystemtest.host=kb-test-adm-001.kb.dk -Dsystemtest.port=8073 -DfailIfNoTests=false -Dtest=DatabaseFullMigrationTest#* -Dstresstest.snapshottimedivider=10 -Dsystemtest.mailrecievers=csr@statsbiblioteket.dk -Dsystemtest.backupenv=pligt -Psbforge-nexus,systemTest clean integration-test -rf :system-test
[INFO] Scanning for projects...
[INFO]                                                                         
[INFO] ------------------------------------------------------------------------
[INFO] Building NetarchiveSuite System test 5.4-SNAPSHOT
[INFO] ------------------------------------------------------------------------
[INFO] 
[INFO] --- maven-clean-plugin:2.5:clean (default-clean) @ system-test ---
[INFO] Deleting /home/cibuild02/workspace/Netarkivet-db-migration-pligt-test/integration-test/system-test/target
[INFO] 
[INFO] --- maven-resources-plugin:2.6:resources (default-resources) @ system-test ---
[INFO] Using 'UTF-8' encoding to copy filtered resources.
[INFO] skip non existing resourceDirectory /home/cibuild02/workspace/Netarkivet-db-migration-pligt-test/integration-test/system-test/src/main/resources
[INFO] 
[INFO] --- maven-compiler-plugin:3.1:compile (default-compile) @ system-test ---
[INFO] No sources to compile
[INFO] 
[INFO] --- maven-resources-plugin:2.6:testResources (default-testResources) @ system-test ---
[INFO] Using 'UTF-8' encoding to copy filtered resources.
[INFO] Copying 4 resources
[INFO] 
[INFO] --- maven-compiler-plugin:3.1:testCompile (default-testCompile) @ system-test ---
[INFO] Changes detected - recompiling the module!
[INFO] Compiling 33 source files to /home/cibuild02/workspace/Netarkivet-db-migration-pligt-test/integration-test/system-test/target/test-classes
[INFO] 
[INFO] --- maven-surefire-plugin:2.17:test (default-test) @ system-test ---
[INFO] Tests are skipped.
[INFO] 
[INFO] --- maven-jgit-buildnumber-plugin:1.2.9:extract-buildnumber (git-buildnumber) @ system-test ---
[INFO] Cannot extract Git info, maybe custom build with 'pl' argument is running
[INFO] 
[INFO] --- maven-jar-plugin:2.4:jar (default-jar) @ system-test ---
[WARNING] JAR will be empty - no content was marked for inclusion!
[INFO] Building jar: /home/cibuild02/workspace/Netarkivet-db-migration-pligt-test/integration-test/system-test/target/system-test-5.4-SNAPSHOT.jar
[INFO] 
[INFO] --- maven-dependency-plugin:2.8:copy (copy-distribution-zip) @ system-test ---
[INFO] Configured Artifact: org.netarchivesuite:distribution:5.4-SNAPSHOT:zip
[INFO] Copying distribution-5.4-SNAPSHOT.zip to /home/cibuild02/workspace/Netarkivet-db-migration-pligt-test/integration-test/system-test/target/NetarchiveSuite-SystemTest.zip
[INFO] 
[INFO] --- maven-antrun-plugin:1.8:run (default) @ system-test ---
[INFO] Executing tasks

main:

deploy2test:
      [scp] Connecting to kb-prod-udv-001.kb.dk:22
      [scp] done.
[INFO] Executed tasks
[INFO] 
[INFO] --- maven-surefire-plugin:2.17:test (surefire-it) @ system-test ---
[INFO] Surefire report directory: /home/cibuild02/workspace/Netarkivet-db-migration-pligt-test/integration-test/system-test/target/surefire-reports

-------------------------------------------------------
 T E S T S
-------------------------------------------------------
Running dk.netarkivet.systemtest.performance.DatabaseFullMigrationTest
Configuring TestNG with: TestNG652Configurator
[main] INFO org.jaccept.TestEventManager - Loading properties from file:/home/cibuild02/workspace/Netarkivet-db-migration-pligt-test/integration-test/system-test/target/test-classes/jaccept.properties
[main] INFO org.jaccept.TestEventManager - Adding clients: org.jaccept.StdOutLogger
[main] INFO org.jaccept.TestEventManager - Adding JAccept client org.jaccept.StdOutLogger
Starting test project NetarchiveSuite System test
  Suite: Surefire suite
    Starting testcase DatabaseFullMigrationTest
        Added fixture: Cleaning up old test.
[main] INFO dk.netarkivet.systemtest.environment.TestEnvironmentController - Running JSch command (on null): RemoteCommand 
	source /etc/bashrc;source /etc/profile;source ~/.bash_profile;export VERSION=SystemTest;export PORT=8073;export MAILRECEIVERS=csr@statsbiblioteket.dk;export TESTX=Stresstest;export DEPLOYCONF=deploy_conf_stress_test.xml;true;
	cleanup_all_test.sh
[main] WARN dk.netarkivet.systemtest.environment.TestEnvironmentController - ssh error: The system cannot find the path specified.
[main] WARN dk.netarkivet.systemtest.environment.TestEnvironmentController - ssh error: The system cannot find the path specified.
[main] WARN dk.netarkivet.systemtest.environment.TestEnvironmentController - ssh error: The system cannot find the path specified.
[main] WARN dk.netarkivet.systemtest.environment.TestEnvironmentController - ssh error: The system cannot find the path specified.
[main] WARN dk.netarkivet.systemtest.environment.TestEnvironmentController - ssh error: The volume does not contain a recognized file system.
[main] WARN dk.netarkivet.systemtest.environment.TestEnvironmentController - ssh error: Please make sure that all required file system drivers are loaded and that the volume is not corrupted.
[main] WARN dk.netarkivet.systemtest.environment.TestEnvironmentController - ssh error: The system cannot find the file specified.
[main] WARN dk.netarkivet.systemtest.environment.TestEnvironmentController - ssh error: The system cannot find the file specified.
[main] INFO dk.netarkivet.systemtest.environment.TestEnvironmentController - Command finished in 61 seconds. Exit code was 0
        Added fixture: Preparing deploy
[main] INFO dk.netarkivet.systemtest.environment.TestEnvironmentController - Running JSch command (on null): RemoteCommand 
	source /etc/bashrc;source /etc/profile;source ~/.bash_profile;export VERSION=SystemTest;export PORT=8073;export MAILRECEIVERS=csr@statsbiblioteket.dk;export TESTX=Stresstest;export DEPLOYCONF=deploy_conf_stress_test.xml;true;
	prepare_test.sh deploy_config_stresstest.xml
[main] INFO dk.netarkivet.systemtest.environment.TestEnvironmentController - Command finished in 3 seconds. Exit code was 0
        Added fixture: Copying production databases to the relevant test servers from the directory /home/devel/pligt-backup
[main] INFO dk.netarkivet.systemtest.environment.TestEnvironmentController - Running JSch command (on kb-test-adm-001.kb.dk): RemoteCommand sshTunneling=ssh kb-test-adm-001.kb.dk 
	source /etc/bashrc;source /etc/profile;source ~/.bash_profile;export VERSION=SystemTest;export PORT=8073;export MAILRECEIVERS=csr@statsbiblioteket.dk;export TESTX=Stresstest;export DEPLOYCONF=deploy_conf_stress_test.xml;true;
	rm -rf /tmp/pligt_admindb.out
[main] INFO dk.netarkivet.systemtest.environment.TestEnvironmentController - Command finished in 1 seconds. Exit code was 0
[main] INFO dk.netarkivet.systemtest.environment.TestEnvironmentController - Running JSch command (on kb-test-adm-001.kb.dk): RemoteCommand sshTunneling=ssh kb-test-adm-001.kb.dk 
	source /etc/bashrc;source /etc/profile;source ~/.bash_profile;export VERSION=SystemTest;export PORT=8073;export MAILRECEIVERS=csr@statsbiblioteket.dk;export TESTX=Stresstest;export DEPLOYCONF=deploy_conf_stress_test.xml;true;
	rm -rf /tmp/pligt_harvestdb.dump.out
[main] INFO dk.netarkivet.systemtest.environment.TestEnvironmentController - Command finished in 1 seconds. Exit code was 0
[main] INFO dk.netarkivet.systemtest.environment.TestEnvironmentController - Running JSch command (on kb-test-acs-001.kb.dk): RemoteCommand sshTunneling=ssh kb-test-acs-001.kb.dk 
	source /etc/bashrc;source /etc/profile;source ~/.bash_profile;export VERSION=SystemTest;export PORT=8073;export MAILRECEIVERS=csr@statsbiblioteket.dk;export TESTX=Stresstest;export DEPLOYCONF=deploy_conf_stress_test.xml;true;
	rm -rf /tmp/CS
[main] INFO dk.netarkivet.systemtest.environment.TestEnvironmentController - Command finished in 1 seconds. Exit code was 0
        Added fixture: Copying admin db.
[main] INFO dk.netarkivet.systemtest.environment.TestEnvironmentController - Running JSch command (on null): RemoteCommand 
	source /etc/bashrc;source /etc/profile;source ~/.bash_profile;export VERSION=SystemTest;export PORT=8073;export MAILRECEIVERS=csr@statsbiblioteket.dk;export TESTX=Stresstest;export DEPLOYCONF=deploy_conf_stress_test.xml;true;
	scp -r ${HOME}/pligt-backup/pligt_admindb.out devel@kb-test-adm-001.kb.dk:/tmp
[main] INFO dk.netarkivet.systemtest.environment.TestEnvironmentController - Command finished in 1 seconds. Exit code was 0
        Added fixture: Copying harvest db
[main] INFO dk.netarkivet.systemtest.environment.TestEnvironmentController - Running JSch command (on null): RemoteCommand 
	source /etc/bashrc;source /etc/profile;source ~/.bash_profile;export VERSION=SystemTest;export PORT=8073;export MAILRECEIVERS=csr@statsbiblioteket.dk;export TESTX=Stresstest;export DEPLOYCONF=deploy_conf_stress_test.xml;true;
	scp -r ${HOME}/pligt-backup/pligt_harvestdb.dump.out devel@kb-test-adm-001.kb.dk:/tmp
[main] INFO dk.netarkivet.systemtest.environment.TestEnvironmentController - Command finished in 1 seconds. Exit code was 0
        Added fixture: Copying checksum db
[main] INFO dk.netarkivet.systemtest.environment.TestEnvironmentController - Running JSch command (on null): RemoteCommand 
	source /etc/bashrc;source /etc/profile;source ~/.bash_profile;export VERSION=SystemTest;export PORT=8073;export MAILRECEIVERS=csr@statsbiblioteket.dk;export TESTX=Stresstest;export DEPLOYCONF=deploy_conf_stress_test.xml;true;
	scp -r ${HOME}/pligt-backup/CS devel@kb-test-acs-001.kb.dk:/tmp
[main] INFO dk.netarkivet.systemtest.environment.TestEnvironmentController - Command finished in 1 seconds. Exit code was 0
        Step: Installing components.
[main] INFO dk.netarkivet.systemtest.environment.TestEnvironmentController - Running JSch command (on null): RemoteCommand 
	source /etc/bashrc;source /etc/profile;source ~/.bash_profile;export VERSION=SystemTest;export PORT=8073;export MAILRECEIVERS=csr@statsbiblioteket.dk;export TESTX=Stresstest;export DEPLOYCONF=deploy_conf_stress_test.xml;true;
	install_test.sh
[main] WARN dk.netarkivet.systemtest.environment.TestEnvironmentController - ssh error: DEBUG:  transaction ID wrap limit is 2257721481, limited by database "test2056_harvestdb"
[main] WARN dk.netarkivet.systemtest.environment.TestEnvironmentController - ssh error: DEBUG:  transaction ID wrap limit is 2257721481, limited by database "test2056_harvestdb"
[main] WARN dk.netarkivet.systemtest.environment.TestEnvironmentController - ssh error: NOTICE:  CREATE TABLE / PRIMARY KEY will create implicit index "replica_pkey" for table "replica"
[main] WARN dk.netarkivet.systemtest.environment.TestEnvironmentController - ssh error: NOTICE:  CREATE TABLE / UNIQUE will create implicit index "replica_replica_id_key" for table "replica"
[main] WARN dk.netarkivet.systemtest.environment.TestEnvironmentController - ssh error: NOTICE:  CREATE TABLE / UNIQUE will create implicit index "replica_replica_name_key" for table "replica"
[main] WARN dk.netarkivet.systemtest.environment.TestEnvironmentController - ssh error: NOTICE:  CREATE TABLE / PRIMARY KEY will create implicit index "replicafileinfo_pkey" for table "replicafileinfo"
[main] WARN dk.netarkivet.systemtest.environment.TestEnvironmentController - ssh error: NOTICE:  CREATE TABLE / PRIMARY KEY will create implicit index "file_pkey" for table "file"
[main] WARN dk.netarkivet.systemtest.environment.TestEnvironmentController - ssh error: NOTICE:  CREATE TABLE / PRIMARY KEY will create implicit index "segment_pkey" for table "segment"
[main] WARN dk.netarkivet.systemtest.environment.TestEnvironmentController - ssh error: DEBUG:  transaction ID wrap limit is 2257721481, limited by database "test2056_harvestdb"
[main] WARN dk.netarkivet.systemtest.environment.TestEnvironmentController - ssh error: DEBUG:  transaction ID wrap limit is 2257721481, limited by database "test2056_harvestdb"
[main] WARN dk.netarkivet.systemtest.environment.TestEnvironmentController - ssh error: NOTICE:  CREATE TABLE / PRIMARY KEY will create implicit index "domains_pkey" for table "domains"
[main] WARN dk.netarkivet.systemtest.environment.TestEnvironmentController - ssh error: NOTICE:  CREATE TABLE / UNIQUE will create implicit index "domains_name_key" for table "domains"
[main] WARN dk.netarkivet.systemtest.environment.TestEnvironmentController - ssh error: NOTICE:  CREATE TABLE / PRIMARY KEY will create implicit index "configurations_pkey" for table "configurations"
[main] WARN dk.netarkivet.systemtest.environment.TestEnvironmentController - ssh error: NOTICE:  CREATE TABLE / PRIMARY KEY will create implicit index "config_passwords_pkey" for table "config_passwords"
[main] WARN dk.netarkivet.systemtest.environment.TestEnvironmentController - ssh error: NOTICE:  CREATE TABLE / PRIMARY KEY will create implicit index "config_seedlists_pkey" for table "config_seedlists"
[main] WARN dk.netarkivet.systemtest.environment.TestEnvironmentController - ssh error: NOTICE:  CREATE TABLE / PRIMARY KEY will create implicit index "seedlists_pkey" for table "seedlists"
[main] WARN dk.netarkivet.systemtest.environment.TestEnvironmentController - ssh error: NOTICE:  CREATE TABLE / PRIMARY KEY will create implicit index "passwords_pkey" for table "passwords"
[main] WARN dk.netarkivet.systemtest.environment.TestEnvironmentController - ssh error: NOTICE:  CREATE TABLE / PRIMARY KEY will create implicit index "ownerinfo_pkey" for table "ownerinfo"
[main] WARN dk.netarkivet.systemtest.environment.TestEnvironmentController - ssh error: NOTICE:  CREATE TABLE / PRIMARY KEY will create implicit index "historyinfo_pkey" for table "historyinfo"
[main] WARN dk.netarkivet.systemtest.environment.TestEnvironmentController - ssh error: NOTICE:  CREATE TABLE / PRIMARY KEY will create implicit index "harvestdefinitions_pkey" for table "harvestdefinitions"
[main] WARN dk.netarkivet.systemtest.environment.TestEnvironmentController - ssh error: NOTICE:  CREATE TABLE / UNIQUE will create implicit index "harvestdefinitions_name_key" for table "harvestdefinitions"
[main] WARN dk.netarkivet.systemtest.environment.TestEnvironmentController - ssh error: NOTICE:  CREATE TABLE / PRIMARY KEY will create implicit index "fullharvests_pkey" for table "fullharvests"
[main] WARN dk.netarkivet.systemtest.environment.TestEnvironmentController - ssh error: NOTICE:  CREATE TABLE / PRIMARY KEY will create implicit index "partialharvests_pkey" for table "partialharvests"
[main] WARN dk.netarkivet.systemtest.environment.TestEnvironmentController - ssh error: NOTICE:  CREATE TABLE / PRIMARY KEY will create implicit index "harvest_configs_pkey" for table "harvest_configs"
[main] WARN dk.netarkivet.systemtest.environment.TestEnvironmentController - ssh error: NOTICE:  CREATE TABLE / PRIMARY KEY will create implicit index "schedules_pkey" for table "schedules"
[main] WARN dk.netarkivet.systemtest.environment.TestEnvironmentController - ssh error: NOTICE:  CREATE TABLE / UNIQUE will create implicit index "schedules_name_key" for table "schedules"
[main] WARN dk.netarkivet.systemtest.environment.TestEnvironmentController - ssh error: NOTICE:  CREATE TABLE / PRIMARY KEY will create implicit index "ordertemplates_pkey" for table "ordertemplates"
[main] WARN dk.netarkivet.systemtest.environment.TestEnvironmentController - ssh error: NOTICE:  CREATE TABLE / UNIQUE will create implicit index "ordertemplates_name_key" for table "ordertemplates"
[main] WARN dk.netarkivet.systemtest.environment.TestEnvironmentController - ssh error: NOTICE:  CREATE TABLE / PRIMARY KEY will create implicit index "jobs_pkey" for table "jobs"
[main] WARN dk.netarkivet.systemtest.environment.TestEnvironmentController - ssh error: NOTICE:  CREATE TABLE / PRIMARY KEY will create implicit index "job_configs_pkey" for table "job_configs"
[main] WARN dk.netarkivet.systemtest.environment.TestEnvironmentController - ssh error: NOTICE:  CREATE TABLE / PRIMARY KEY will create implicit index "global_crawler_trap_lists_pkey" for table "global_crawler_trap_lists"
[main] WARN dk.netarkivet.systemtest.environment.TestEnvironmentController - ssh error: NOTICE:  CREATE TABLE / UNIQUE will create implicit index "global_crawler_trap_lists_name_key" for table "global_crawler_trap_lists"
[main] WARN dk.netarkivet.systemtest.environment.TestEnvironmentController - ssh error: NOTICE:  CREATE TABLE / PRIMARY KEY will create implicit index "global_crawler_trap_expressions_pkey" for table "global_crawler_trap_expressions"
[main] WARN dk.netarkivet.systemtest.environment.TestEnvironmentController - ssh error: NOTICE:  CREATE TABLE / PRIMARY KEY will create implicit index "pkrunningjobshistory" for table "runningjobshistory"
[main] WARN dk.netarkivet.systemtest.environment.TestEnvironmentController - ssh error: NOTICE:  CREATE TABLE / PRIMARY KEY will create implicit index "pkrunningjobsmonitor" for table "runningjobsmonitor"
[main] WARN dk.netarkivet.systemtest.environment.TestEnvironmentController - ssh error: NOTICE:  CREATE TABLE / UNIQUE will create implicit index "pkfrontierreportlines" for table "frontierreportmonitor"
[main] WARN dk.netarkivet.systemtest.environment.TestEnvironmentController - ssh error: NOTICE:  CREATE TABLE / PRIMARY KEY will create implicit index "extendedfieldtype_pkey" for table "extendedfieldtype"
[main] WARN dk.netarkivet.systemtest.environment.TestEnvironmentController - ssh error: NOTICE:  CREATE TABLE / PRIMARY KEY will create implicit index "extendedfield_pkey" for table "extendedfield"
[main] WARN dk.netarkivet.systemtest.environment.TestEnvironmentController - ssh error: NOTICE:  CREATE TABLE / PRIMARY KEY will create implicit index "extendedfieldvalue_pkey" for table "extendedfieldvalue"
[main] WARN dk.netarkivet.systemtest.environment.TestEnvironmentController - ssh error: NOTICE:  CREATE TABLE / PRIMARY KEY will create implicit index "harvestchannel_pkey" for table "harvestchannel"
[main] WARN dk.netarkivet.systemtest.environment.TestEnvironmentController - ssh error: NOTICE:  CREATE TABLE / UNIQUE will create implicit index "harvestchannel_name_key" for table "harvestchannel"
[main] WARN dk.netarkivet.systemtest.environment.TestEnvironmentController - ssh error: NOTICE:  ALTER TABLE / ADD PRIMARY KEY will create implicit index "eav_type_attribute_pkey" for table "eav_type_attribute"
[main] WARN dk.netarkivet.systemtest.environment.TestEnvironmentController - ssh error: NOTICE:  ALTER TABLE / ADD PRIMARY KEY will create implicit index "eav_attribute_pkey" for table "eav_attribute"
[main] INFO dk.netarkivet.systemtest.environment.TestEnvironmentController - Command finished in 76 seconds. Exit code was 0
        Added fixture: Cleaning out harvest database
[main] INFO dk.netarkivet.systemtest.environment.TestEnvironmentController - Running JSch command (on kb-test-adm-001.kb.dk): RemoteCommand sshTunneling=ssh kb-test-adm-001.kb.dk 
	source /etc/bashrc;source /etc/profile;source ~/.bash_profile;export VERSION=SystemTest;export PORT=8073;export MAILRECEIVERS=csr@statsbiblioteket.dk;export TESTX=Stresstest;export DEPLOYCONF=deploy_conf_stress_test.xml;true;
	cd Stresstest;psql -U devel -c 'drop database if exists stresstest_harvestdb'
[main] WARN dk.netarkivet.systemtest.environment.TestEnvironmentController - ssh error: DEBUG:  transaction ID wrap limit is 2257721481, limited by database "test2056_harvestdb"
[main] INFO dk.netarkivet.systemtest.environment.TestEnvironmentController - Command finished in 1 seconds. Exit code was 0
[main] INFO dk.netarkivet.systemtest.environment.TestEnvironmentController - Running JSch command (on kb-test-adm-001.kb.dk): RemoteCommand sshTunneling=ssh kb-test-adm-001.kb.dk 
	source /etc/bashrc;source /etc/profile;source ~/.bash_profile;export VERSION=SystemTest;export PORT=8073;export MAILRECEIVERS=csr@statsbiblioteket.dk;export TESTX=Stresstest;export DEPLOYCONF=deploy_conf_stress_test.xml;true;
	cd Stresstest;psql -U devel -c 'create database stresstest_harvestdb'
[main] WARN dk.netarkivet.systemtest.environment.TestEnvironmentController - ssh error: DEBUG:  transaction ID wrap limit is 2257721481, limited by database "test2056_harvestdb"
[main] INFO dk.netarkivet.systemtest.environment.TestEnvironmentController - Command finished in 1 seconds. Exit code was 0
        Added fixture: Cleaning out admin database
[main] INFO dk.netarkivet.systemtest.environment.TestEnvironmentController - Running JSch command (on kb-test-adm-001.kb.dk): RemoteCommand sshTunneling=ssh kb-test-adm-001.kb.dk 
	source /etc/bashrc;source /etc/profile;source ~/.bash_profile;export VERSION=SystemTest;export PORT=8073;export MAILRECEIVERS=csr@statsbiblioteket.dk;export TESTX=Stresstest;export DEPLOYCONF=deploy_conf_stress_test.xml;true;
	cd Stresstest;psql -U devel -c 'drop database if exists stresstest_admindb'
[main] WARN dk.netarkivet.systemtest.environment.TestEnvironmentController - ssh error: DEBUG:  transaction ID wrap limit is 2257721481, limited by database "test2056_harvestdb"
[main] INFO dk.netarkivet.systemtest.environment.TestEnvironmentController - Command finished in 1 seconds. Exit code was 0
[main] INFO dk.netarkivet.systemtest.environment.TestEnvironmentController - Running JSch command (on kb-test-adm-001.kb.dk): RemoteCommand sshTunneling=ssh kb-test-adm-001.kb.dk 
	source /etc/bashrc;source /etc/profile;source ~/.bash_profile;export VERSION=SystemTest;export PORT=8073;export MAILRECEIVERS=csr@statsbiblioteket.dk;export TESTX=Stresstest;export DEPLOYCONF=deploy_conf_stress_test.xml;true;
	cd Stresstest;psql -U devel -c 'create database stresstest_admindb'
[main] WARN dk.netarkivet.systemtest.environment.TestEnvironmentController - ssh error: DEBUG:  transaction ID wrap limit is 2257721481, limited by database "test2056_harvestdb"
[main] INFO dk.netarkivet.systemtest.environment.TestEnvironmentController - Command finished in 1 seconds. Exit code was 0
        Added fixture: Populating empty databases.
        Added fixture: Ingesting full production admindb backup.
[main] INFO dk.netarkivet.systemtest.environment.TestEnvironmentController - Running JSch command (on kb-test-adm-001.kb.dk): RemoteCommand sshTunneling=ssh kb-test-adm-001.kb.dk 
	source /etc/bashrc;source /etc/profile;source ~/.bash_profile;export VERSION=SystemTest;export PORT=8073;export MAILRECEIVERS=csr@statsbiblioteket.dk;export TESTX=Stresstest;export DEPLOYCONF=deploy_conf_stress_test.xml;true;
	cd Stresstest;pg_restore -U devel -d stresstest_admindb  --no-owner --schema public /tmp/pligt_admindb.out
[main] INFO dk.netarkivet.systemtest.environment.TestEnvironmentController - Command finished in 2 seconds. Exit code was 0
        Added fixture: Ingesting full production harvestdb backup
[main] INFO dk.netarkivet.systemtest.environment.TestEnvironmentController - Running JSch command (on kb-test-adm-001.kb.dk): RemoteCommand sshTunneling=ssh kb-test-adm-001.kb.dk 
	source /etc/bashrc;source /etc/profile;source ~/.bash_profile;export VERSION=SystemTest;export PORT=8073;export MAILRECEIVERS=csr@statsbiblioteket.dk;export TESTX=Stresstest;export DEPLOYCONF=deploy_conf_stress_test.xml;true;
	cd Stresstest;pg_restore -U devel -d stresstest_harvestdb  --no-owner --schema public /tmp/pligt_harvestdb.dump.out
[main] INFO dk.netarkivet.systemtest.environment.TestEnvironmentController - Command finished in 12 seconds. Exit code was 0
        Added fixture: Replacing checksum database with prod data
[main] INFO dk.netarkivet.systemtest.environment.TestEnvironmentController - Running JSch command (on kb-test-acs-001.kb.dk): RemoteCommand sshTunneling=ssh kb-test-acs-001.kb.dk 
	source /etc/bashrc;source /etc/profile;source ~/.bash_profile;export VERSION=SystemTest;export PORT=8073;export MAILRECEIVERS=csr@statsbiblioteket.dk;export TESTX=Stresstest;export DEPLOYCONF=deploy_conf_stress_test.xml;true;
	cd Stresstest;rm -rf CS
[main] INFO dk.netarkivet.systemtest.environment.TestEnvironmentController - Command finished in 1 seconds. Exit code was 0
[main] INFO dk.netarkivet.systemtest.environment.TestEnvironmentController - Running JSch command (on kb-test-acs-001.kb.dk): RemoteCommand sshTunneling=ssh kb-test-acs-001.kb.dk 
	source /etc/bashrc;source /etc/profile;source ~/.bash_profile;export VERSION=SystemTest;export PORT=8073;export MAILRECEIVERS=csr@statsbiblioteket.dk;export TESTX=Stresstest;export DEPLOYCONF=deploy_conf_stress_test.xml;true;
	cd Stresstest;ln -s /tmp/CS CS
[main] INFO dk.netarkivet.systemtest.environment.TestEnvironmentController - Command finished in 1 seconds. Exit code was 0
[main] INFO dk.netarkivet.systemtest.environment.TestEnvironmentController - Running JSch command (on kb-test-adm-001.kb.dk): RemoteCommand sshTunneling=ssh kb-test-adm-001.kb.dk 
	source /etc/bashrc;source /etc/profile;source ~/.bash_profile;export VERSION=SystemTest;export PORT=8073;export MAILRECEIVERS=csr@statsbiblioteket.dk;export TESTX=Stresstest;export DEPLOYCONF=deploy_conf_stress_test.xml;true;
	cd Stresstest;export CLASSPATH=./lib/netarchivesuite-harvest-scheduler.jar:./lib/netarchivesuite-monitor-core.jar:$CLASSPATH;java -Xmx1536m -Ddk.netarkivet.settings.file=./conf/settings_GUIApplication.xml -Dlogback.configurationFile=./conf/logback_GUIApplication.xml dk.netarkivet.harvester.tools.HarvestdatabaseUpdateApplication < /dev/null > start_harvestdatabaseUpdateApplication.log 2>&1 
[main] INFO dk.netarkivet.systemtest.environment.TestEnvironmentController - Command finished in 2 seconds. Exit code was 0
        Added fixture: Starting Test
[main] INFO dk.netarkivet.systemtest.environment.TestEnvironmentController - Running JSch command (on null): RemoteCommand 
	source /etc/bashrc;source /etc/profile;source ~/.bash_profile;export VERSION=SystemTest;export PORT=8073;export MAILRECEIVERS=csr@statsbiblioteket.dk;export TESTX=Stresstest;export DEPLOYCONF=deploy_conf_stress_test.xml;true;
	start_test.sh
[main] INFO dk.netarkivet.systemtest.environment.TestEnvironmentController - Command finished in 61 seconds. Exit code was 0
      Test starting: testGenerateSnapshot
        Description: Test generating snapshot jobs with a maximum number of bytes per domain of 100 000. This takes about ten hours to complete. The number of jobs generated is determined roughly by the parameter settings.harvester.scheduler.jobGen.domainConfigSubsetSize which is set to 10000 by default. Ie there is a maximum of 10000 domains per job, although there are also a small number of jobs with much fewer domains where these have specialised configurations.
[main] INFO dk.netarkivet.systemtest.performance.DatabaseFullMigrationTest - Dividing timescale for snapshot test by a factor 10 (stresstest.snapshottimedivider).
          Stimuli: Waiting for GUI to start.

        Added fixture: Opening front page kb-test-adm-001.kb.dk:8073
        Step: Creating snapshot harvest 'SelCPw'
        Step: Activate harvest
[main] INFO dk.netarkivet.systemtest.environment.TestEnvironmentController - Running JSch command (on kb-test-adm-001.kb.dk): RemoteCommand sshTunneling=ssh kb-test-adm-001.kb.dk 
	source /etc/bashrc;source /etc/profile;source ~/.bash_profile;export VERSION=SystemTest;export PORT=8073;export MAILRECEIVERS=csr@statsbiblioteket.dk;export TESTX=Stresstest;export DEPLOYCONF=deploy_conf_stress_test.xml;true;
	grep 'Created' ${HOME}/Stresstest/log/HarvestJobManager*
[main] INFO dk.netarkivet.systemtest.environment.TestEnvironmentController - Command finished in 1 seconds. Exit code was 0
          Result: Job SnapshotGenerationJob finished successfully after 743s with result Generated 14 jobs.
      Test success: testGenerateSnapshot
      Test starting: testIngestDomains
        Description: Test ingesting domains from a textual list of about 2 million domains. This is not a particularly heavy operation but tests some browser functionality which is not easily testable elsewhere - specifically that the 'keep-alive' functionality allows the browser to follow the complete upload/ingest of all the domains without timing out.
          Stimuli: Waiting for GUI to start.

        Added fixture: Opening front page kb-test-adm-001.kb.dk:8073
          Stimuli: Waiting for GUI to start.

        Added fixture: Opening initial page kb-test-adm-001.kb.dk:8073
        Step: Getting domain file
        Step: Checking for existence of domains file
        Step: Ingesting domains from /tmp/domains782262130885893219txt
      Test failed: org.openqa.selenium.TimeoutException: Timed out waiting for page load.
Command duration or timeout: 1800.06 seconds
Build info: version: '2.53.0', revision: '35ae25b1534ae328c771e0856c93e187490ca824', time: '2016-03-15 10:43:46'
System info: host: 'ci-build-002', ip: '130.225.27.166', os.name: 'Linux', os.arch: 'amd64', os.version: '3.10.0-514.21.2.el7.x86_64', java.version: '1.8.0_121'
Driver info: org.openqa.selenium.firefox.FirefoxDriver
Capabilities [{applicationCacheEnabled=true, rotatable=false, handlesAlerts=true, databaseEnabled=true, version=52.4.0, platform=LINUX, nativeEvents=false, acceptSslCerts=true, webStorageEnabled=true, locationContextEnabled=true, browserName=firefox, takesScreenshot=true, javascriptEnabled=true, cssSelectorsEnabled=true}]
Session ID: 8b83c446-8f6b-4f22-b8c0-094c7f4e9747
[main] INFO dk.netarkivet.systemtest.performance.DatabaseFullMigrationTest - Test failure, dumping screenshot as target/failurescreendumps/DatabaseFullMigrationTest.testIngestDomains()[pri:0, instance:dk.netarkivet.systemtest.performance.DatabaseFullMigrationTest@9f70c54].png
      Finished testcase
  Finished suite
Finished project
Tests run: 3, Failures: 2, Errors: 0, Skipped: 0, Time elapsed: 2,805.668 sec <<< FAILURE! - in dk.netarkivet.systemtest.performance.DatabaseFullMigrationTest
testIngestDomains(dk.netarkivet.systemtest.performance.DatabaseFullMigrationTest)  Time elapsed: 1,814.239 sec  <<< FAILURE!
org.openqa.selenium.TimeoutException: Timed out waiting for page load.
Command duration or timeout: 1800.06 seconds
Build info: version: '2.53.0', revision: '35ae25b1534ae328c771e0856c93e187490ca824', time: '2016-03-15 10:43:46'
System info: host: 'ci-build-002', ip: '130.225.27.166', os.name: 'Linux', os.arch: 'amd64', os.version: '3.10.0-514.21.2.el7.x86_64', java.version: '1.8.0_121'
Driver info: org.openqa.selenium.firefox.FirefoxDriver
Capabilities [{applicationCacheEnabled=true, rotatable=false, handlesAlerts=true, databaseEnabled=true, version=52.4.0, platform=LINUX, nativeEvents=false, acceptSslCerts=true, webStorageEnabled=true, locationContextEnabled=true, browserName=firefox, takesScreenshot=true, javascriptEnabled=true, cssSelectorsEnabled=true}]
Session ID: 8b83c446-8f6b-4f22-b8c0-094c7f4e9747
	at sun.reflect.NativeConstructorAccessorImpl.newInstance0(Native Method)
	at sun.reflect.NativeConstructorAccessorImpl.newInstance(NativeConstructorAccessorImpl.java:62)
	at sun.reflect.DelegatingConstructorAccessorImpl.newInstance(DelegatingConstructorAccessorImpl.java:45)
	at java.lang.reflect.Constructor.newInstance(Constructor.java:423)
	at org.openqa.selenium.remote.ErrorHandler.createThrowable(ErrorHandler.java:206)
	at org.openqa.selenium.remote.ErrorHandler.throwIfResponseFailed(ErrorHandler.java:158)
	at org.openqa.selenium.remote.RemoteWebDriver.execute(RemoteWebDriver.java:678)
	at org.openqa.selenium.remote.RemoteWebElement.execute(RemoteWebElement.java:327)
	at org.openqa.selenium.remote.RemoteWebElement.submit(RemoteWebElement.java:90)
	at dk.netarkivet.systemtest.performance.IngestDomainJob.startJob(IngestDomainJob.java:77)
	at dk.netarkivet.systemtest.performance.LongRunningJob.run(LongRunningJob.java:57)
	at dk.netarkivet.systemtest.performance.DatabaseFullMigrationTest.doIngestDomains(DatabaseFullMigrationTest.java:99)
	at dk.netarkivet.systemtest.performance.DatabaseFullMigrationTest.testIngestDomains(DatabaseFullMigrationTest.java:59)
Caused by: org.openqa.selenium.TimeoutException: Timed out waiting for page load.
Build info: version: '2.53.0', revision: '35ae25b1534ae328c771e0856c93e187490ca824', time: '2016-03-15 10:43:46'
System info: host: 'ci-build-002', ip: '130.225.27.166', os.name: 'Linux', os.arch: 'amd64', os.version: '3.10.0-514.21.2.el7.x86_64', java.version: '1.8.0_121'
Driver info: driver.version: unknown
	at <anonymous class>.WebElement.submitElement/<(file:///tmp/anonymous5214931071535119621webdriver-profile/extensions/fxdriver@googlecode.com/components/command-processor.js:12164)
	at <anonymous class>.WebLoadingListener/e(file:///tmp/anonymous5214931071535119621webdriver-profile/extensions/fxdriver@googlecode.com/components/command-processor.js:5142)
	at <anonymous class>.WebLoadingListener/<(file:///tmp/anonymous5214931071535119621webdriver-profile/extensions/fxdriver@googlecode.com/components/command-processor.js:5150)
	at <anonymous class>.fxdriver.Timer.prototype.setTimeout/<.notify(file:///tmp/anonymous5214931071535119621webdriver-profile/extensions/fxdriver@googlecode.com/components/command-processor.js:625)

onFailure(dk.netarkivet.systemtest.performance.DatabaseFullMigrationTest)  Time elapsed: 1,814.241 sec  <<< FAILURE!
java.lang.NullPointerException: null
	at dk.netarkivet.systemtest.SeleniumTest.onFailure(SeleniumTest.java:156)
	at sun.reflect.NativeMethodAccessorImpl.invoke0(Native Method)
	at sun.reflect.NativeMethodAccessorImpl.invoke(NativeMethodAccessorImpl.java:62)
	at sun.reflect.DelegatingMethodAccessorImpl.invoke(DelegatingMethodAccessorImpl.java:43)
	at java.lang.reflect.Method.invoke(Method.java:498)
	at org.testng.internal.MethodInvocationHelper.invokeMethod(MethodInvocationHelper.java:85)
	at org.testng.internal.Invoker.invokeConfigurationMethod(Invoker.java:552)
	at org.testng.internal.Invoker.invokeConfigurations(Invoker.java:215)
	at org.testng.internal.Invoker.invokeMethod(Invoker.java:769)
	at org.testng.internal.Invoker.invokeTestMethod(Invoker.java:882)
	at org.testng.internal.Invoker.invokeTestMethods(Invoker.java:1189)
	at org.testng.internal.TestMethodWorker.invokeTestMethods(TestMethodWorker.java:124)
	at org.testng.internal.TestMethodWorker.run(TestMethodWorker.java:108)
	at org.testng.TestRunner.privateRun(TestRunner.java:767)
	at org.testng.TestRunner.run(TestRunner.java:617)
	at org.testng.SuiteRunner.runTest(SuiteRunner.java:348)
	at org.testng.SuiteRunner.runSequentially(SuiteRunner.java:343)
	at org.testng.SuiteRunner.privateRun(SuiteRunner.java:305)
	at org.testng.SuiteRunner.run(SuiteRunner.java:254)
	at org.testng.SuiteRunnerWorker.runSuite(SuiteRunnerWorker.java:52)
	at org.testng.SuiteRunnerWorker.run(SuiteRunnerWorker.java:86)
	at org.testng.TestNG.runSuitesSequentially(TestNG.java:1224)
	at org.testng.TestNG.runSuitesLocally(TestNG.java:1149)
	at org.testng.TestNG.run(TestNG.java:1057)
	at org.apache.maven.surefire.testng.TestNGExecutor.run(TestNGExecutor.java:115)
	at org.apache.maven.surefire.testng.TestNGDirectoryTestSuite.executeSingleClass(TestNGDirectoryTestSuite.java:128)
	at org.apache.maven.surefire.testng.TestNGDirectoryTestSuite.execute(TestNGDirectoryTestSuite.java:112)
	at org.apache.maven.surefire.testng.TestNGProvider.invoke(TestNGProvider.java:112)
	at org.apache.maven.surefire.booter.ForkedBooter.invokeProviderInSameClassLoader(ForkedBooter.java:200)
	at org.apache.maven.surefire.booter.ForkedBooter.runSuitesInProcess(ForkedBooter.java:153)
	at org.apache.maven.surefire.booter.ForkedBooter.main(ForkedBooter.java:103)


Results :

Failed tests: 
  DatabaseFullMigrationTest.testIngestDomains:59->doIngestDomains:99 » Timeout T...
  DatabaseFullMigrationTest>SeleniumTest.onFailure:156 » NullPointer

Tests run: 3, Failures: 2, Errors: 0, Skipped: 0

[INFO] ------------------------------------------------------------------------
[INFO] BUILD FAILURE
[INFO] ------------------------------------------------------------------------
[INFO] Total time: 47:19 min
[INFO] Finished at: 2017-11-08T22:00:41+01:00
[INFO] Final Memory: 33M/78M
[INFO] ------------------------------------------------------------------------
[ERROR] Failed to execute goal org.apache.maven.plugins:maven-surefire-plugin:2.17:test (surefire-it) on project system-test: There are test failures.
[ERROR] 
[ERROR] Please refer to /home/cibuild02/workspace/Netarkivet-db-migration-pligt-test/integration-test/system-test/target/surefire-reports for the individual test results.
[ERROR] -> [Help 1]
[ERROR] 
[ERROR] To see the full stack trace of the errors, re-run Maven with the -e switch.
[ERROR] Re-run Maven using the -X switch to enable full debug logging.
[ERROR] 
[ERROR] For more information about the errors and possible solutions, please read the following articles:
[ERROR] [Help 1] http://cwiki.apache.org/confluence/display/MAVEN/MojoFailureException
Build step 'Invoke top-level Maven targets' marked build as failure
TestNG Reports Processing: START
Looking for TestNG results report in workspace using pattern: **system-test/target/surefire-reports/testng-results.xml
Did not find any matching files.
Sending e-mails to: csr@statsbiblioteket.dk
Warning: you have no plugins providing access control for builds, so falling back to legacy behavior of permitting any downstream builds to be triggered
Finished: FAILURE