FailedConsole Output

Skipping 62 KB.. Full Log
[INFO] Compiling 76 source files to /home/cibuild02/workspace/Netarchivesuite-db-full-migration-test/common/common-test/target/test-classes
[WARNING] /home/cibuild02/workspace/Netarchivesuite-db-full-migration-test/common/common-test/src/test/java/dk/netarkivet/common/utils/StringUtilsTester.java: /home/cibuild02/workspace/Netarchivesuite-db-full-migration-test/common/common-test/src/test/java/dk/netarkivet/common/utils/StringUtilsTester.java uses unchecked or unsafe operations.
[WARNING] /home/cibuild02/workspace/Netarchivesuite-db-full-migration-test/common/common-test/src/test/java/dk/netarkivet/common/utils/StringUtilsTester.java: Recompile with -Xlint:unchecked for details.
[INFO] 
[INFO] --- maven-surefire-plugin:2.17:test (default-test) @ common-test ---
[INFO] 
[INFO] --- maven-jgit-buildnumber-plugin:1.2.9:extract-buildnumber (git-buildnumber) @ common-test ---
[INFO] 
[INFO] --- maven-jar-plugin:2.4:jar (default-jar) @ common-test ---
[INFO] Building jar: /home/cibuild02/workspace/Netarchivesuite-db-full-migration-test/common/common-test/target/common-test-5.4-SNAPSHOT.jar
[INFO]                                                                         
[INFO] ------------------------------------------------------------------------
[INFO] Building NetarchiveSuite - harvester 5.4-SNAPSHOT
[INFO] ------------------------------------------------------------------------
[INFO] 
[INFO] --- maven-clean-plugin:2.5:clean (default-clean) @ harvester ---
[INFO] 
[INFO] --- maven-jgit-buildnumber-plugin:1.2.9:extract-buildnumber (git-buildnumber) @ harvester ---
[INFO]                                                                         
[INFO] ------------------------------------------------------------------------
[INFO] Building NetarchiveSuite - harvester - heritrix1 5.4-SNAPSHOT
[INFO] ------------------------------------------------------------------------
[INFO] 
[INFO] --- maven-clean-plugin:2.5:clean (default-clean) @ heritrix1 ---
[INFO] 
[INFO] --- maven-jgit-buildnumber-plugin:1.2.9:extract-buildnumber (git-buildnumber) @ heritrix1 ---
[INFO]                                                                         
[INFO] ------------------------------------------------------------------------
[INFO] Building NetarchiveSuite - heritrix1 frontier 5.4-SNAPSHOT
[INFO] ------------------------------------------------------------------------
[INFO] 
[INFO] --- maven-clean-plugin:2.5:clean (default-clean) @ heritrix1-frontier ---
[INFO] Deleting /home/cibuild02/workspace/Netarchivesuite-db-full-migration-test/harvester/heritrix1/heritrix1-frontier/target
[INFO] 
[INFO] --- maven-resources-plugin:2.6:resources (default-resources) @ heritrix1-frontier ---
[INFO] Using 'UTF-8' encoding to copy filtered resources.
[INFO] skip non existing resourceDirectory /home/cibuild02/workspace/Netarchivesuite-db-full-migration-test/harvester/heritrix1/heritrix1-frontier/src/main/resources
[INFO] 
[INFO] --- maven-compiler-plugin:3.1:compile (default-compile) @ heritrix1-frontier ---
[INFO] Changes detected - recompiling the module!
[INFO] Compiling 15 source files to /home/cibuild02/workspace/Netarchivesuite-db-full-migration-test/harvester/heritrix1/heritrix1-frontier/target/classes
[INFO] 
[INFO] --- maven-resources-plugin:2.6:testResources (default-testResources) @ heritrix1-frontier ---
[INFO] Using 'UTF-8' encoding to copy filtered resources.
[INFO] Copying 15 resources
[INFO] 
[INFO] --- maven-compiler-plugin:3.1:testCompile (default-testCompile) @ heritrix1-frontier ---
[INFO] Changes detected - recompiling the module!
[INFO] Compiling 6 source files to /home/cibuild02/workspace/Netarchivesuite-db-full-migration-test/harvester/heritrix1/heritrix1-frontier/target/test-classes
[INFO] 
[INFO] --- maven-surefire-plugin:2.17:test (default-test) @ heritrix1-frontier ---
[INFO] 
[INFO] --- maven-jgit-buildnumber-plugin:1.2.9:extract-buildnumber (git-buildnumber) @ heritrix1-frontier ---
[INFO] 
[INFO] --- maven-jar-plugin:2.4:jar (default-jar) @ heritrix1-frontier ---
[INFO] Building jar: /home/cibuild02/workspace/Netarchivesuite-db-full-migration-test/harvester/heritrix1/heritrix1-frontier/target/heritrix1-frontier-5.4-SNAPSHOT.jar
[INFO]                                                                         
[INFO] ------------------------------------------------------------------------
[INFO] Building NetarchiveSuite - harvester - core 5.4-SNAPSHOT
[INFO] ------------------------------------------------------------------------
[INFO] 
[INFO] --- maven-clean-plugin:2.5:clean (default-clean) @ harvester-core ---
[INFO] Deleting /home/cibuild02/workspace/Netarchivesuite-db-full-migration-test/harvester/harvester-core/target
[INFO] 
[INFO] --- maven-resources-plugin:2.6:resources (default-resources) @ harvester-core ---
[INFO] Using 'UTF-8' encoding to copy filtered resources.
[INFO] Copying 13 resources
[INFO] Copying 3 resources to sql-migration/postgresql/
[INFO] Copying 1 resource to sql-migration/mysql/
[INFO] Copying 2 resources to sql-migration/derby/
[INFO] 
[INFO] --- maven-compiler-plugin:3.1:compile (default-compile) @ harvester-core ---
[INFO] Changes detected - recompiling the module!
[INFO] Compiling 227 source files to /home/cibuild02/workspace/Netarchivesuite-db-full-migration-test/harvester/harvester-core/target/classes
[WARNING] /home/cibuild02/workspace/Netarchivesuite-db-full-migration-test/harvester/harvester-core/src/main/java/dk/netarkivet/harvester/datamodel/H1HeritrixTemplate.java: /home/cibuild02/workspace/Netarchivesuite-db-full-migration-test/harvester/harvester-core/src/main/java/dk/netarkivet/harvester/datamodel/H1HeritrixTemplate.java uses unchecked or unsafe operations.
[WARNING] /home/cibuild02/workspace/Netarchivesuite-db-full-migration-test/harvester/harvester-core/src/main/java/dk/netarkivet/harvester/datamodel/H1HeritrixTemplate.java: Recompile with -Xlint:unchecked for details.
[INFO] 
[INFO] --- maven-resources-plugin:2.6:testResources (default-testResources) @ harvester-core ---
[INFO] Using 'UTF-8' encoding to copy filtered resources.
[INFO] Copying 16 resources
[INFO] 
[INFO] --- maven-compiler-plugin:3.1:testCompile (default-testCompile) @ harvester-core ---
[INFO] Changes detected - recompiling the module!
[INFO] Compiling 12 source files to /home/cibuild02/workspace/Netarchivesuite-db-full-migration-test/harvester/harvester-core/target/test-classes
[INFO] 
[INFO] --- maven-surefire-plugin:2.17:test (default-test) @ harvester-core ---
[INFO] 
[INFO] --- maven-jgit-buildnumber-plugin:1.2.9:extract-buildnumber (git-buildnumber) @ harvester-core ---
[INFO] 
[INFO] --- maven-jar-plugin:2.4:jar (default-jar) @ harvester-core ---
[INFO] Building jar: /home/cibuild02/workspace/Netarchivesuite-db-full-migration-test/harvester/harvester-core/target/harvester-core-5.4-SNAPSHOT.jar
[INFO] 
[INFO] --- maven-jar-plugin:2.4:test-jar (default) @ harvester-core ---
[INFO] Building jar: /home/cibuild02/workspace/Netarchivesuite-db-full-migration-test/harvester/harvester-core/target/harvester-core-5.4-SNAPSHOT-tests.jar
[INFO]                                                                         
[INFO] ------------------------------------------------------------------------
[INFO] Building NetarchiveSuite - archive - test 5.4-SNAPSHOT
[INFO] ------------------------------------------------------------------------
[INFO] 
[INFO] --- maven-clean-plugin:2.5:clean (default-clean) @ archive-test ---
[INFO] Deleting /home/cibuild02/workspace/Netarchivesuite-db-full-migration-test/archive/archive-test/target
[INFO] 
[INFO] --- maven-resources-plugin:2.6:resources (default-resources) @ archive-test ---
[INFO] Using 'UTF-8' encoding to copy filtered resources.
[INFO] skip non existing resourceDirectory /home/cibuild02/workspace/Netarchivesuite-db-full-migration-test/archive/archive-test/src/main/resources
[INFO] 
[INFO] --- maven-compiler-plugin:3.1:compile (default-compile) @ archive-test ---
[INFO] No sources to compile
[INFO] 
[INFO] --- maven-resources-plugin:2.6:testResources (default-testResources) @ archive-test ---
[INFO] Using 'UTF-8' encoding to copy filtered resources.
[INFO] Copying 1 resource
[INFO] Copying 286 resources
[INFO] 
[INFO] --- maven-compiler-plugin:3.1:testCompile (default-testCompile) @ archive-test ---
[INFO] Changes detected - recompiling the module!
[INFO] Compiling 90 source files to /home/cibuild02/workspace/Netarchivesuite-db-full-migration-test/archive/archive-test/target/test-classes
[WARNING] /home/cibuild02/workspace/Netarchivesuite-db-full-migration-test/archive/archive-test/src/test/java/dk/netarkivet/archive/arcrepository/distribute/ArcRepositoryServerTester.java: Some input files use or override a deprecated API.
[WARNING] /home/cibuild02/workspace/Netarchivesuite-db-full-migration-test/archive/archive-test/src/test/java/dk/netarkivet/archive/arcrepository/distribute/ArcRepositoryServerTester.java: Recompile with -Xlint:deprecation for details.
[WARNING] /home/cibuild02/workspace/Netarchivesuite-db-full-migration-test/archive/archive-test/src/test/java/dk/netarkivet/archive/webinterface/BatchGUITester.java: Some input files use unchecked or unsafe operations.
[WARNING] /home/cibuild02/workspace/Netarchivesuite-db-full-migration-test/archive/archive-test/src/test/java/dk/netarkivet/archive/webinterface/BatchGUITester.java: Recompile with -Xlint:unchecked for details.
[INFO] 
[INFO] --- maven-surefire-plugin:2.17:test (default-test) @ archive-test ---
[INFO] 
[INFO] --- maven-jgit-buildnumber-plugin:1.2.9:extract-buildnumber (git-buildnumber) @ archive-test ---
[INFO] 
[INFO] --- maven-jar-plugin:2.4:jar (default-jar) @ archive-test ---
[WARNING] JAR will be empty - no content was marked for inclusion!
[INFO] Building jar: /home/cibuild02/workspace/Netarchivesuite-db-full-migration-test/archive/archive-test/target/archive-test-5.4-SNAPSHOT.jar
[INFO]                                                                         
[INFO] ------------------------------------------------------------------------
[INFO] Building NetarchiveSuite - bitpreservation - webapp 5.4-SNAPSHOT
[INFO] ------------------------------------------------------------------------
[INFO] 
[INFO] --- maven-clean-plugin:2.5:clean (default-clean) @ bitpreservation-gui ---
[INFO] Deleting /home/cibuild02/workspace/Netarchivesuite-db-full-migration-test/archive/bitpreservation-gui/target
[INFO] 
[INFO] --- maven-resources-plugin:2.6:resources (default-resources) @ bitpreservation-gui ---
[INFO] Using 'UTF-8' encoding to copy filtered resources.
[INFO] skip non existing resourceDirectory /home/cibuild02/workspace/Netarchivesuite-db-full-migration-test/archive/bitpreservation-gui/src/main/resources
[INFO] 
[INFO] --- maven-compiler-plugin:3.1:compile (default-compile) @ bitpreservation-gui ---
[INFO] No sources to compile
[INFO] 
[INFO] --- maven-resources-plugin:2.6:testResources (default-testResources) @ bitpreservation-gui ---
[INFO] Using 'UTF-8' encoding to copy filtered resources.
[INFO] skip non existing resourceDirectory /home/cibuild02/workspace/Netarchivesuite-db-full-migration-test/archive/bitpreservation-gui/src/test/resources
[INFO] 
[INFO] --- maven-compiler-plugin:3.1:testCompile (default-testCompile) @ bitpreservation-gui ---
[INFO] No sources to compile
[INFO] 
[INFO] --- maven-surefire-plugin:2.17:test (default-test) @ bitpreservation-gui ---
[INFO] No tests to run.
[INFO] 
[INFO] --- maven-jgit-buildnumber-plugin:1.2.9:extract-buildnumber (git-buildnumber) @ bitpreservation-gui ---
[INFO] 
[INFO] --- maven-war-plugin:2.2:war (default-war) @ bitpreservation-gui ---
[INFO] Packaging webapp
[INFO] Assembling webapp [bitpreservation-gui] in [/home/cibuild02/workspace/Netarchivesuite-db-full-migration-test/archive/bitpreservation-gui/target/BitPreservation]
[INFO] Processing war project
[INFO] Copying webapp resources [/home/cibuild02/workspace/Netarchivesuite-db-full-migration-test/archive/bitpreservation-gui/src/main/webapp]
[INFO] Webapp assembled in [102 msecs]
[INFO] Building war: /home/cibuild02/workspace/Netarchivesuite-db-full-migration-test/archive/bitpreservation-gui/target/BitPreservation.war
[INFO] WEB-INF/web.xml already added, skipping
[INFO]                                                                         
[INFO] ------------------------------------------------------------------------
[INFO] Building NetarchiveSuite - heritrix1 extensions 5.4-SNAPSHOT
[INFO] ------------------------------------------------------------------------
[INFO] 
[INFO] --- maven-clean-plugin:2.5:clean (default-clean) @ heritrix1-extensions ---
[INFO] Deleting /home/cibuild02/workspace/Netarchivesuite-db-full-migration-test/harvester/heritrix1/heritrix1-extensions/target
[INFO] 
[INFO] --- maven-resources-plugin:2.6:resources (default-resources) @ heritrix1-extensions ---
[INFO] Using 'UTF-8' encoding to copy filtered resources.
[INFO] skip non existing resourceDirectory /home/cibuild02/workspace/Netarchivesuite-db-full-migration-test/harvester/heritrix1/heritrix1-extensions/src/main/resources
[INFO] 
[INFO] --- maven-compiler-plugin:3.1:compile (default-compile) @ heritrix1-extensions ---
[INFO] Changes detected - recompiling the module!
[INFO] Compiling 10 source files to /home/cibuild02/workspace/Netarchivesuite-db-full-migration-test/harvester/heritrix1/heritrix1-extensions/target/classes
[WARNING] /home/cibuild02/workspace/Netarchivesuite-db-full-migration-test/harvester/heritrix1/heritrix1-extensions/src/main/java/dk/netarkivet/harvester/tools/TwitterDecidingScope.java: Some input files use unchecked or unsafe operations.
[WARNING] /home/cibuild02/workspace/Netarchivesuite-db-full-migration-test/harvester/heritrix1/heritrix1-extensions/src/main/java/dk/netarkivet/harvester/tools/TwitterDecidingScope.java: Recompile with -Xlint:unchecked for details.
[INFO] 
[INFO] --- maven-resources-plugin:2.6:testResources (default-testResources) @ heritrix1-extensions ---
[INFO] Using 'UTF-8' encoding to copy filtered resources.
[INFO] Copying 4 resources
[INFO] 
[INFO] --- maven-compiler-plugin:3.1:testCompile (default-testCompile) @ heritrix1-extensions ---
[INFO] Changes detected - recompiling the module!
[INFO] Compiling 7 source files to /home/cibuild02/workspace/Netarchivesuite-db-full-migration-test/harvester/heritrix1/heritrix1-extensions/target/test-classes
[INFO] 
[INFO] --- maven-surefire-plugin:2.17:test (default-test) @ heritrix1-extensions ---
[INFO] 
[INFO] --- maven-jgit-buildnumber-plugin:1.2.9:extract-buildnumber (git-buildnumber) @ heritrix1-extensions ---
[INFO] 
[INFO] --- maven-jar-plugin:2.4:jar (default-jar) @ heritrix1-extensions ---
[INFO] Building jar: /home/cibuild02/workspace/Netarchivesuite-db-full-migration-test/harvester/heritrix1/heritrix1-extensions/target/heritrix1-extensions-5.4-SNAPSHOT.jar
[INFO]                                                                         
[INFO] ------------------------------------------------------------------------
[INFO] Building NetarchiveSuite - heritrix1 controller 5.4-SNAPSHOT
[INFO] ------------------------------------------------------------------------
[INFO] 
[INFO] --- maven-clean-plugin:2.5:clean (default-clean) @ heritrix1-controller ---
[INFO] Deleting /home/cibuild02/workspace/Netarchivesuite-db-full-migration-test/harvester/heritrix1/heritrix1-controller/target
[INFO] 
[INFO] --- maven-resources-plugin:2.6:resources (default-resources) @ heritrix1-controller ---
[INFO] Using 'UTF-8' encoding to copy filtered resources.
[INFO] Copying 1 resource
[INFO] 
[INFO] --- maven-compiler-plugin:3.1:compile (default-compile) @ heritrix1-controller ---
[INFO] Changes detected - recompiling the module!
[INFO] Compiling 21 source files to /home/cibuild02/workspace/Netarchivesuite-db-full-migration-test/harvester/heritrix1/heritrix1-controller/target/classes
[INFO] 
[INFO] --- maven-resources-plugin:2.6:testResources (default-testResources) @ heritrix1-controller ---
[INFO] Using 'UTF-8' encoding to copy filtered resources.
[INFO] Copying 104 resources
[INFO] 
[INFO] --- maven-compiler-plugin:3.1:testCompile (default-testCompile) @ heritrix1-controller ---
[INFO] Changes detected - recompiling the module!
[INFO] Compiling 16 source files to /home/cibuild02/workspace/Netarchivesuite-db-full-migration-test/harvester/heritrix1/heritrix1-controller/target/test-classes
[WARNING] /home/cibuild02/workspace/Netarchivesuite-db-full-migration-test/harvester/heritrix1/heritrix1-controller/src/test/java/dk/netarkivet/externalsoftware/HeritrixTests.java: Some input files use unchecked or unsafe operations.
[WARNING] /home/cibuild02/workspace/Netarchivesuite-db-full-migration-test/harvester/heritrix1/heritrix1-controller/src/test/java/dk/netarkivet/externalsoftware/HeritrixTests.java: Recompile with -Xlint:unchecked for details.
[INFO] 
[INFO] --- maven-surefire-plugin:2.17:test (default-test) @ heritrix1-controller ---
[INFO] 
[INFO] --- maven-jgit-buildnumber-plugin:1.2.9:extract-buildnumber (git-buildnumber) @ heritrix1-controller ---
[INFO] 
[INFO] --- maven-jar-plugin:2.4:jar (default-jar) @ heritrix1-controller ---
[INFO] Building jar: /home/cibuild02/workspace/Netarchivesuite-db-full-migration-test/harvester/heritrix1/heritrix1-controller/target/heritrix1-controller-5.4-SNAPSHOT.jar
[INFO]                                                                         
[INFO] ------------------------------------------------------------------------
[INFO] Building NetarchiveSuite - Harvest Scheduler 5.4-SNAPSHOT
[INFO] ------------------------------------------------------------------------
[INFO] 
[INFO] --- maven-clean-plugin:2.5:clean (default-clean) @ harvest-scheduler ---
[INFO] Deleting /home/cibuild02/workspace/Netarchivesuite-db-full-migration-test/harvester/harvest-scheduler/target
[INFO] 
[INFO] --- maven-resources-plugin:2.6:resources (default-resources) @ harvest-scheduler ---
[INFO] Using 'UTF-8' encoding to copy filtered resources.
[INFO] skip non existing resourceDirectory /home/cibuild02/workspace/Netarchivesuite-db-full-migration-test/harvester/harvest-scheduler/src/main/resources
[INFO] 
[INFO] --- maven-compiler-plugin:3.1:compile (default-compile) @ harvest-scheduler ---
[INFO] Changes detected - recompiling the module!
[INFO] Compiling 13 source files to /home/cibuild02/workspace/Netarchivesuite-db-full-migration-test/harvester/harvest-scheduler/target/classes
[INFO] 
[INFO] --- maven-resources-plugin:2.6:testResources (default-testResources) @ harvest-scheduler ---
[INFO] Using 'UTF-8' encoding to copy filtered resources.
[INFO] skip non existing resourceDirectory /home/cibuild02/workspace/Netarchivesuite-db-full-migration-test/harvester/harvest-scheduler/src/test/resources
[INFO] 
[INFO] --- maven-compiler-plugin:3.1:testCompile (default-testCompile) @ harvest-scheduler ---
[INFO] Changes detected - recompiling the module!
[INFO] Compiling 5 source files to /home/cibuild02/workspace/Netarchivesuite-db-full-migration-test/harvester/harvest-scheduler/target/test-classes
[INFO] 
[INFO] --- maven-surefire-plugin:2.17:test (default-test) @ harvest-scheduler ---
[INFO] 
[INFO] --- maven-jgit-buildnumber-plugin:1.2.9:extract-buildnumber (git-buildnumber) @ harvest-scheduler ---
[INFO] 
[INFO] --- maven-jar-plugin:2.4:jar (default-jar) @ harvest-scheduler ---
[INFO] Building jar: /home/cibuild02/workspace/Netarchivesuite-db-full-migration-test/harvester/harvest-scheduler/target/harvest-scheduler-5.4-SNAPSHOT.jar
[INFO]                                                                         
[INFO] ------------------------------------------------------------------------
[INFO] Building NetarchiveSuite - monitor 5.4-SNAPSHOT
[INFO] ------------------------------------------------------------------------
[INFO] 
[INFO] --- maven-clean-plugin:2.5:clean (default-clean) @ monitor ---
[INFO] 
[INFO] --- maven-jgit-buildnumber-plugin:1.2.9:extract-buildnumber (git-buildnumber) @ monitor ---
[INFO]                                                                         
[INFO] ------------------------------------------------------------------------
[INFO] Building NetarchiveSuite - monitor - core 5.4-SNAPSHOT
[INFO] ------------------------------------------------------------------------
[INFO] 
[INFO] --- maven-clean-plugin:2.5:clean (default-clean) @ monitor-core ---
[INFO] Deleting /home/cibuild02/workspace/Netarchivesuite-db-full-migration-test/monitor/monitor-core/target
[INFO] 
[INFO] --- maven-resources-plugin:2.6:resources (default-resources) @ monitor-core ---
[INFO] Using 'UTF-8' encoding to copy filtered resources.
[INFO] Copying 7 resources
[INFO] 
[INFO] --- maven-compiler-plugin:3.1:compile (default-compile) @ monitor-core ---
[INFO] Changes detected - recompiling the module!
[INFO] Compiling 23 source files to /home/cibuild02/workspace/Netarchivesuite-db-full-migration-test/monitor/monitor-core/target/classes
[WARNING] /home/cibuild02/workspace/Netarchivesuite-db-full-migration-test/monitor/monitor-core/src/main/java/dk/netarkivet/monitor/webinterface/JMXSummaryUtils.java: /home/cibuild02/workspace/Netarchivesuite-db-full-migration-test/monitor/monitor-core/src/main/java/dk/netarkivet/monitor/webinterface/JMXSummaryUtils.java uses or overrides a deprecated API.
[WARNING] /home/cibuild02/workspace/Netarchivesuite-db-full-migration-test/monitor/monitor-core/src/main/java/dk/netarkivet/monitor/webinterface/JMXSummaryUtils.java: Recompile with -Xlint:deprecation for details.
[INFO] 
[INFO] --- maven-resources-plugin:2.6:testResources (default-testResources) @ monitor-core ---
[INFO] Using 'UTF-8' encoding to copy filtered resources.
[INFO] Copying 1 resource
[INFO] 
[INFO] --- maven-compiler-plugin:3.1:testCompile (default-testCompile) @ monitor-core ---
[INFO] Changes detected - recompiling the module!
[INFO] Compiling 1 source file to /home/cibuild02/workspace/Netarchivesuite-db-full-migration-test/monitor/monitor-core/target/test-classes
[INFO] 
[INFO] --- maven-surefire-plugin:2.17:test (default-test) @ monitor-core ---
[INFO] 
[INFO] --- maven-jgit-buildnumber-plugin:1.2.9:extract-buildnumber (git-buildnumber) @ monitor-core ---
[INFO] 
[INFO] --- maven-jar-plugin:2.4:jar (default-jar) @ monitor-core ---
[INFO] Building jar: /home/cibuild02/workspace/Netarchivesuite-db-full-migration-test/monitor/monitor-core/target/monitor-core-5.4-SNAPSHOT.jar
[INFO]                                                                         
[INFO] ------------------------------------------------------------------------
[INFO] Building NetarchiveSuite - wayback 5.4-SNAPSHOT
[INFO] ------------------------------------------------------------------------
[INFO] 
[INFO] --- maven-clean-plugin:2.5:clean (default-clean) @ wayback ---
[INFO] 
[INFO] --- maven-jgit-buildnumber-plugin:1.2.9:extract-buildnumber (git-buildnumber) @ wayback ---
[INFO]                                                                         
[INFO] ------------------------------------------------------------------------
[INFO] Building NetarchiveSuite - wayback - indexer 5.4-SNAPSHOT
[INFO] ------------------------------------------------------------------------
[INFO] 
[INFO] --- maven-clean-plugin:2.5:clean (default-clean) @ wayback-indexer ---
[INFO] Deleting /home/cibuild02/workspace/Netarchivesuite-db-full-migration-test/wayback/wayback-indexer/target
[INFO] 
[INFO] --- maven-resources-plugin:2.6:resources (default-resources) @ wayback-indexer ---
[INFO] Using 'UTF-8' encoding to copy filtered resources.
[INFO] Copying 1 resource
[INFO] 
[INFO] --- maven-compiler-plugin:3.1:compile (default-compile) @ wayback-indexer ---
[INFO] Changes detected - recompiling the module!
[INFO] Compiling 21 source files to /home/cibuild02/workspace/Netarchivesuite-db-full-migration-test/wayback/wayback-indexer/target/classes
[INFO] 
[INFO] --- maven-resources-plugin:2.6:testResources (default-testResources) @ wayback-indexer ---
[INFO] Using 'UTF-8' encoding to copy filtered resources.
[INFO] Copying 1 resource
[INFO] 
[INFO] --- maven-compiler-plugin:3.1:testCompile (default-testCompile) @ wayback-indexer ---
[INFO] Changes detected - recompiling the module!
[INFO] Compiling 2 source files to /home/cibuild02/workspace/Netarchivesuite-db-full-migration-test/wayback/wayback-indexer/target/test-classes
[INFO] 
[INFO] --- maven-surefire-plugin:2.17:test (default-test) @ wayback-indexer ---
[INFO] 
[INFO] --- maven-jgit-buildnumber-plugin:1.2.9:extract-buildnumber (git-buildnumber) @ wayback-indexer ---
[INFO] 
[INFO] --- maven-jar-plugin:2.4:jar (default-jar) @ wayback-indexer ---
[INFO] Building jar: /home/cibuild02/workspace/Netarchivesuite-db-full-migration-test/wayback/wayback-indexer/target/wayback-indexer-5.4-SNAPSHOT.jar
[INFO]                                                                         
[INFO] ------------------------------------------------------------------------
[INFO] Building NetarchiveSuite - deploy 5.4-SNAPSHOT
[INFO] ------------------------------------------------------------------------
[INFO] 
[INFO] --- maven-clean-plugin:2.5:clean (default-clean) @ deploy ---
[INFO] 
[INFO] --- maven-jgit-buildnumber-plugin:1.2.9:extract-buildnumber (git-buildnumber) @ deploy ---
[INFO]                                                                         
[INFO] ------------------------------------------------------------------------
[INFO] Building NetarchiveSuite - deploy - core 5.4-SNAPSHOT
[INFO] ------------------------------------------------------------------------
[INFO] 
[INFO] --- maven-clean-plugin:2.5:clean (default-clean) @ deploy-core ---
[INFO] Deleting /home/cibuild02/workspace/Netarchivesuite-db-full-migration-test/deploy/deploy-core/target
[INFO] 
[INFO] --- maven-resources-plugin:2.6:resources (default-resources) @ deploy-core ---
[INFO] Using 'UTF-8' encoding to copy filtered resources.
[INFO] Copying 1 resource
[INFO] 
[INFO] --- maven-compiler-plugin:3.1:compile (default-compile) @ deploy-core ---
[INFO] Changes detected - recompiling the module!
[INFO] Compiling 16 source files to /home/cibuild02/workspace/Netarchivesuite-db-full-migration-test/deploy/deploy-core/target/classes
[INFO] 
[INFO] --- maven-resources-plugin:2.6:testResources (default-testResources) @ deploy-core ---
[INFO] Using 'UTF-8' encoding to copy filtered resources.
[INFO] Copying 8 resources
[INFO] 
[INFO] --- maven-compiler-plugin:3.1:testCompile (default-testCompile) @ deploy-core ---
[INFO] Changes detected - recompiling the module!
[INFO] Compiling 3 source files to /home/cibuild02/workspace/Netarchivesuite-db-full-migration-test/deploy/deploy-core/target/test-classes
[INFO] 
[INFO] --- maven-surefire-plugin:2.17:test (default-test) @ deploy-core ---
[INFO] 
[INFO] --- maven-jgit-buildnumber-plugin:1.2.9:extract-buildnumber (git-buildnumber) @ deploy-core ---
[INFO] 
[INFO] --- maven-jar-plugin:2.4:jar (default-jar) @ deploy-core ---
[INFO] Building jar: /home/cibuild02/workspace/Netarchivesuite-db-full-migration-test/deploy/deploy-core/target/deploy-core-5.4-SNAPSHOT.jar
[INFO]                                                                         
[INFO] ------------------------------------------------------------------------
[INFO] Building NetarchiveSuite - harvester - heritrix3 5.4-SNAPSHOT
[INFO] ------------------------------------------------------------------------
[INFO] 
[INFO] --- maven-clean-plugin:2.5:clean (default-clean) @ heritrix3 ---
[INFO] 
[INFO] --- maven-jgit-buildnumber-plugin:1.2.9:extract-buildnumber (git-buildnumber) @ heritrix3 ---
[INFO]                                                                         
[INFO] ------------------------------------------------------------------------
[INFO] Building Netarchivesuite - Heritrix3 Extensions 5.4-SNAPSHOT
[INFO] ------------------------------------------------------------------------
[INFO] 
[INFO] --- maven-clean-plugin:2.5:clean (default-clean) @ heritrix3-extensions ---
[INFO] Deleting /home/cibuild02/workspace/Netarchivesuite-db-full-migration-test/harvester/heritrix3/heritrix3-extensions/target
[INFO] 
[INFO] --- maven-resources-plugin:2.6:resources (default-resources) @ heritrix3-extensions ---
[INFO] Using 'UTF-8' encoding to copy filtered resources.
[INFO] skip non existing resourceDirectory /home/cibuild02/workspace/Netarchivesuite-db-full-migration-test/harvester/heritrix3/heritrix3-extensions/src/main/resources
[INFO] 
[INFO] --- maven-compiler-plugin:3.1:compile (default-compile) @ heritrix3-extensions ---
[INFO] Changes detected - recompiling the module!
[INFO] Compiling 14 source files to /home/cibuild02/workspace/Netarchivesuite-db-full-migration-test/harvester/heritrix3/heritrix3-extensions/target/classes
[WARNING] /home/cibuild02/workspace/Netarchivesuite-db-full-migration-test/harvester/heritrix3/heritrix3-extensions/src/main/java/org/archive/crawler/framework/ToeThread.java: /home/cibuild02/workspace/Netarchivesuite-db-full-migration-test/harvester/heritrix3/heritrix3-extensions/src/main/java/org/archive/crawler/framework/ToeThread.java uses or overrides a deprecated API.
[WARNING] /home/cibuild02/workspace/Netarchivesuite-db-full-migration-test/harvester/heritrix3/heritrix3-extensions/src/main/java/org/archive/crawler/framework/ToeThread.java: Recompile with -Xlint:deprecation for details.
[INFO] 
[INFO] --- maven-resources-plugin:2.6:testResources (default-testResources) @ heritrix3-extensions ---
[INFO] Using 'UTF-8' encoding to copy filtered resources.
[INFO] skip non existing resourceDirectory /home/cibuild02/workspace/Netarchivesuite-db-full-migration-test/harvester/heritrix3/heritrix3-extensions/src/test/resources
[INFO] 
[INFO] --- maven-compiler-plugin:3.1:testCompile (default-testCompile) @ heritrix3-extensions ---
[INFO] Changes detected - recompiling the module!
[INFO] Compiling 9 source files to /home/cibuild02/workspace/Netarchivesuite-db-full-migration-test/harvester/heritrix3/heritrix3-extensions/target/test-classes
[WARNING] /home/cibuild02/workspace/Netarchivesuite-db-full-migration-test/harvester/heritrix3/heritrix3-extensions/src/test/java/dk/netarkivet/harvester/harvesting/extractor/ExtractorOAITest.java: /home/cibuild02/workspace/Netarchivesuite-db-full-migration-test/harvester/heritrix3/heritrix3-extensions/src/test/java/dk/netarkivet/harvester/harvesting/extractor/ExtractorOAITest.java uses or overrides a deprecated API.
[WARNING] /home/cibuild02/workspace/Netarchivesuite-db-full-migration-test/harvester/heritrix3/heritrix3-extensions/src/test/java/dk/netarkivet/harvester/harvesting/extractor/ExtractorOAITest.java: Recompile with -Xlint:deprecation for details.
[INFO] 
[INFO] --- maven-surefire-plugin:2.17:test (default-test) @ heritrix3-extensions ---
[INFO] 
[INFO] --- maven-jgit-buildnumber-plugin:1.2.9:extract-buildnumber (git-buildnumber) @ heritrix3-extensions ---
[INFO] 
[INFO] --- maven-jar-plugin:2.4:jar (default-jar) @ heritrix3-extensions ---
[INFO] Building jar: /home/cibuild02/workspace/Netarchivesuite-db-full-migration-test/harvester/heritrix3/heritrix3-extensions/target/heritrix3-extensions-5.4-SNAPSHOT.jar
[INFO]                                                                         
[INFO] ------------------------------------------------------------------------
[INFO] Building NetarchiveSuite - heritrix3 controller 5.4-SNAPSHOT
[INFO] ------------------------------------------------------------------------
[INFO] 
[INFO] --- maven-clean-plugin:2.5:clean (default-clean) @ heritrix3-controller ---
[INFO] Deleting /home/cibuild02/workspace/Netarchivesuite-db-full-migration-test/harvester/heritrix3/heritrix3-controller/target
[INFO] 
[INFO] --- maven-resources-plugin:2.6:resources (default-resources) @ heritrix3-controller ---
[INFO] Using 'UTF-8' encoding to copy filtered resources.
[INFO] Copying 1 resource
[INFO] 
[INFO] --- maven-compiler-plugin:3.1:compile (default-compile) @ heritrix3-controller ---
[INFO] Changes detected - recompiling the module!
[INFO] Compiling 22 source files to /home/cibuild02/workspace/Netarchivesuite-db-full-migration-test/harvester/heritrix3/heritrix3-controller/target/classes
[INFO] 
[INFO] --- maven-resources-plugin:2.6:testResources (default-testResources) @ heritrix3-controller ---
[INFO] Using 'UTF-8' encoding to copy filtered resources.
[INFO] Copying 3 resources
[INFO] 
[INFO] --- maven-compiler-plugin:3.1:testCompile (default-testCompile) @ heritrix3-controller ---
[INFO] Changes detected - recompiling the module!
[INFO] Compiling 3 source files to /home/cibuild02/workspace/Netarchivesuite-db-full-migration-test/harvester/heritrix3/heritrix3-controller/target/test-classes
[INFO] 
[INFO] --- maven-surefire-plugin:2.17:test (default-test) @ heritrix3-controller ---
[INFO] 
[INFO] --- maven-jgit-buildnumber-plugin:1.2.9:extract-buildnumber (git-buildnumber) @ heritrix3-controller ---
[INFO] 
[INFO] --- maven-jar-plugin:2.4:jar (default-jar) @ heritrix3-controller ---
[INFO] Building jar: /home/cibuild02/workspace/Netarchivesuite-db-full-migration-test/harvester/heritrix3/heritrix3-controller/target/heritrix3-controller-5.4-SNAPSHOT.jar
[INFO]                                                                         
[INFO] ------------------------------------------------------------------------
[INFO] Building NetarchiveSuite - Status - Webapp 5.4-SNAPSHOT
[INFO] ------------------------------------------------------------------------
[INFO] 
[INFO] --- maven-clean-plugin:2.5:clean (default-clean) @ status-gui ---
[INFO] Deleting /home/cibuild02/workspace/Netarchivesuite-db-full-migration-test/monitor/status-gui/target
[INFO] 
[INFO] --- maven-resources-plugin:2.6:resources (default-resources) @ status-gui ---
[INFO] Using 'UTF-8' encoding to copy filtered resources.
[INFO] skip non existing resourceDirectory /home/cibuild02/workspace/Netarchivesuite-db-full-migration-test/monitor/status-gui/src/main/resources
[INFO] 
[INFO] --- maven-compiler-plugin:3.1:compile (default-compile) @ status-gui ---
[INFO] No sources to compile
[INFO] 
[INFO] --- maven-resources-plugin:2.6:testResources (default-testResources) @ status-gui ---
[INFO] Using 'UTF-8' encoding to copy filtered resources.
[INFO] skip non existing resourceDirectory /home/cibuild02/workspace/Netarchivesuite-db-full-migration-test/monitor/status-gui/src/test/resources
[INFO] 
[INFO] --- maven-compiler-plugin:3.1:testCompile (default-testCompile) @ status-gui ---
[INFO] No sources to compile
[INFO] 
[INFO] --- maven-surefire-plugin:2.17:test (default-test) @ status-gui ---
[INFO] No tests to run.
[INFO] 
[INFO] --- maven-jgit-buildnumber-plugin:1.2.9:extract-buildnumber (git-buildnumber) @ status-gui ---
[INFO] 
[INFO] --- maven-war-plugin:2.2:war (default-war) @ status-gui ---
[INFO] Packaging webapp
[INFO] Assembling webapp [status-gui] in [/home/cibuild02/workspace/Netarchivesuite-db-full-migration-test/monitor/status-gui/target/Status]
[INFO] Processing war project
[INFO] Copying webapp resources [/home/cibuild02/workspace/Netarchivesuite-db-full-migration-test/monitor/status-gui/src/main/webapp]
[INFO] Webapp assembled in [70 msecs]
[INFO] Building war: /home/cibuild02/workspace/Netarchivesuite-db-full-migration-test/monitor/status-gui/target/Status.war
[INFO] WEB-INF/web.xml already added, skipping
[INFO]                                                                         
[INFO] ------------------------------------------------------------------------
[INFO] Building NetarchiveSuite - qa - webapp 5.4-SNAPSHOT
[INFO] ------------------------------------------------------------------------
[INFO] 
[INFO] --- maven-clean-plugin:2.5:clean (default-clean) @ qa-gui ---
[INFO] Deleting /home/cibuild02/workspace/Netarchivesuite-db-full-migration-test/harvester/qa-gui/target
[INFO] 
[INFO] --- maven-resources-plugin:2.6:resources (default-resources) @ qa-gui ---
[INFO] Using 'UTF-8' encoding to copy filtered resources.
[INFO] skip non existing resourceDirectory /home/cibuild02/workspace/Netarchivesuite-db-full-migration-test/harvester/qa-gui/src/main/resources
[INFO] 
[INFO] --- maven-compiler-plugin:3.1:compile (default-compile) @ qa-gui ---
[INFO] No sources to compile
[INFO] 
[INFO] --- maven-resources-plugin:2.6:testResources (default-testResources) @ qa-gui ---
[INFO] Using 'UTF-8' encoding to copy filtered resources.
[INFO] skip non existing resourceDirectory /home/cibuild02/workspace/Netarchivesuite-db-full-migration-test/harvester/qa-gui/src/test/resources
[INFO] 
[INFO] --- maven-compiler-plugin:3.1:testCompile (default-testCompile) @ qa-gui ---
[INFO] No sources to compile
[INFO] 
[INFO] --- maven-surefire-plugin:2.17:test (default-test) @ qa-gui ---
[INFO] No tests to run.
[INFO] 
[INFO] --- maven-jgit-buildnumber-plugin:1.2.9:extract-buildnumber (git-buildnumber) @ qa-gui ---
[INFO] 
[INFO] --- maven-war-plugin:2.2:war (default-war) @ qa-gui ---
[INFO] Packaging webapp
[INFO] Assembling webapp [qa-gui] in [/home/cibuild02/workspace/Netarchivesuite-db-full-migration-test/harvester/qa-gui/target/QA]
[INFO] Processing war project
[INFO] Copying webapp resources [/home/cibuild02/workspace/Netarchivesuite-db-full-migration-test/harvester/qa-gui/src/main/webapp]
[INFO] Webapp assembled in [44 msecs]
[INFO] Building war: /home/cibuild02/workspace/Netarchivesuite-db-full-migration-test/harvester/qa-gui/target/QA.war
[INFO] WEB-INF/web.xml already added, skipping
[INFO]                                                                         
[INFO] ------------------------------------------------------------------------
[INFO] Building NetarchiveSuite - history - webapp 5.4-SNAPSHOT
[INFO] ------------------------------------------------------------------------
[INFO] 
[INFO] --- maven-clean-plugin:2.5:clean (default-clean) @ history-gui ---
[INFO] Deleting /home/cibuild02/workspace/Netarchivesuite-db-full-migration-test/harvester/history-gui/target
[INFO] 
[INFO] --- maven-resources-plugin:2.6:resources (default-resources) @ history-gui ---
[INFO] Using 'UTF-8' encoding to copy filtered resources.
[INFO] skip non existing resourceDirectory /home/cibuild02/workspace/Netarchivesuite-db-full-migration-test/harvester/history-gui/src/main/resources
[INFO] 
[INFO] --- maven-compiler-plugin:3.1:compile (default-compile) @ history-gui ---
[INFO] No sources to compile
[INFO] 
[INFO] --- maven-resources-plugin:2.6:testResources (default-testResources) @ history-gui ---
[INFO] Using 'UTF-8' encoding to copy filtered resources.
[INFO] skip non existing resourceDirectory /home/cibuild02/workspace/Netarchivesuite-db-full-migration-test/harvester/history-gui/src/test/resources
[INFO] 
[INFO] --- maven-compiler-plugin:3.1:testCompile (default-testCompile) @ history-gui ---
[INFO] No sources to compile
[INFO] 
[INFO] --- maven-surefire-plugin:2.17:test (default-test) @ history-gui ---
[INFO] No tests to run.
[INFO] 
[INFO] --- maven-jgit-buildnumber-plugin:1.2.9:extract-buildnumber (git-buildnumber) @ history-gui ---
[INFO] 
[INFO] --- maven-war-plugin:2.2:war (default-war) @ history-gui ---
[INFO] Packaging webapp
[INFO] Assembling webapp [history-gui] in [/home/cibuild02/workspace/Netarchivesuite-db-full-migration-test/harvester/history-gui/target/History]
[INFO] Processing war project
[INFO] Copying webapp resources [/home/cibuild02/workspace/Netarchivesuite-db-full-migration-test/harvester/history-gui/src/main/webapp]
[INFO] Webapp assembled in [399 msecs]
[INFO] Building war: /home/cibuild02/workspace/Netarchivesuite-db-full-migration-test/harvester/history-gui/target/History.war
[INFO] WEB-INF/web.xml already added, skipping
[INFO]                                                                         
[INFO] ------------------------------------------------------------------------
[INFO] Building NetarchiveSuite - harvestDefinition - webapp 5.4-SNAPSHOT
[INFO] ------------------------------------------------------------------------
[INFO] 
[INFO] --- maven-clean-plugin:2.5:clean (default-clean) @ harvestdefinition-gui ---
[INFO] Deleting /home/cibuild02/workspace/Netarchivesuite-db-full-migration-test/harvester/harvestdefinition-gui/target
[INFO] 
[INFO] --- maven-resources-plugin:2.6:resources (default-resources) @ harvestdefinition-gui ---
[INFO] Using 'UTF-8' encoding to copy filtered resources.
[INFO] skip non existing resourceDirectory /home/cibuild02/workspace/Netarchivesuite-db-full-migration-test/harvester/harvestdefinition-gui/src/main/resources
[INFO] 
[INFO] --- maven-compiler-plugin:3.1:compile (default-compile) @ harvestdefinition-gui ---
[INFO] No sources to compile
[INFO] 
[INFO] --- maven-resources-plugin:2.6:testResources (default-testResources) @ harvestdefinition-gui ---
[INFO] Using 'UTF-8' encoding to copy filtered resources.
[INFO] skip non existing resourceDirectory /home/cibuild02/workspace/Netarchivesuite-db-full-migration-test/harvester/harvestdefinition-gui/src/test/resources
[INFO] 
[INFO] --- maven-compiler-plugin:3.1:testCompile (default-testCompile) @ harvestdefinition-gui ---
[INFO] No sources to compile
[INFO] 
[INFO] --- maven-surefire-plugin:2.17:test (default-test) @ harvestdefinition-gui ---
[INFO] No tests to run.
[INFO] 
[INFO] --- maven-jgit-buildnumber-plugin:1.2.9:extract-buildnumber (git-buildnumber) @ harvestdefinition-gui ---
[INFO] 
[INFO] --- maven-war-plugin:2.2:war (default-war) @ harvestdefinition-gui ---
[INFO] Packaging webapp
[INFO] Assembling webapp [harvestdefinition-gui] in [/home/cibuild02/workspace/Netarchivesuite-db-full-migration-test/harvester/harvestdefinition-gui/target/HarvestDefinition]
[INFO] Processing war project
[INFO] Copying webapp resources [/home/cibuild02/workspace/Netarchivesuite-db-full-migration-test/harvester/harvestdefinition-gui/src/main/webapp]
[INFO] Webapp assembled in [327 msecs]
[INFO] Building war: /home/cibuild02/workspace/Netarchivesuite-db-full-migration-test/harvester/harvestdefinition-gui/target/HarvestDefinition.war
[INFO] WEB-INF/web.xml already added, skipping
[INFO]                                                                         
[INFO] ------------------------------------------------------------------------
[INFO] Building NetarchiveSuite - harvestChannel - webapp 5.4-SNAPSHOT
[INFO] ------------------------------------------------------------------------
[INFO] 
[INFO] --- maven-clean-plugin:2.5:clean (default-clean) @ harvestchannel-gui ---
[INFO] Deleting /home/cibuild02/workspace/Netarchivesuite-db-full-migration-test/harvester/harvestchannel-gui/target
[INFO] 
[INFO] --- maven-resources-plugin:2.6:resources (default-resources) @ harvestchannel-gui ---
[INFO] Using 'UTF-8' encoding to copy filtered resources.
[INFO] skip non existing resourceDirectory /home/cibuild02/workspace/Netarchivesuite-db-full-migration-test/harvester/harvestchannel-gui/src/main/resources
[INFO] 
[INFO] --- maven-compiler-plugin:3.1:compile (default-compile) @ harvestchannel-gui ---
[INFO] No sources to compile
[INFO] 
[INFO] --- maven-resources-plugin:2.6:testResources (default-testResources) @ harvestchannel-gui ---
[INFO] Using 'UTF-8' encoding to copy filtered resources.
[INFO] skip non existing resourceDirectory /home/cibuild02/workspace/Netarchivesuite-db-full-migration-test/harvester/harvestchannel-gui/src/test/resources
[INFO] 
[INFO] --- maven-compiler-plugin:3.1:testCompile (default-testCompile) @ harvestchannel-gui ---
[INFO] No sources to compile
[INFO] 
[INFO] --- maven-surefire-plugin:2.17:test (default-test) @ harvestchannel-gui ---
[INFO] No tests to run.
[INFO] 
[INFO] --- maven-jgit-buildnumber-plugin:1.2.9:extract-buildnumber (git-buildnumber) @ harvestchannel-gui ---
[INFO] 
[INFO] --- maven-war-plugin:2.2:war (default-war) @ harvestchannel-gui ---
[INFO] Packaging webapp
[INFO] Assembling webapp [harvestchannel-gui] in [/home/cibuild02/workspace/Netarchivesuite-db-full-migration-test/harvester/harvestchannel-gui/target/HarvestChannel]
[INFO] Processing war project
[INFO] Copying webapp resources [/home/cibuild02/workspace/Netarchivesuite-db-full-migration-test/harvester/harvestchannel-gui/src/main/webapp]
[INFO] Webapp assembled in [37 msecs]
[INFO] Building war: /home/cibuild02/workspace/Netarchivesuite-db-full-migration-test/harvester/harvestchannel-gui/target/HarvestChannel.war
[INFO] WEB-INF/web.xml already added, skipping
[INFO]                                                                         
[INFO] ------------------------------------------------------------------------
[INFO] Building NetarchiveSuite - deploy - distribution 5.4-SNAPSHOT
[INFO] ------------------------------------------------------------------------
[INFO] 
[INFO] --- maven-clean-plugin:2.5:clean (default-clean) @ distribution ---
[INFO] Deleting /home/cibuild02/workspace/Netarchivesuite-db-full-migration-test/deploy/distribution/target
[INFO] 
[INFO] --- maven-jgit-buildnumber-plugin:1.2.9:extract-buildnumber (git-buildnumber) @ distribution ---
[INFO] 
[INFO] --- maven-assembly-plugin:2.4.1:single (distro-assembly) @ distribution ---
[INFO] Reading assembly descriptor: src/main/assembly/distribution.xml
[INFO] Building zip: /home/cibuild02/workspace/Netarchivesuite-db-full-migration-test/deploy/distribution/target/NetarchiveSuite-5.4-SNAPSHOT.zip
[INFO]                                                                         
[INFO] ------------------------------------------------------------------------
[INFO] Building NetarchiveSuite - deploy - test 5.4-SNAPSHOT
[INFO] ------------------------------------------------------------------------
[INFO] 
[INFO] --- maven-clean-plugin:2.5:clean (default-clean) @ deploy-test ---
[INFO] Deleting /home/cibuild02/workspace/Netarchivesuite-db-full-migration-test/deploy/deploy-test/target
[INFO] 
[INFO] --- maven-resources-plugin:2.6:resources (default-resources) @ deploy-test ---
[INFO] Using 'UTF-8' encoding to copy filtered resources.
[INFO] skip non existing resourceDirectory /home/cibuild02/workspace/Netarchivesuite-db-full-migration-test/deploy/deploy-test/src/main/resources
[INFO] 
[INFO] --- maven-compiler-plugin:3.1:compile (default-compile) @ deploy-test ---
[INFO] No sources to compile
[INFO] 
[INFO] --- maven-resources-plugin:2.6:testResources (default-testResources) @ deploy-test ---
[INFO] Using 'UTF-8' encoding to copy filtered resources.
[INFO] Copying 2 resources
[INFO] Copying 502 resources
[INFO] 
[INFO] --- maven-compiler-plugin:3.1:testCompile (default-testCompile) @ deploy-test ---
[INFO] Changes detected - recompiling the module!
[INFO] Compiling 11 source files to /home/cibuild02/workspace/Netarchivesuite-db-full-migration-test/deploy/deploy-test/target/test-classes
[INFO] 
[INFO] --- maven-surefire-plugin:2.17:test (default-test) @ deploy-test ---
[INFO] 
[INFO] --- maven-jgit-buildnumber-plugin:1.2.9:extract-buildnumber (git-buildnumber) @ deploy-test ---
[INFO] 
[INFO] --- maven-jar-plugin:2.4:jar (default-jar) @ deploy-test ---
[WARNING] JAR will be empty - no content was marked for inclusion!
[INFO] Building jar: /home/cibuild02/workspace/Netarchivesuite-db-full-migration-test/deploy/deploy-test/target/deploy-test-5.4-SNAPSHOT.jar
[INFO]                                                                         
[INFO] ------------------------------------------------------------------------
[INFO] Building Netarchivesuite - Heritrix3 Bundler 5.4-SNAPSHOT
[INFO] ------------------------------------------------------------------------
[INFO] 
[INFO] --- maven-clean-plugin:2.5:clean (default-clean) @ heritrix3-bundler ---
[INFO] Deleting /home/cibuild02/workspace/Netarchivesuite-db-full-migration-test/harvester/heritrix3/heritrix3-bundler/target
[INFO] 
[INFO] --- maven-jgit-buildnumber-plugin:1.2.9:extract-buildnumber (git-buildnumber) @ heritrix3-bundler ---
[INFO] 
[INFO] --- maven-assembly-plugin:2.4.1:single (distro-assembly) @ heritrix3-bundler ---
[INFO] Reading assembly descriptor: src/main/assembly/distribution.xml
[WARNING] The following patterns were never triggered in this artifact exclusion filter:
o  'org.eclipse.jetty:*:jar'
o  'org.eclipse.jetty.websocket:*:jar'
o  'org.eclipse.jetty.orbit:*:jar'
o  'org.glassfish:*:jar'
o  'org.glassfish.web:*:jar'
o  'javax.servlet:*:jar'
o  'org.ow2.asm:*:jar'
o  'org.apache.httpcomponents:httpclient:jar:4.2.5'
o  'org.apache.httpcomponents:httpcore:jar:4.2.4'

[INFO] Building zip: /home/cibuild02/workspace/Netarchivesuite-db-full-migration-test/harvester/heritrix3/heritrix3-bundler/target/NetarchiveSuite-heritrix3-bundler-5.4-SNAPSHOT.zip
[INFO]                                                                         
[INFO] ------------------------------------------------------------------------
[INFO] Building NetarchiveSuite - harvester - test 5.4-SNAPSHOT
[INFO] ------------------------------------------------------------------------
[INFO] 
[INFO] --- maven-clean-plugin:2.5:clean (default-clean) @ harvester-test ---
[INFO] Deleting /home/cibuild02/workspace/Netarchivesuite-db-full-migration-test/harvester/harvester-test/target
[INFO] 
[INFO] --- maven-resources-plugin:2.6:resources (default-resources) @ harvester-test ---
[INFO] Using 'UTF-8' encoding to copy filtered resources.
[INFO] skip non existing resourceDirectory /home/cibuild02/workspace/Netarchivesuite-db-full-migration-test/harvester/harvester-test/src/main/resources
[INFO] 
[INFO] --- maven-compiler-plugin:3.1:compile (default-compile) @ harvester-test ---
[INFO] No sources to compile
[INFO] 
[INFO] --- maven-resources-plugin:2.6:testResources (default-testResources) @ harvester-test ---
[INFO] Using 'UTF-8' encoding to copy filtered resources.
[INFO] Copying 13 resources
[INFO] Copying 441 resources
[INFO] 
[INFO] --- maven-compiler-plugin:3.1:testCompile (default-testCompile) @ harvester-test ---
[INFO] Changes detected - recompiling the module!
[INFO] Compiling 124 source files to /home/cibuild02/workspace/Netarchivesuite-db-full-migration-test/harvester/harvester-test/target/test-classes
[WARNING] /home/cibuild02/workspace/Netarchivesuite-db-full-migration-test/harvester/harvester-test/src/test/java/dk/netarkivet/viewerproxy/ARCArchiveAccessTester.java: Some input files use or override a deprecated API.
[WARNING] /home/cibuild02/workspace/Netarchivesuite-db-full-migration-test/harvester/harvester-test/src/test/java/dk/netarkivet/viewerproxy/ARCArchiveAccessTester.java: Recompile with -Xlint:deprecation for details.
[WARNING] /home/cibuild02/workspace/Netarchivesuite-db-full-migration-test/harvester/harvester-test/src/test/java/dk/netarkivet/harvester/indexserver/CombiningMultiFileBasedCacheTester.java: /home/cibuild02/workspace/Netarchivesuite-db-full-migration-test/harvester/harvester-test/src/test/java/dk/netarkivet/harvester/indexserver/CombiningMultiFileBasedCacheTester.java uses unchecked or unsafe operations.
[WARNING] /home/cibuild02/workspace/Netarchivesuite-db-full-migration-test/harvester/harvester-test/src/test/java/dk/netarkivet/harvester/indexserver/CombiningMultiFileBasedCacheTester.java: Recompile with -Xlint:unchecked for details.
[INFO] 
[INFO] --- maven-surefire-plugin:2.17:test (default-test) @ harvester-test ---
[INFO] 
[INFO] --- maven-jgit-buildnumber-plugin:1.2.9:extract-buildnumber (git-buildnumber) @ harvester-test ---
[INFO] 
[INFO] --- maven-jar-plugin:2.4:jar (default-jar) @ harvester-test ---
[WARNING] JAR will be empty - no content was marked for inclusion!
[INFO] Building jar: /home/cibuild02/workspace/Netarchivesuite-db-full-migration-test/harvester/harvester-test/target/harvester-test-5.4-SNAPSHOT.jar
[INFO]                                                                         
[INFO] ------------------------------------------------------------------------
[INFO] Building NetarchiveSuite - monitor - test 5.4-SNAPSHOT
[INFO] ------------------------------------------------------------------------
[INFO] 
[INFO] --- maven-clean-plugin:2.5:clean (default-clean) @ monitor-test ---
[INFO] Deleting /home/cibuild02/workspace/Netarchivesuite-db-full-migration-test/monitor/monitor-test/target
[INFO] 
[INFO] --- maven-resources-plugin:2.6:resources (default-resources) @ monitor-test ---
[INFO] Using 'UTF-8' encoding to copy filtered resources.
[INFO] skip non existing resourceDirectory /home/cibuild02/workspace/Netarchivesuite-db-full-migration-test/monitor/monitor-test/src/main/resources
[INFO] 
[INFO] --- maven-compiler-plugin:3.1:compile (default-compile) @ monitor-test ---
[INFO] No sources to compile
[INFO] 
[INFO] --- maven-resources-plugin:2.6:testResources (default-testResources) @ monitor-test ---
[INFO] Using 'UTF-8' encoding to copy filtered resources.
[INFO] Copying 1 resource
[INFO] Copying 8 resources
[INFO] 
[INFO] --- maven-compiler-plugin:3.1:testCompile (default-testCompile) @ monitor-test ---
[INFO] Changes detected - recompiling the module!
[INFO] Compiling 9 source files to /home/cibuild02/workspace/Netarchivesuite-db-full-migration-test/monitor/monitor-test/target/test-classes
[WARNING] /home/cibuild02/workspace/Netarchivesuite-db-full-migration-test/monitor/monitor-test/src/test/java/dk/netarkivet/monitor/jmx/JMXUtilsTester.java:[29,33] com.sun.jndi.rmi.registry.RegistryContextFactory is internal proprietary API and may be removed in a future release
[WARNING] /home/cibuild02/workspace/Netarchivesuite-db-full-migration-test/monitor/monitor-test/src/test/java/dk/netarkivet/monitor/jmx/JMXUtilsTester.java:[70,63] com.sun.jndi.rmi.registry.RegistryContextFactory is internal proprietary API and may be removed in a future release
[WARNING] /home/cibuild02/workspace/Netarchivesuite-db-full-migration-test/monitor/monitor-test/src/test/java/dk/netarkivet/monitor/jmx/JMXUtilsTester.java:[72,23] com.sun.jndi.rmi.registry.RegistryContextFactory is internal proprietary API and may be removed in a future release
[INFO] 
[INFO] --- maven-surefire-plugin:2.17:test (default-test) @ monitor-test ---
[INFO] 
[INFO] --- maven-jgit-buildnumber-plugin:1.2.9:extract-buildnumber (git-buildnumber) @ monitor-test ---
[INFO] 
[INFO] --- maven-jar-plugin:2.4:jar (default-jar) @ monitor-test ---
[WARNING] JAR will be empty - no content was marked for inclusion!
[INFO] Building jar: /home/cibuild02/workspace/Netarchivesuite-db-full-migration-test/monitor/monitor-test/target/monitor-test-5.4-SNAPSHOT.jar
[INFO]                                                                         
[INFO] ------------------------------------------------------------------------
[INFO] Building NetarchiveSuite - wayback resourceStore 5.4-SNAPSHOT
[INFO] ------------------------------------------------------------------------
[INFO] 
[INFO] --- maven-clean-plugin:2.5:clean (default-clean) @ wayback-resourcestore ---
[INFO] Deleting /home/cibuild02/workspace/Netarchivesuite-db-full-migration-test/wayback/wayback-resourcestore/target
[INFO] 
[INFO] --- maven-resources-plugin:2.6:resources (default-resources) @ wayback-resourcestore ---
[INFO] Using 'UTF-8' encoding to copy filtered resources.
[INFO] skip non existing resourceDirectory /home/cibuild02/workspace/Netarchivesuite-db-full-migration-test/wayback/wayback-resourcestore/src/main/resources
[INFO] 
[INFO] --- maven-compiler-plugin:3.1:compile (default-compile) @ wayback-resourcestore ---
[INFO] Changes detected - recompiling the module!
[INFO] Compiling 7 source files to /home/cibuild02/workspace/Netarchivesuite-db-full-migration-test/wayback/wayback-resourcestore/target/classes
[INFO] 
[INFO] --- maven-resources-plugin:2.6:testResources (default-testResources) @ wayback-resourcestore ---
[INFO] Using 'UTF-8' encoding to copy filtered resources.
[INFO] skip non existing resourceDirectory /home/cibuild02/workspace/Netarchivesuite-db-full-migration-test/wayback/wayback-resourcestore/src/test/resources
[INFO] 
[INFO] --- maven-compiler-plugin:3.1:testCompile (default-testCompile) @ wayback-resourcestore ---
[INFO] Changes detected - recompiling the module!
[INFO] Compiling 4 source files to /home/cibuild02/workspace/Netarchivesuite-db-full-migration-test/wayback/wayback-resourcestore/target/test-classes
[INFO] 
[INFO] --- maven-surefire-plugin:2.17:test (default-test) @ wayback-resourcestore ---
[INFO] 
[INFO] --- maven-jgit-buildnumber-plugin:1.2.9:extract-buildnumber (git-buildnumber) @ wayback-resourcestore ---
[INFO] 
[INFO] --- maven-jar-plugin:2.4:jar (default-jar) @ wayback-resourcestore ---
[INFO] Building jar: /home/cibuild02/workspace/Netarchivesuite-db-full-migration-test/wayback/wayback-resourcestore/target/wayback-resourcestore-5.4-SNAPSHOT.jar
[INFO]                                                                         
[INFO] ------------------------------------------------------------------------
[INFO] Building NetarchiveSuite - wayback - test 5.4-SNAPSHOT
[INFO] ------------------------------------------------------------------------
[INFO] 
[INFO] --- maven-clean-plugin:2.5:clean (default-clean) @ wayback-test ---
[INFO] Deleting /home/cibuild02/workspace/Netarchivesuite-db-full-migration-test/wayback/wayback-test/target
[INFO] 
[INFO] --- maven-resources-plugin:2.6:resources (default-resources) @ wayback-test ---
[INFO] Using 'UTF-8' encoding to copy filtered resources.
[INFO] skip non existing resourceDirectory /home/cibuild02/workspace/Netarchivesuite-db-full-migration-test/wayback/wayback-test/src/main/resources
[INFO] 
[INFO] --- maven-compiler-plugin:3.1:compile (default-compile) @ wayback-test ---
[INFO] No sources to compile
[INFO] 
[INFO] --- maven-resources-plugin:2.6:testResources (default-testResources) @ wayback-test ---
[INFO] Using 'UTF-8' encoding to copy filtered resources.
[INFO] Copying 1 resource
[INFO] Copying 28 resources
[INFO] 
[INFO] --- maven-compiler-plugin:3.1:testCompile (default-testCompile) @ wayback-test ---
[INFO] Changes detected - recompiling the module!
[INFO] Compiling 15 source files to /home/cibuild02/workspace/Netarchivesuite-db-full-migration-test/wayback/wayback-test/target/test-classes
[INFO] 
[INFO] --- maven-surefire-plugin:2.17:test (default-test) @ wayback-test ---
[INFO] 
[INFO] --- maven-jgit-buildnumber-plugin:1.2.9:extract-buildnumber (git-buildnumber) @ wayback-test ---
[INFO] 
[INFO] --- maven-jar-plugin:2.4:jar (default-jar) @ wayback-test ---
[WARNING] JAR will be empty - no content was marked for inclusion!
[INFO] Building jar: /home/cibuild02/workspace/Netarchivesuite-db-full-migration-test/wayback/wayback-test/target/wayback-test-5.4-SNAPSHOT.jar
[INFO]                                                                         
[INFO] ------------------------------------------------------------------------
[INFO] Building NetarchiveSuite - integration tests 5.4-SNAPSHOT
[INFO] ------------------------------------------------------------------------
[INFO] 
[INFO] --- maven-clean-plugin:2.5:clean (default-clean) @ integration-test ---
[INFO] 
[INFO] --- maven-jgit-buildnumber-plugin:1.2.9:extract-buildnumber (git-buildnumber) @ integration-test ---
[INFO]                                                                         
[INFO] ------------------------------------------------------------------------
[INFO] Building NetarchiveSuite System test 5.4-SNAPSHOT
[INFO] ------------------------------------------------------------------------
[INFO] 
[INFO] --- maven-clean-plugin:2.5:clean (default-clean) @ system-test ---
[INFO] Deleting /home/cibuild02/workspace/Netarchivesuite-db-full-migration-test/integration-test/system-test/target
[INFO] 
[INFO] --- maven-resources-plugin:2.6:resources (default-resources) @ system-test ---
[INFO] Using 'UTF-8' encoding to copy filtered resources.
[INFO] skip non existing resourceDirectory /home/cibuild02/workspace/Netarchivesuite-db-full-migration-test/integration-test/system-test/src/main/resources
[INFO] 
[INFO] --- maven-compiler-plugin:3.1:compile (default-compile) @ system-test ---
[INFO] No sources to compile
[INFO] 
[INFO] --- maven-resources-plugin:2.6:testResources (default-testResources) @ system-test ---
[INFO] Using 'UTF-8' encoding to copy filtered resources.
[INFO] Copying 4 resources
[INFO] 
[INFO] --- maven-compiler-plugin:3.1:testCompile (default-testCompile) @ system-test ---
[INFO] Changes detected - recompiling the module!
[INFO] Compiling 33 source files to /home/cibuild02/workspace/Netarchivesuite-db-full-migration-test/integration-test/system-test/target/test-classes
[INFO] 
[INFO] --- maven-surefire-plugin:2.17:test (default-test) @ system-test ---
[INFO] Tests are skipped.
[INFO] 
[INFO] --- maven-jgit-buildnumber-plugin:1.2.9:extract-buildnumber (git-buildnumber) @ system-test ---
[INFO] 
[INFO] --- maven-jar-plugin:2.4:jar (default-jar) @ system-test ---
[WARNING] JAR will be empty - no content was marked for inclusion!
[INFO] Building jar: /home/cibuild02/workspace/Netarchivesuite-db-full-migration-test/integration-test/system-test/target/system-test-5.4-SNAPSHOT.jar
[INFO] 
[INFO] --- maven-dependency-plugin:2.8:copy (copy-distribution-zip) @ system-test ---
[INFO] Configured Artifact: org.netarchivesuite:distribution:5.4-SNAPSHOT:zip
[INFO] Copying NetarchiveSuite-5.4-SNAPSHOT.zip to /home/cibuild02/workspace/Netarchivesuite-db-full-migration-test/integration-test/system-test/target/NetarchiveSuite-SystemTest.zip
[INFO] 
[INFO] --- maven-antrun-plugin:1.8:run (default) @ system-test ---
[INFO] Executing tasks

main:

deploy2test:
      [scp] Connecting to kb-prod-udv-001.kb.dk:22
      [scp] done.
[INFO] Executed tasks
[INFO] 
[INFO] --- maven-surefire-plugin:2.17:test (surefire-it) @ system-test ---
[INFO] Surefire report directory: /home/cibuild02/workspace/Netarchivesuite-db-full-migration-test/integration-test/system-test/target/surefire-reports

-------------------------------------------------------
 T E S T S
-------------------------------------------------------
Running dk.netarkivet.systemtest.performance.DatabaseFullMigrationTest
Configuring TestNG with: TestNG652Configurator
[main] INFO org.jaccept.TestEventManager - Loading properties from file:/home/cibuild02/workspace/Netarchivesuite-db-full-migration-test/integration-test/system-test/target/test-classes/jaccept.properties
[main] INFO org.jaccept.TestEventManager - Adding clients: org.jaccept.StdOutLogger
[main] INFO org.jaccept.TestEventManager - Adding JAccept client org.jaccept.StdOutLogger
Starting test project NetarchiveSuite System test
  Suite: Surefire suite
    Starting testcase DatabaseFullMigrationTest
        Added fixture: Cleaning up old test.
[main] INFO dk.netarkivet.systemtest.environment.TestEnvironmentController - Running JSch command (on null): RemoteCommand 
	source /etc/bashrc;source /etc/profile;source ~/.bash_profile;export VERSION=SystemTest;export PORT=8073;export MAILRECEIVERS=csr@statsbiblioteket.dk;export TESTX=Stresstest;export DEPLOYCONF=deploy_conf_stress_test.xml;true;
	cleanup_all_test.sh
[main] WARN dk.netarkivet.systemtest.environment.TestEnvironmentController - ssh error: The device is not ready.
[main] WARN dk.netarkivet.systemtest.environment.TestEnvironmentController - ssh error: The system cannot find the path specified.
[main] WARN dk.netarkivet.systemtest.environment.TestEnvironmentController - ssh error: The system cannot find the path specified.
[main] WARN dk.netarkivet.systemtest.environment.TestEnvironmentController - ssh error: The system cannot find the path specified.
[main] WARN dk.netarkivet.systemtest.environment.TestEnvironmentController - ssh error: The volume does not contain a recognized file system.
[main] WARN dk.netarkivet.systemtest.environment.TestEnvironmentController - ssh error: Please make sure that all required file system drivers are loaded and that the volume is not corrupted.
[main] WARN dk.netarkivet.systemtest.environment.TestEnvironmentController - ssh error: The system cannot find the file specified.
[main] WARN dk.netarkivet.systemtest.environment.TestEnvironmentController - ssh error: The system cannot find the file specified.
[main] INFO dk.netarkivet.systemtest.environment.TestEnvironmentController - Command finished in 84 seconds. Exit code was 0
        Added fixture: Preparing deploy
[main] INFO dk.netarkivet.systemtest.environment.TestEnvironmentController - Running JSch command (on null): RemoteCommand 
	source /etc/bashrc;source /etc/profile;source ~/.bash_profile;export VERSION=SystemTest;export PORT=8073;export MAILRECEIVERS=csr@statsbiblioteket.dk;export TESTX=Stresstest;export DEPLOYCONF=deploy_conf_stress_test.xml;true;
	prepare_test.sh deploy_config_stresstest.xml
[main] INFO dk.netarkivet.systemtest.environment.TestEnvironmentController - Command finished in 3 seconds. Exit code was 0
        Added fixture: Copying production databases to the relevant test servers from the directory /home/devel/prod-backup
[main] INFO dk.netarkivet.systemtest.environment.TestEnvironmentController - Running JSch command (on kb-test-adm-001.kb.dk): RemoteCommand sshTunneling=ssh kb-test-adm-001.kb.dk 
	source /etc/bashrc;source /etc/profile;source ~/.bash_profile;export VERSION=SystemTest;export PORT=8073;export MAILRECEIVERS=csr@statsbiblioteket.dk;export TESTX=Stresstest;export DEPLOYCONF=deploy_conf_stress_test.xml;true;
	rm -rf /tmp/prod_admindb.out
[main] INFO dk.netarkivet.systemtest.environment.TestEnvironmentController - Command finished in 1 seconds. Exit code was 0
[main] INFO dk.netarkivet.systemtest.environment.TestEnvironmentController - Running JSch command (on kb-test-adm-001.kb.dk): RemoteCommand sshTunneling=ssh kb-test-adm-001.kb.dk 
	source /etc/bashrc;source /etc/profile;source ~/.bash_profile;export VERSION=SystemTest;export PORT=8073;export MAILRECEIVERS=csr@statsbiblioteket.dk;export TESTX=Stresstest;export DEPLOYCONF=deploy_conf_stress_test.xml;true;
	rm -rf /tmp/prod_harvestdb.dump.out
[main] INFO dk.netarkivet.systemtest.environment.TestEnvironmentController - Command finished in 1 seconds. Exit code was 0
[main] INFO dk.netarkivet.systemtest.environment.TestEnvironmentController - Running JSch command (on kb-test-acs-001.kb.dk): RemoteCommand sshTunneling=ssh kb-test-acs-001.kb.dk 
	source /etc/bashrc;source /etc/profile;source ~/.bash_profile;export VERSION=SystemTest;export PORT=8073;export MAILRECEIVERS=csr@statsbiblioteket.dk;export TESTX=Stresstest;export DEPLOYCONF=deploy_conf_stress_test.xml;true;
	rm -rf /tmp/CS
[main] INFO dk.netarkivet.systemtest.environment.TestEnvironmentController - Command finished in 1 seconds. Exit code was 0
        Added fixture: Copying admin db.
[main] INFO dk.netarkivet.systemtest.environment.TestEnvironmentController - Running JSch command (on null): RemoteCommand 
	source /etc/bashrc;source /etc/profile;source ~/.bash_profile;export VERSION=SystemTest;export PORT=8073;export MAILRECEIVERS=csr@statsbiblioteket.dk;export TESTX=Stresstest;export DEPLOYCONF=deploy_conf_stress_test.xml;true;
	scp -r ${HOME}/prod-backup/prod_admindb.out devel@kb-test-adm-001.kb.dk:/tmp
[main] INFO dk.netarkivet.systemtest.environment.TestEnvironmentController - Command finished in 6 seconds. Exit code was 0
        Added fixture: Copying harvest db
[main] INFO dk.netarkivet.systemtest.environment.TestEnvironmentController - Running JSch command (on null): RemoteCommand 
	source /etc/bashrc;source /etc/profile;source ~/.bash_profile;export VERSION=SystemTest;export PORT=8073;export MAILRECEIVERS=csr@statsbiblioteket.dk;export TESTX=Stresstest;export DEPLOYCONF=deploy_conf_stress_test.xml;true;
	scp -r ${HOME}/prod-backup/prod_harvestdb.dump.out devel@kb-test-adm-001.kb.dk:/tmp
[main] INFO dk.netarkivet.systemtest.environment.TestEnvironmentController - Command finished in 27 seconds. Exit code was 0
        Added fixture: Copying checksum db
[main] INFO dk.netarkivet.systemtest.environment.TestEnvironmentController - Running JSch command (on null): RemoteCommand 
	source /etc/bashrc;source /etc/profile;source ~/.bash_profile;export VERSION=SystemTest;export PORT=8073;export MAILRECEIVERS=csr@statsbiblioteket.dk;export TESTX=Stresstest;export DEPLOYCONF=deploy_conf_stress_test.xml;true;
	scp -r ${HOME}/prod-backup/CS devel@kb-test-acs-001.kb.dk:/tmp
[main] INFO dk.netarkivet.systemtest.environment.TestEnvironmentController - Command finished in 5 seconds. Exit code was 0
        Step: Installing components.
[main] INFO dk.netarkivet.systemtest.environment.TestEnvironmentController - Running JSch command (on null): RemoteCommand 
	source /etc/bashrc;source /etc/profile;source ~/.bash_profile;export VERSION=SystemTest;export PORT=8073;export MAILRECEIVERS=csr@statsbiblioteket.dk;export TESTX=Stresstest;export DEPLOYCONF=deploy_conf_stress_test.xml;true;
	install_test.sh
[main] WARN dk.netarkivet.systemtest.environment.TestEnvironmentController - ssh error: DEBUG:  transaction ID wrap limit is 2257721481, limited by database "test2056_harvestdb"
[main] WARN dk.netarkivet.systemtest.environment.TestEnvironmentController - ssh error: DEBUG:  transaction ID wrap limit is 2257721481, limited by database "test2056_harvestdb"
[main] WARN dk.netarkivet.systemtest.environment.TestEnvironmentController - ssh error: NOTICE:  CREATE TABLE / PRIMARY KEY will create implicit index "replica_pkey" for table "replica"
[main] WARN dk.netarkivet.systemtest.environment.TestEnvironmentController - ssh error: NOTICE:  CREATE TABLE / UNIQUE will create implicit index "replica_replica_id_key" for table "replica"
[main] WARN dk.netarkivet.systemtest.environment.TestEnvironmentController - ssh error: NOTICE:  CREATE TABLE / UNIQUE will create implicit index "replica_replica_name_key" for table "replica"
[main] WARN dk.netarkivet.systemtest.environment.TestEnvironmentController - ssh error: NOTICE:  CREATE TABLE / PRIMARY KEY will create implicit index "replicafileinfo_pkey" for table "replicafileinfo"
[main] WARN dk.netarkivet.systemtest.environment.TestEnvironmentController - ssh error: NOTICE:  CREATE TABLE / PRIMARY KEY will create implicit index "file_pkey" for table "file"
[main] WARN dk.netarkivet.systemtest.environment.TestEnvironmentController - ssh error: NOTICE:  CREATE TABLE / PRIMARY KEY will create implicit index "segment_pkey" for table "segment"
[main] WARN dk.netarkivet.systemtest.environment.TestEnvironmentController - ssh error: DEBUG:  transaction ID wrap limit is 2257721481, limited by database "test2056_harvestdb"
[main] WARN dk.netarkivet.systemtest.environment.TestEnvironmentController - ssh error: DEBUG:  transaction ID wrap limit is 2257721481, limited by database "test2056_harvestdb"
[main] WARN dk.netarkivet.systemtest.environment.TestEnvironmentController - ssh error: NOTICE:  CREATE TABLE / PRIMARY KEY will create implicit index "domains_pkey" for table "domains"
[main] WARN dk.netarkivet.systemtest.environment.TestEnvironmentController - ssh error: NOTICE:  CREATE TABLE / UNIQUE will create implicit index "domains_name_key" for table "domains"
[main] WARN dk.netarkivet.systemtest.environment.TestEnvironmentController - ssh error: NOTICE:  CREATE TABLE / PRIMARY KEY will create implicit index "configurations_pkey" for table "configurations"
[main] WARN dk.netarkivet.systemtest.environment.TestEnvironmentController - ssh error: NOTICE:  CREATE TABLE / PRIMARY KEY will create implicit index "config_passwords_pkey" for table "config_passwords"
[main] WARN dk.netarkivet.systemtest.environment.TestEnvironmentController - ssh error: NOTICE:  CREATE TABLE / PRIMARY KEY will create implicit index "config_seedlists_pkey" for table "config_seedlists"
[main] WARN dk.netarkivet.systemtest.environment.TestEnvironmentController - ssh error: NOTICE:  CREATE TABLE / PRIMARY KEY will create implicit index "seedlists_pkey" for table "seedlists"
[main] WARN dk.netarkivet.systemtest.environment.TestEnvironmentController - ssh error: NOTICE:  CREATE TABLE / PRIMARY KEY will create implicit index "passwords_pkey" for table "passwords"
[main] WARN dk.netarkivet.systemtest.environment.TestEnvironmentController - ssh error: NOTICE:  CREATE TABLE / PRIMARY KEY will create implicit index "ownerinfo_pkey" for table "ownerinfo"
[main] WARN dk.netarkivet.systemtest.environment.TestEnvironmentController - ssh error: NOTICE:  CREATE TABLE / PRIMARY KEY will create implicit index "historyinfo_pkey" for table "historyinfo"
[main] WARN dk.netarkivet.systemtest.environment.TestEnvironmentController - ssh error: NOTICE:  CREATE TABLE / PRIMARY KEY will create implicit index "harvestdefinitions_pkey" for table "harvestdefinitions"
[main] WARN dk.netarkivet.systemtest.environment.TestEnvironmentController - ssh error: NOTICE:  CREATE TABLE / UNIQUE will create implicit index "harvestdefinitions_name_key" for table "harvestdefinitions"
[main] WARN dk.netarkivet.systemtest.environment.TestEnvironmentController - ssh error: NOTICE:  CREATE TABLE / PRIMARY KEY will create implicit index "fullharvests_pkey" for table "fullharvests"
[main] WARN dk.netarkivet.systemtest.environment.TestEnvironmentController - ssh error: NOTICE:  CREATE TABLE / PRIMARY KEY will create implicit index "partialharvests_pkey" for table "partialharvests"
[main] WARN dk.netarkivet.systemtest.environment.TestEnvironmentController - ssh error: NOTICE:  CREATE TABLE / PRIMARY KEY will create implicit index "harvest_configs_pkey" for table "harvest_configs"
[main] WARN dk.netarkivet.systemtest.environment.TestEnvironmentController - ssh error: NOTICE:  CREATE TABLE / PRIMARY KEY will create implicit index "schedules_pkey" for table "schedules"
[main] WARN dk.netarkivet.systemtest.environment.TestEnvironmentController - ssh error: NOTICE:  CREATE TABLE / UNIQUE will create implicit index "schedules_name_key" for table "schedules"
[main] WARN dk.netarkivet.systemtest.environment.TestEnvironmentController - ssh error: NOTICE:  CREATE TABLE / PRIMARY KEY will create implicit index "ordertemplates_pkey" for table "ordertemplates"
[main] WARN dk.netarkivet.systemtest.environment.TestEnvironmentController - ssh error: NOTICE:  CREATE TABLE / UNIQUE will create implicit index "ordertemplates_name_key" for table "ordertemplates"
[main] WARN dk.netarkivet.systemtest.environment.TestEnvironmentController - ssh error: NOTICE:  CREATE TABLE / PRIMARY KEY will create implicit index "jobs_pkey" for table "jobs"
[main] WARN dk.netarkivet.systemtest.environment.TestEnvironmentController - ssh error: NOTICE:  CREATE TABLE / PRIMARY KEY will create implicit index "job_configs_pkey" for table "job_configs"
[main] WARN dk.netarkivet.systemtest.environment.TestEnvironmentController - ssh error: NOTICE:  CREATE TABLE / PRIMARY KEY will create implicit index "global_crawler_trap_lists_pkey" for table "global_crawler_trap_lists"
[main] WARN dk.netarkivet.systemtest.environment.TestEnvironmentController - ssh error: NOTICE:  CREATE TABLE / UNIQUE will create implicit index "global_crawler_trap_lists_name_key" for table "global_crawler_trap_lists"
[main] WARN dk.netarkivet.systemtest.environment.TestEnvironmentController - ssh error: NOTICE:  CREATE TABLE / PRIMARY KEY will create implicit index "global_crawler_trap_expressions_pkey" for table "global_crawler_trap_expressions"
[main] WARN dk.netarkivet.systemtest.environment.TestEnvironmentController - ssh error: NOTICE:  CREATE TABLE / PRIMARY KEY will create implicit index "pkrunningjobshistory" for table "runningjobshistory"
[main] WARN dk.netarkivet.systemtest.environment.TestEnvironmentController - ssh error: NOTICE:  CREATE TABLE / PRIMARY KEY will create implicit index "pkrunningjobsmonitor" for table "runningjobsmonitor"
[main] WARN dk.netarkivet.systemtest.environment.TestEnvironmentController - ssh error: NOTICE:  CREATE TABLE / UNIQUE will create implicit index "pkfrontierreportlines" for table "frontierreportmonitor"
[main] WARN dk.netarkivet.systemtest.environment.TestEnvironmentController - ssh error: NOTICE:  CREATE TABLE / PRIMARY KEY will create implicit index "extendedfieldtype_pkey" for table "extendedfieldtype"
[main] WARN dk.netarkivet.systemtest.environment.TestEnvironmentController - ssh error: NOTICE:  CREATE TABLE / PRIMARY KEY will create implicit index "extendedfield_pkey" for table "extendedfield"
[main] WARN dk.netarkivet.systemtest.environment.TestEnvironmentController - ssh error: NOTICE:  CREATE TABLE / PRIMARY KEY will create implicit index "extendedfieldvalue_pkey" for table "extendedfieldvalue"
[main] WARN dk.netarkivet.systemtest.environment.TestEnvironmentController - ssh error: NOTICE:  CREATE TABLE / PRIMARY KEY will create implicit index "harvestchannel_pkey" for table "harvestchannel"
[main] WARN dk.netarkivet.systemtest.environment.TestEnvironmentController - ssh error: NOTICE:  CREATE TABLE / UNIQUE will create implicit index "harvestchannel_name_key" for table "harvestchannel"
[main] WARN dk.netarkivet.systemtest.environment.TestEnvironmentController - ssh error: NOTICE:  ALTER TABLE / ADD PRIMARY KEY will create implicit index "eav_type_attribute_pkey" for table "eav_type_attribute"
[main] WARN dk.netarkivet.systemtest.environment.TestEnvironmentController - ssh error: NOTICE:  ALTER TABLE / ADD PRIMARY KEY will create implicit index "eav_attribute_pkey" for table "eav_attribute"
[main] INFO dk.netarkivet.systemtest.environment.TestEnvironmentController - Command finished in 110 seconds. Exit code was 0
        Added fixture: Cleaning out harvest database
[main] INFO dk.netarkivet.systemtest.environment.TestEnvironmentController - Running JSch command (on kb-test-adm-001.kb.dk): RemoteCommand sshTunneling=ssh kb-test-adm-001.kb.dk 
	source /etc/bashrc;source /etc/profile;source ~/.bash_profile;export VERSION=SystemTest;export PORT=8073;export MAILRECEIVERS=csr@statsbiblioteket.dk;export TESTX=Stresstest;export DEPLOYCONF=deploy_conf_stress_test.xml;true;
	cd Stresstest;psql -U devel -c 'drop database if exists stresstest_harvestdb'
[main] WARN dk.netarkivet.systemtest.environment.TestEnvironmentController - ssh error: DEBUG:  transaction ID wrap limit is 2257721481, limited by database "test2056_harvestdb"
[main] INFO dk.netarkivet.systemtest.environment.TestEnvironmentController - Command finished in 1 seconds. Exit code was 0
[main] INFO dk.netarkivet.systemtest.environment.TestEnvironmentController - Running JSch command (on kb-test-adm-001.kb.dk): RemoteCommand sshTunneling=ssh kb-test-adm-001.kb.dk 
	source /etc/bashrc;source /etc/profile;source ~/.bash_profile;export VERSION=SystemTest;export PORT=8073;export MAILRECEIVERS=csr@statsbiblioteket.dk;export TESTX=Stresstest;export DEPLOYCONF=deploy_conf_stress_test.xml;true;
	cd Stresstest;psql -U devel -c 'create database stresstest_harvestdb'
[main] WARN dk.netarkivet.systemtest.environment.TestEnvironmentController - ssh error: DEBUG:  transaction ID wrap limit is 2257721481, limited by database "test2056_harvestdb"
[main] INFO dk.netarkivet.systemtest.environment.TestEnvironmentController - Command finished in 1 seconds. Exit code was 0
        Added fixture: Cleaning out admin database
[main] INFO dk.netarkivet.systemtest.environment.TestEnvironmentController - Running JSch command (on kb-test-adm-001.kb.dk): RemoteCommand sshTunneling=ssh kb-test-adm-001.kb.dk 
	source /etc/bashrc;source /etc/profile;source ~/.bash_profile;export VERSION=SystemTest;export PORT=8073;export MAILRECEIVERS=csr@statsbiblioteket.dk;export TESTX=Stresstest;export DEPLOYCONF=deploy_conf_stress_test.xml;true;
	cd Stresstest;psql -U devel -c 'drop database if exists stresstest_admindb'
[main] WARN dk.netarkivet.systemtest.environment.TestEnvironmentController - ssh error: DEBUG:  transaction ID wrap limit is 2257721481, limited by database "test2056_harvestdb"
[main] INFO dk.netarkivet.systemtest.environment.TestEnvironmentController - Command finished in 1 seconds. Exit code was 0
[main] INFO dk.netarkivet.systemtest.environment.TestEnvironmentController - Running JSch command (on kb-test-adm-001.kb.dk): RemoteCommand sshTunneling=ssh kb-test-adm-001.kb.dk 
	source /etc/bashrc;source /etc/profile;source ~/.bash_profile;export VERSION=SystemTest;export PORT=8073;export MAILRECEIVERS=csr@statsbiblioteket.dk;export TESTX=Stresstest;export DEPLOYCONF=deploy_conf_stress_test.xml;true;
	cd Stresstest;psql -U devel -c 'create database stresstest_admindb'
[main] WARN dk.netarkivet.systemtest.environment.TestEnvironmentController - ssh error: DEBUG:  transaction ID wrap limit is 2257721481, limited by database "test2056_harvestdb"
[main] INFO dk.netarkivet.systemtest.environment.TestEnvironmentController - Command finished in 1 seconds. Exit code was 0
        Added fixture: Populating empty databases.
        Added fixture: Ingesting full production admindb backup.
[main] INFO dk.netarkivet.systemtest.environment.TestEnvironmentController - Running JSch command (on kb-test-adm-001.kb.dk): RemoteCommand sshTunneling=ssh kb-test-adm-001.kb.dk 
	source /etc/bashrc;source /etc/profile;source ~/.bash_profile;export VERSION=SystemTest;export PORT=8073;export MAILRECEIVERS=csr@statsbiblioteket.dk;export TESTX=Stresstest;export DEPLOYCONF=deploy_conf_stress_test.xml;true;
	cd Stresstest;pg_restore -U devel -d stresstest_admindb  --no-owner --schema public /tmp/prod_admindb.out
[main] INFO dk.netarkivet.systemtest.environment.TestEnvironmentController - Command finished in 592 seconds. Exit code was 0
        Added fixture: Ingesting full production harvestdb backup
[main] INFO dk.netarkivet.systemtest.environment.TestEnvironmentController - Running JSch command (on kb-test-adm-001.kb.dk): RemoteCommand sshTunneling=ssh kb-test-adm-001.kb.dk 
	source /etc/bashrc;source /etc/profile;source ~/.bash_profile;export VERSION=SystemTest;export PORT=8073;export MAILRECEIVERS=csr@statsbiblioteket.dk;export TESTX=Stresstest;export DEPLOYCONF=deploy_conf_stress_test.xml;true;
	cd Stresstest;pg_restore -U devel -d stresstest_harvestdb  --no-owner --schema public /tmp/prod_harvestdb.dump.out
[main] INFO dk.netarkivet.systemtest.environment.TestEnvironmentController - Command finished in 2114 seconds. Exit code was 0
        Added fixture: Replacing checksum database with prod data
[main] INFO dk.netarkivet.systemtest.environment.TestEnvironmentController - Running JSch command (on kb-test-acs-001.kb.dk): RemoteCommand sshTunneling=ssh kb-test-acs-001.kb.dk 
	source /etc/bashrc;source /etc/profile;source ~/.bash_profile;export VERSION=SystemTest;export PORT=8073;export MAILRECEIVERS=csr@statsbiblioteket.dk;export TESTX=Stresstest;export DEPLOYCONF=deploy_conf_stress_test.xml;true;
	cd Stresstest;rm -rf CS
[main] INFO dk.netarkivet.systemtest.environment.TestEnvironmentController - Command finished in 1 seconds. Exit code was 0
[main] INFO dk.netarkivet.systemtest.environment.TestEnvironmentController - Running JSch command (on kb-test-acs-001.kb.dk): RemoteCommand sshTunneling=ssh kb-test-acs-001.kb.dk 
	source /etc/bashrc;source /etc/profile;source ~/.bash_profile;export VERSION=SystemTest;export PORT=8073;export MAILRECEIVERS=csr@statsbiblioteket.dk;export TESTX=Stresstest;export DEPLOYCONF=deploy_conf_stress_test.xml;true;
	cd Stresstest;ln -s /tmp/CS CS
[main] INFO dk.netarkivet.systemtest.environment.TestEnvironmentController - Command finished in 1 seconds. Exit code was 0
[main] INFO dk.netarkivet.systemtest.environment.TestEnvironmentController - Running JSch command (on kb-test-adm-001.kb.dk): RemoteCommand sshTunneling=ssh kb-test-adm-001.kb.dk 
	source /etc/bashrc;source /etc/profile;source ~/.bash_profile;export VERSION=SystemTest;export PORT=8073;export MAILRECEIVERS=csr@statsbiblioteket.dk;export TESTX=Stresstest;export DEPLOYCONF=deploy_conf_stress_test.xml;true;
	cd Stresstest;export CLASSPATH=./lib/netarchivesuite-harvest-scheduler.jar:./lib/netarchivesuite-monitor-core.jar:$CLASSPATH;java -Xmx1536m -Ddk.netarkivet.settings.file=./conf/settings_GUIApplication.xml -Dlogback.configurationFile=./conf/logback_GUIApplication.xml dk.netarkivet.harvester.tools.HarvestdatabaseUpdateApplication < /dev/null > start_harvestdatabaseUpdateApplication.log 2>&1 
[main] INFO dk.netarkivet.systemtest.environment.TestEnvironmentController - Command finished in 130 seconds. Exit code was 0
        Added fixture: Starting Test
[main] INFO dk.netarkivet.systemtest.environment.TestEnvironmentController - Running JSch command (on null): RemoteCommand 
	source /etc/bashrc;source /etc/profile;source ~/.bash_profile;export VERSION=SystemTest;export PORT=8073;export MAILRECEIVERS=csr@statsbiblioteket.dk;export TESTX=Stresstest;export DEPLOYCONF=deploy_conf_stress_test.xml;true;
	start_test.sh
[main] INFO dk.netarkivet.systemtest.environment.TestEnvironmentController - Command finished in 83 seconds. Exit code was 0
      Test starting: testGenerateSnapshot
        Description: Test generating snapshot jobs with a maximum number of bytes per domain of 100 000. This takes about ten hours to complete. The number of jobs generated is determined roughly by the parameter settings.harvester.scheduler.jobGen.domainConfigSubsetSize which is set to 10000 by default. Ie there is a maximum of 10000 domains per job, although there are also a small number of jobs with much fewer domains where these have specialised configurations.
          Stimuli: Waiting for GUI to start.

        Added fixture: Opening front page kb-test-adm-001.kb.dk:8073
        Step: Creating snapshot harvest 'hQYogS'
        Step: Activate harvest
[main] INFO dk.netarkivet.systemtest.environment.TestEnvironmentController - Running JSch command (on kb-test-adm-001.kb.dk): RemoteCommand sshTunneling=ssh kb-test-adm-001.kb.dk 
	source /etc/bashrc;source /etc/profile;source ~/.bash_profile;export VERSION=SystemTest;export PORT=8073;export MAILRECEIVERS=csr@statsbiblioteket.dk;export TESTX=Stresstest;export DEPLOYCONF=deploy_conf_stress_test.xml;true;
	grep 'Created' ${HOME}/Stresstest/log/HarvestJobManager*
[main] INFO dk.netarkivet.systemtest.environment.TestEnvironmentController - Command finished in 2 seconds. Exit code was 0
[main] INFO dk.netarkivet.systemtest.environment.TestEnvironmentController - Running JSch command (on kb-test-adm-001.kb.dk): RemoteCommand sshTunneling=ssh kb-test-adm-001.kb.dk 
	source /etc/bashrc;source /etc/profile;source ~/.bash_profile;export VERSION=SystemTest;export PORT=8073;export MAILRECEIVERS=csr@statsbiblioteket.dk;export TESTX=Stresstest;export DEPLOYCONF=deploy_conf_stress_test.xml;true;
	grep 'Created' ${HOME}/Stresstest/log/HarvestJobManager*
[main] INFO dk.netarkivet.systemtest.environment.TestEnvironmentController - Command finished in 2 seconds. Exit code was 0
[main] INFO dk.netarkivet.systemtest.environment.TestEnvironmentController - Running JSch command (on kb-test-adm-001.kb.dk): RemoteCommand sshTunneling=ssh kb-test-adm-001.kb.dk 
	source /etc/bashrc;source /etc/profile;source ~/.bash_profile;export VERSION=SystemTest;export PORT=8073;export MAILRECEIVERS=csr@statsbiblioteket.dk;export TESTX=Stresstest;export DEPLOYCONF=deploy_conf_stress_test.xml;true;
	grep 'Created' ${HOME}/Stresstest/log/HarvestJobManager*
[main] INFO dk.netarkivet.systemtest.environment.TestEnvironmentController - Command finished in 2 seconds. Exit code was 0
[main] INFO dk.netarkivet.systemtest.environment.TestEnvironmentController - Running JSch command (on kb-test-adm-001.kb.dk): RemoteCommand sshTunneling=ssh kb-test-adm-001.kb.dk 
	source /etc/bashrc;source /etc/profile;source ~/.bash_profile;export VERSION=SystemTest;export PORT=8073;export MAILRECEIVERS=csr@statsbiblioteket.dk;export TESTX=Stresstest;export DEPLOYCONF=deploy_conf_stress_test.xml;true;
	grep 'Created' ${HOME}/Stresstest/log/HarvestJobManager*
[main] INFO dk.netarkivet.systemtest.environment.TestEnvironmentController - Command finished in 2 seconds. Exit code was 0
[main] INFO dk.netarkivet.systemtest.environment.TestEnvironmentController - Running JSch command (on kb-test-adm-001.kb.dk): RemoteCommand sshTunneling=ssh kb-test-adm-001.kb.dk 
	source /etc/bashrc;source /etc/profile;source ~/.bash_profile;export VERSION=SystemTest;export PORT=8073;export MAILRECEIVERS=csr@statsbiblioteket.dk;export TESTX=Stresstest;export DEPLOYCONF=deploy_conf_stress_test.xml;true;
	grep 'Created' ${HOME}/Stresstest/log/HarvestJobManager*
[main] INFO dk.netarkivet.systemtest.environment.TestEnvironmentController - Command finished in 2 seconds. Exit code was 0
[main] INFO dk.netarkivet.systemtest.environment.TestEnvironmentController - Running JSch command (on kb-test-adm-001.kb.dk): RemoteCommand sshTunneling=ssh kb-test-adm-001.kb.dk 
	source /etc/bashrc;source /etc/profile;source ~/.bash_profile;export VERSION=SystemTest;export PORT=8073;export MAILRECEIVERS=csr@statsbiblioteket.dk;export TESTX=Stresstest;export DEPLOYCONF=deploy_conf_stress_test.xml;true;
	grep 'Created' ${HOME}/Stresstest/log/HarvestJobManager*
[main] INFO dk.netarkivet.systemtest.environment.TestEnvironmentController - Command finished in 2 seconds. Exit code was 0
[main] INFO dk.netarkivet.systemtest.environment.TestEnvironmentController - Running JSch command (on kb-test-adm-001.kb.dk): RemoteCommand sshTunneling=ssh kb-test-adm-001.kb.dk 
	source /etc/bashrc;source /etc/profile;source ~/.bash_profile;export VERSION=SystemTest;export PORT=8073;export MAILRECEIVERS=csr@statsbiblioteket.dk;export TESTX=Stresstest;export DEPLOYCONF=deploy_conf_stress_test.xml;true;
	grep 'Created' ${HOME}/Stresstest/log/HarvestJobManager*
[main] INFO dk.netarkivet.systemtest.environment.TestEnvironmentController - Command finished in 3 seconds. Exit code was 0
[main] INFO dk.netarkivet.systemtest.environment.TestEnvironmentController - Running JSch command (on kb-test-adm-001.kb.dk): RemoteCommand sshTunneling=ssh kb-test-adm-001.kb.dk 
	source /etc/bashrc;source /etc/profile;source ~/.bash_profile;export VERSION=SystemTest;export PORT=8073;export MAILRECEIVERS=csr@statsbiblioteket.dk;export TESTX=Stresstest;export DEPLOYCONF=deploy_conf_stress_test.xml;true;
	grep 'Created' ${HOME}/Stresstest/log/HarvestJobManager*
[main] INFO dk.netarkivet.systemtest.environment.TestEnvironmentController - Command finished in 3 seconds. Exit code was 0
[main] INFO dk.netarkivet.systemtest.environment.TestEnvironmentController - Running JSch command (on kb-test-adm-001.kb.dk): RemoteCommand sshTunneling=ssh kb-test-adm-001.kb.dk 
	source /etc/bashrc;source /etc/profile;source ~/.bash_profile;export VERSION=SystemTest;export PORT=8073;export MAILRECEIVERS=csr@statsbiblioteket.dk;export TESTX=Stresstest;export DEPLOYCONF=deploy_conf_stress_test.xml;true;
	grep 'Created' ${HOME}/Stresstest/log/HarvestJobManager*
[main] INFO dk.netarkivet.systemtest.environment.TestEnvironmentController - Command finished in 3 seconds. Exit code was 0
[main] INFO dk.netarkivet.systemtest.environment.TestEnvironmentController - Running JSch command (on kb-test-adm-001.kb.dk): RemoteCommand sshTunneling=ssh kb-test-adm-001.kb.dk 
	source /etc/bashrc;source /etc/profile;source ~/.bash_profile;export VERSION=SystemTest;export PORT=8073;export MAILRECEIVERS=csr@statsbiblioteket.dk;export TESTX=Stresstest;export DEPLOYCONF=deploy_conf_stress_test.xml;true;
	grep 'Created' ${HOME}/Stresstest/log/HarvestJobManager*
[main] INFO dk.netarkivet.systemtest.environment.TestEnvironmentController - Command finished in 3 seconds. Exit code was 0
[main] INFO dk.netarkivet.systemtest.environment.TestEnvironmentController - Running JSch command (on kb-test-adm-001.kb.dk): RemoteCommand sshTunneling=ssh kb-test-adm-001.kb.dk 
	source /etc/bashrc;source /etc/profile;source ~/.bash_profile;export VERSION=SystemTest;export PORT=8073;export MAILRECEIVERS=csr@statsbiblioteket.dk;export TESTX=Stresstest;export DEPLOYCONF=deploy_conf_stress_test.xml;true;
	grep 'Created' ${HOME}/Stresstest/log/HarvestJobManager*
[main] INFO dk.netarkivet.systemtest.environment.TestEnvironmentController - Command finished in 4 seconds. Exit code was 0
[main] INFO dk.netarkivet.systemtest.environment.TestEnvironmentController - Running JSch command (on kb-test-adm-001.kb.dk): RemoteCommand sshTunneling=ssh kb-test-adm-001.kb.dk 
	source /etc/bashrc;source /etc/profile;source ~/.bash_profile;export VERSION=SystemTest;export PORT=8073;export MAILRECEIVERS=csr@statsbiblioteket.dk;export TESTX=Stresstest;export DEPLOYCONF=deploy_conf_stress_test.xml;true;
	grep 'Created' ${HOME}/Stresstest/log/HarvestJobManager*
[main] INFO dk.netarkivet.systemtest.environment.TestEnvironmentController - Command finished in 3 seconds. Exit code was 0
[main] INFO dk.netarkivet.systemtest.environment.TestEnvironmentController - Running JSch command (on kb-test-adm-001.kb.dk): RemoteCommand sshTunneling=ssh kb-test-adm-001.kb.dk 
	source /etc/bashrc;source /etc/profile;source ~/.bash_profile;export VERSION=SystemTest;export PORT=8073;export MAILRECEIVERS=csr@statsbiblioteket.dk;export TESTX=Stresstest;export DEPLOYCONF=deploy_conf_stress_test.xml;true;
	grep 'Created' ${HOME}/Stresstest/log/HarvestJobManager*
[main] INFO dk.netarkivet.systemtest.environment.TestEnvironmentController - Command finished in 3 seconds. Exit code was 0
[main] INFO dk.netarkivet.systemtest.environment.TestEnvironmentController - Running JSch command (on kb-test-adm-001.kb.dk): RemoteCommand sshTunneling=ssh kb-test-adm-001.kb.dk 
	source /etc/bashrc;source /etc/profile;source ~/.bash_profile;export VERSION=SystemTest;export PORT=8073;export MAILRECEIVERS=csr@statsbiblioteket.dk;export TESTX=Stresstest;export DEPLOYCONF=deploy_conf_stress_test.xml;true;
	grep 'Created' ${HOME}/Stresstest/log/HarvestJobManager*
[main] INFO dk.netarkivet.systemtest.environment.TestEnvironmentController - Command finished in 3 seconds. Exit code was 0
[main] INFO dk.netarkivet.systemtest.environment.TestEnvironmentController - Running JSch command (on kb-test-adm-001.kb.dk): RemoteCommand sshTunneling=ssh kb-test-adm-001.kb.dk 
	source /etc/bashrc;source /etc/profile;source ~/.bash_profile;export VERSION=SystemTest;export PORT=8073;export MAILRECEIVERS=csr@statsbiblioteket.dk;export TESTX=Stresstest;export DEPLOYCONF=deploy_conf_stress_test.xml;true;
	grep 'Created' ${HOME}/Stresstest/log/HarvestJobManager*
[main] INFO dk.netarkivet.systemtest.environment.TestEnvironmentController - Command finished in 4 seconds. Exit code was 0
[main] INFO dk.netarkivet.systemtest.environment.TestEnvironmentController - Running JSch command (on kb-test-adm-001.kb.dk): RemoteCommand sshTunneling=ssh kb-test-adm-001.kb.dk 
	source /etc/bashrc;source /etc/profile;source ~/.bash_profile;export VERSION=SystemTest;export PORT=8073;export MAILRECEIVERS=csr@statsbiblioteket.dk;export TESTX=Stresstest;export DEPLOYCONF=deploy_conf_stress_test.xml;true;
	grep 'Created' ${HOME}/Stresstest/log/HarvestJobManager*
[main] INFO dk.netarkivet.systemtest.environment.TestEnvironmentController - Command finished in 3 seconds. Exit code was 0
[main] INFO dk.netarkivet.systemtest.environment.TestEnvironmentController - Running JSch command (on kb-test-adm-001.kb.dk): RemoteCommand sshTunneling=ssh kb-test-adm-001.kb.dk 
	source /etc/bashrc;source /etc/profile;source ~/.bash_profile;export VERSION=SystemTest;export PORT=8073;export MAILRECEIVERS=csr@statsbiblioteket.dk;export TESTX=Stresstest;export DEPLOYCONF=deploy_conf_stress_test.xml;true;
	grep 'Created' ${HOME}/Stresstest/log/HarvestJobManager*
[main] INFO dk.netarkivet.systemtest.environment.TestEnvironmentController - Command finished in 4 seconds. Exit code was 0
[main] INFO dk.netarkivet.systemtest.environment.TestEnvironmentController - Running JSch command (on kb-test-adm-001.kb.dk): RemoteCommand sshTunneling=ssh kb-test-adm-001.kb.dk 
	source /etc/bashrc;source /etc/profile;source ~/.bash_profile;export VERSION=SystemTest;export PORT=8073;export MAILRECEIVERS=csr@statsbiblioteket.dk;export TESTX=Stresstest;export DEPLOYCONF=deploy_conf_stress_test.xml;true;
	grep 'Created' ${HOME}/Stresstest/log/HarvestJobManager*
[main] INFO dk.netarkivet.systemtest.environment.TestEnvironmentController - Command finished in 3 seconds. Exit code was 0
[main] INFO dk.netarkivet.systemtest.environment.TestEnvironmentController - Running JSch command (on kb-test-adm-001.kb.dk): RemoteCommand sshTunneling=ssh kb-test-adm-001.kb.dk 
	source /etc/bashrc;source /etc/profile;source ~/.bash_profile;export VERSION=SystemTest;export PORT=8073;export MAILRECEIVERS=csr@statsbiblioteket.dk;export TESTX=Stresstest;export DEPLOYCONF=deploy_conf_stress_test.xml;true;
	grep 'Created' ${HOME}/Stresstest/log/HarvestJobManager*
[main] INFO dk.netarkivet.systemtest.environment.TestEnvironmentController - Command finished in 2 seconds. Exit code was 0
[main] INFO dk.netarkivet.systemtest.environment.TestEnvironmentController - Running JSch command (on kb-test-adm-001.kb.dk): RemoteCommand sshTunneling=ssh kb-test-adm-001.kb.dk 
	source /etc/bashrc;source /etc/profile;source ~/.bash_profile;export VERSION=SystemTest;export PORT=8073;export MAILRECEIVERS=csr@statsbiblioteket.dk;export TESTX=Stresstest;export DEPLOYCONF=deploy_conf_stress_test.xml;true;
	grep 'Created' ${HOME}/Stresstest/log/HarvestJobManager*
[main] INFO dk.netarkivet.systemtest.environment.TestEnvironmentController - Command finished in 3 seconds. Exit code was 0
[main] INFO dk.netarkivet.systemtest.environment.TestEnvironmentController - Running JSch command (on kb-test-adm-001.kb.dk): RemoteCommand sshTunneling=ssh kb-test-adm-001.kb.dk 
	source /etc/bashrc;source /etc/profile;source ~/.bash_profile;export VERSION=SystemTest;export PORT=8073;export MAILRECEIVERS=csr@statsbiblioteket.dk;export TESTX=Stresstest;export DEPLOYCONF=deploy_conf_stress_test.xml;true;
	grep 'Created' ${HOME}/Stresstest/log/HarvestJobManager*
[main] INFO dk.netarkivet.systemtest.environment.TestEnvironmentController - Command finished in 2 seconds. Exit code was 0
[main] INFO dk.netarkivet.systemtest.environment.TestEnvironmentController - Running JSch command (on kb-test-adm-001.kb.dk): RemoteCommand sshTunneling=ssh kb-test-adm-001.kb.dk 
	source /etc/bashrc;source /etc/profile;source ~/.bash_profile;export VERSION=SystemTest;export PORT=8073;export MAILRECEIVERS=csr@statsbiblioteket.dk;export TESTX=Stresstest;export DEPLOYCONF=deploy_conf_stress_test.xml;true;
	grep 'Created' ${HOME}/Stresstest/log/HarvestJobManager*
[main] INFO dk.netarkivet.systemtest.environment.TestEnvironmentController - Command finished in 3 seconds. Exit code was 0
[main] INFO dk.netarkivet.systemtest.environment.TestEnvironmentController - Running JSch command (on kb-test-adm-001.kb.dk): RemoteCommand sshTunneling=ssh kb-test-adm-001.kb.dk 
	source /etc/bashrc;source /etc/profile;source ~/.bash_profile;export VERSION=SystemTest;export PORT=8073;export MAILRECEIVERS=csr@statsbiblioteket.dk;export TESTX=Stresstest;export DEPLOYCONF=deploy_conf_stress_test.xml;true;
	grep 'Created' ${HOME}/Stresstest/log/HarvestJobManager*
[main] INFO dk.netarkivet.systemtest.environment.TestEnvironmentController - Command finished in 3 seconds. Exit code was 0
[main] INFO dk.netarkivet.systemtest.environment.TestEnvironmentController - Running JSch command (on kb-test-adm-001.kb.dk): RemoteCommand sshTunneling=ssh kb-test-adm-001.kb.dk 
	source /etc/bashrc;source /etc/profile;source ~/.bash_profile;export VERSION=SystemTest;export PORT=8073;export MAILRECEIVERS=csr@statsbiblioteket.dk;export TESTX=Stresstest;export DEPLOYCONF=deploy_conf_stress_test.xml;true;
	grep 'Created' ${HOME}/Stresstest/log/HarvestJobManager*
[main] INFO dk.netarkivet.systemtest.environment.TestEnvironmentController - Command finished in 3 seconds. Exit code was 0
[main] INFO dk.netarkivet.systemtest.environment.TestEnvironmentController - Running JSch command (on kb-test-adm-001.kb.dk): RemoteCommand sshTunneling=ssh kb-test-adm-001.kb.dk 
	source /etc/bashrc;source /etc/profile;source ~/.bash_profile;export VERSION=SystemTest;export PORT=8073;export MAILRECEIVERS=csr@statsbiblioteket.dk;export TESTX=Stresstest;export DEPLOYCONF=deploy_conf_stress_test.xml;true;
	grep 'Created' ${HOME}/Stresstest/log/HarvestJobManager*
[main] INFO dk.netarkivet.systemtest.environment.TestEnvironmentController - Command finished in 3 seconds. Exit code was 0
[main] INFO dk.netarkivet.systemtest.environment.TestEnvironmentController - Running JSch command (on kb-test-adm-001.kb.dk): RemoteCommand sshTunneling=ssh kb-test-adm-001.kb.dk 
	source /etc/bashrc;source /etc/profile;source ~/.bash_profile;export VERSION=SystemTest;export PORT=8073;export MAILRECEIVERS=csr@statsbiblioteket.dk;export TESTX=Stresstest;export DEPLOYCONF=deploy_conf_stress_test.xml;true;
	grep 'Created' ${HOME}/Stresstest/log/HarvestJobManager*
[main] INFO dk.netarkivet.systemtest.environment.TestEnvironmentController - Command finished in 3 seconds. Exit code was 0
[main] INFO dk.netarkivet.systemtest.environment.TestEnvironmentController - Running JSch command (on kb-test-adm-001.kb.dk): RemoteCommand sshTunneling=ssh kb-test-adm-001.kb.dk 
	source /etc/bashrc;source /etc/profile;source ~/.bash_profile;export VERSION=SystemTest;export PORT=8073;export MAILRECEIVERS=csr@statsbiblioteket.dk;export TESTX=Stresstest;export DEPLOYCONF=deploy_conf_stress_test.xml;true;
	grep 'Created' ${HOME}/Stresstest/log/HarvestJobManager*
[main] INFO dk.netarkivet.systemtest.environment.TestEnvironmentController - Command finished in 3 seconds. Exit code was 0
[main] INFO dk.netarkivet.systemtest.environment.TestEnvironmentController - Running JSch command (on kb-test-adm-001.kb.dk): RemoteCommand sshTunneling=ssh kb-test-adm-001.kb.dk 
	source /etc/bashrc;source /etc/profile;source ~/.bash_profile;export VERSION=SystemTest;export PORT=8073;export MAILRECEIVERS=csr@statsbiblioteket.dk;export TESTX=Stresstest;export DEPLOYCONF=deploy_conf_stress_test.xml;true;
	grep 'Created' ${HOME}/Stresstest/log/HarvestJobManager*
[main] INFO dk.netarkivet.systemtest.environment.TestEnvironmentController - Command finished in 3 seconds. Exit code was 0
[main] INFO dk.netarkivet.systemtest.environment.TestEnvironmentController - Running JSch command (on kb-test-adm-001.kb.dk): RemoteCommand sshTunneling=ssh kb-test-adm-001.kb.dk 
	source /etc/bashrc;source /etc/profile;source ~/.bash_profile;export VERSION=SystemTest;export PORT=8073;export MAILRECEIVERS=csr@statsbiblioteket.dk;export TESTX=Stresstest;export DEPLOYCONF=deploy_conf_stress_test.xml;true;
	grep 'Created' ${HOME}/Stresstest/log/HarvestJobManager*
[main] INFO dk.netarkivet.systemtest.environment.TestEnvironmentController - Command finished in 2 seconds. Exit code was 0
[main] INFO dk.netarkivet.systemtest.environment.TestEnvironmentController - Running JSch command (on kb-test-adm-001.kb.dk): RemoteCommand sshTunneling=ssh kb-test-adm-001.kb.dk 
	source /etc/bashrc;source /etc/profile;source ~/.bash_profile;export VERSION=SystemTest;export PORT=8073;export MAILRECEIVERS=csr@statsbiblioteket.dk;export TESTX=Stresstest;export DEPLOYCONF=deploy_conf_stress_test.xml;true;
	grep 'Created' ${HOME}/Stresstest/log/HarvestJobManager*
[main] INFO dk.netarkivet.systemtest.environment.TestEnvironmentController - Command finished in 3 seconds. Exit code was 0
[main] INFO dk.netarkivet.systemtest.environment.TestEnvironmentController - Running JSch command (on kb-test-adm-001.kb.dk): RemoteCommand sshTunneling=ssh kb-test-adm-001.kb.dk 
	source /etc/bashrc;source /etc/profile;source ~/.bash_profile;export VERSION=SystemTest;export PORT=8073;export MAILRECEIVERS=csr@statsbiblioteket.dk;export TESTX=Stresstest;export DEPLOYCONF=deploy_conf_stress_test.xml;true;
	grep 'Created' ${HOME}/Stresstest/log/HarvestJobManager*
[main] INFO dk.netarkivet.systemtest.environment.TestEnvironmentController - Command finished in 3 seconds. Exit code was 0
[main] INFO dk.netarkivet.systemtest.environment.TestEnvironmentController - Running JSch command (on kb-test-adm-001.kb.dk): RemoteCommand sshTunneling=ssh kb-test-adm-001.kb.dk 
	source /etc/bashrc;source /etc/profile;source ~/.bash_profile;export VERSION=SystemTest;export PORT=8073;export MAILRECEIVERS=csr@statsbiblioteket.dk;export TESTX=Stresstest;export DEPLOYCONF=deploy_conf_stress_test.xml;true;
	grep 'Created' ${HOME}/Stresstest/log/HarvestJobManager*
[main] INFO dk.netarkivet.systemtest.environment.TestEnvironmentController - Command finished in 3 seconds. Exit code was 0
[main] INFO dk.netarkivet.systemtest.environment.TestEnvironmentController - Running JSch command (on kb-test-adm-001.kb.dk): RemoteCommand sshTunneling=ssh kb-test-adm-001.kb.dk 
	source /etc/bashrc;source /etc/profile;source ~/.bash_profile;export VERSION=SystemTest;export PORT=8073;export MAILRECEIVERS=csr@statsbiblioteket.dk;export TESTX=Stresstest;export DEPLOYCONF=deploy_conf_stress_test.xml;true;
	grep 'Created' ${HOME}/Stresstest/log/HarvestJobManager*
[main] INFO dk.netarkivet.systemtest.environment.TestEnvironmentController - Command finished in 3 seconds. Exit code was 0
[main] INFO dk.netarkivet.systemtest.environment.TestEnvironmentController - Running JSch command (on kb-test-adm-001.kb.dk): RemoteCommand sshTunneling=ssh kb-test-adm-001.kb.dk 
	source /etc/bashrc;source /etc/profile;source ~/.bash_profile;export VERSION=SystemTest;export PORT=8073;export MAILRECEIVERS=csr@statsbiblioteket.dk;export TESTX=Stresstest;export DEPLOYCONF=deploy_conf_stress_test.xml;true;
	grep 'Created' ${HOME}/Stresstest/log/HarvestJobManager*
[main] INFO dk.netarkivet.systemtest.environment.TestEnvironmentController - Command finished in 3 seconds. Exit code was 0
[main] INFO dk.netarkivet.systemtest.environment.TestEnvironmentController - Running JSch command (on kb-test-adm-001.kb.dk): RemoteCommand sshTunneling=ssh kb-test-adm-001.kb.dk 
	source /etc/bashrc;source /etc/profile;source ~/.bash_profile;export VERSION=SystemTest;export PORT=8073;export MAILRECEIVERS=csr@statsbiblioteket.dk;export TESTX=Stresstest;export DEPLOYCONF=deploy_conf_stress_test.xml;true;
	grep 'Created' ${HOME}/Stresstest/log/HarvestJobManager*
[main] INFO dk.netarkivet.systemtest.environment.TestEnvironmentController - Command finished in 7 seconds. Exit code was 0
[main] INFO dk.netarkivet.systemtest.environment.TestEnvironmentController - Running JSch command (on kb-test-adm-001.kb.dk): RemoteCommand sshTunneling=ssh kb-test-adm-001.kb.dk 
	source /etc/bashrc;source /etc/profile;source ~/.bash_profile;export VERSION=SystemTest;export PORT=8073;export MAILRECEIVERS=csr@statsbiblioteket.dk;export TESTX=Stresstest;export DEPLOYCONF=deploy_conf_stress_test.xml;true;
	grep 'Created' ${HOME}/Stresstest/log/HarvestJobManager*
[main] INFO dk.netarkivet.systemtest.environment.TestEnvironmentController - Command finished in 3 seconds. Exit code was 0
[main] INFO dk.netarkivet.systemtest.environment.TestEnvironmentController - Running JSch command (on kb-test-adm-001.kb.dk): RemoteCommand sshTunneling=ssh kb-test-adm-001.kb.dk 
	source /etc/bashrc;source /etc/profile;source ~/.bash_profile;export VERSION=SystemTest;export PORT=8073;export MAILRECEIVERS=csr@statsbiblioteket.dk;export TESTX=Stresstest;export DEPLOYCONF=deploy_conf_stress_test.xml;true;
	grep 'Created' ${HOME}/Stresstest/log/HarvestJobManager*
[main] INFO dk.netarkivet.systemtest.environment.TestEnvironmentController - Command finished in 4 seconds. Exit code was 0
      Test failed: java.lang.AssertionError: Job SnapshotGenerationJob overran the expected time limit 72429s.
[main] INFO dk.netarkivet.systemtest.performance.DatabaseFullMigrationTest - Test failure, dumping screenshot as target/failurescreendumps/DatabaseFullMigrationTest.testGenerateSnapshot()[pri:0, instance:dk.netarkivet.systemtest.performance.DatabaseFullMigrationTest@9f70c54].png
      Test starting: testIngestDomains
      Finished testcase
  Finished suite
Finished project
Tests run: 4, Failures: 2, Errors: 0, Skipped: 2, Time elapsed: 75,608.782 sec <<< FAILURE! - in dk.netarkivet.systemtest.performance.DatabaseFullMigrationTest
testGenerateSnapshot(dk.netarkivet.systemtest.performance.DatabaseFullMigrationTest)  Time elapsed: 72,437.667 sec  <<< FAILURE!
java.lang.AssertionError: Job SnapshotGenerationJob overran the expected time limit 72429s.
	at org.testng.Assert.fail(Assert.java:94)
	at dk.netarkivet.systemtest.performance.LongRunningJob.run(LongRunningJob.java:68)
	at dk.netarkivet.systemtest.performance.DatabaseFullMigrationTest.doGenerateSnapshot(DatabaseFullMigrationTest.java:93)
	at dk.netarkivet.systemtest.performance.DatabaseFullMigrationTest.testGenerateSnapshot(DatabaseFullMigrationTest.java:68)

onFailure(dk.netarkivet.systemtest.performance.DatabaseFullMigrationTest)  Time elapsed: 72,437.734 sec  <<< FAILURE!
java.lang.NullPointerException: null
	at dk.netarkivet.systemtest.SeleniumTest.onFailure(SeleniumTest.java:156)
	at sun.reflect.NativeMethodAccessorImpl.invoke0(Native Method)
	at sun.reflect.NativeMethodAccessorImpl.invoke(NativeMethodAccessorImpl.java:62)
	at sun.reflect.DelegatingMethodAccessorImpl.invoke(DelegatingMethodAccessorImpl.java:43)
	at java.lang.reflect.Method.invoke(Method.java:498)
	at org.testng.internal.MethodInvocationHelper.invokeMethod(MethodInvocationHelper.java:85)
	at org.testng.internal.Invoker.invokeConfigurationMethod(Invoker.java:552)
	at org.testng.internal.Invoker.invokeConfigurations(Invoker.java:215)
	at org.testng.internal.Invoker.invokeMethod(Invoker.java:769)
	at org.testng.internal.Invoker.invokeTestMethod(Invoker.java:882)
	at org.testng.internal.Invoker.invokeTestMethods(Invoker.java:1189)
	at org.testng.internal.TestMethodWorker.invokeTestMethods(TestMethodWorker.java:124)
	at org.testng.internal.TestMethodWorker.run(TestMethodWorker.java:108)
	at org.testng.TestRunner.privateRun(TestRunner.java:767)
	at org.testng.TestRunner.run(TestRunner.java:617)
	at org.testng.SuiteRunner.runTest(SuiteRunner.java:348)
	at org.testng.SuiteRunner.runSequentially(SuiteRunner.java:343)
	at org.testng.SuiteRunner.privateRun(SuiteRunner.java:305)
	at org.testng.SuiteRunner.run(SuiteRunner.java:254)
	at org.testng.SuiteRunnerWorker.runSuite(SuiteRunnerWorker.java:52)
	at org.testng.SuiteRunnerWorker.run(SuiteRunnerWorker.java:86)
	at org.testng.TestNG.runSuitesSequentially(TestNG.java:1224)
	at org.testng.TestNG.runSuitesLocally(TestNG.java:1149)
	at org.testng.TestNG.run(TestNG.java:1057)
	at org.apache.maven.surefire.testng.TestNGExecutor.run(TestNGExecutor.java:115)
	at org.apache.maven.surefire.testng.TestNGDirectoryTestSuite.executeSingleClass(TestNGDirectoryTestSuite.java:128)
	at org.apache.maven.surefire.testng.TestNGDirectoryTestSuite.execute(TestNGDirectoryTestSuite.java:112)
	at org.apache.maven.surefire.testng.TestNGProvider.invoke(TestNGProvider.java:112)
	at org.apache.maven.surefire.booter.ForkedBooter.invokeProviderInSameClassLoader(ForkedBooter.java:200)
	at org.apache.maven.surefire.booter.ForkedBooter.runSuitesInProcess(ForkedBooter.java:153)
	at org.apache.maven.surefire.booter.ForkedBooter.main(ForkedBooter.java:103)


Results :

Failed tests: 
  DatabaseFullMigrationTest.testGenerateSnapshot:68->doGenerateSnapshot:93 Job SnapshotGenerationJob overran the expected time limit 72429s.
  DatabaseFullMigrationTest>SeleniumTest.onFailure:156 » NullPointer

Tests run: 4, Failures: 2, Errors: 0, Skipped: 2

[INFO] ------------------------------------------------------------------------
[INFO] Reactor Summary:
[INFO] 
[INFO] NetarchiveSuite .................................... SUCCESS [  1.979 s]
[INFO] NetarchiveSuite - build-tools ...................... SUCCESS [  2.517 s]
[INFO] NetarchiveSuite - common ........................... SUCCESS [  0.018 s]
[INFO] NetarchiveSuite - test utils ....................... SUCCESS [  1.548 s]
[INFO] NetarchiveSuite - common - core .................... SUCCESS [  9.395 s]
[INFO] NetarchiveSuite - archive .......................... SUCCESS [  0.012 s]
[INFO] NetarchiveSuite - archive - core ................... SUCCESS [  3.328 s]
[INFO] NetarchiveSuite - common - test .................... SUCCESS [  4.698 s]
[INFO] NetarchiveSuite - harvester ........................ SUCCESS [  0.011 s]
[INFO] NetarchiveSuite - harvester - heritrix1 ............ SUCCESS [  0.009 s]
[INFO] NetarchiveSuite - heritrix1 frontier ............... SUCCESS [  0.942 s]
[INFO] NetarchiveSuite - harvester - core ................. SUCCESS [  7.068 s]
[INFO] NetarchiveSuite - archive - test ................... SUCCESS [  3.041 s]
[INFO] NetarchiveSuite - bitpreservation - webapp ......... SUCCESS [  1.014 s]
[INFO] NetarchiveSuite - heritrix1 extensions ............. SUCCESS [  1.461 s]
[INFO] NetarchiveSuite - heritrix1 controller ............. SUCCESS [  2.294 s]
[INFO] NetarchiveSuite - Harvest Scheduler ................ SUCCESS [  0.932 s]
[INFO] NetarchiveSuite - monitor .......................... SUCCESS [  0.011 s]
[INFO] NetarchiveSuite - monitor - core ................... SUCCESS [  0.771 s]
[INFO] NetarchiveSuite - wayback .......................... SUCCESS [  0.008 s]
[INFO] NetarchiveSuite - wayback - indexer ................ SUCCESS [  1.682 s]
[INFO] NetarchiveSuite - deploy ........................... SUCCESS [  0.018 s]
[INFO] NetarchiveSuite - deploy - core .................... SUCCESS [  1.994 s]
[INFO] NetarchiveSuite - harvester - heritrix3 ............ SUCCESS [  0.014 s]
[INFO] Netarchivesuite - Heritrix3 Extensions ............. SUCCESS [  3.304 s]
[INFO] NetarchiveSuite - heritrix3 controller ............. SUCCESS [  1.584 s]
[INFO] NetarchiveSuite - Status - Webapp .................. SUCCESS [  0.270 s]
[INFO] NetarchiveSuite - qa - webapp ...................... SUCCESS [  0.167 s]
[INFO] NetarchiveSuite - history - webapp ................. SUCCESS [  0.638 s]
[INFO] NetarchiveSuite - harvestDefinition - webapp ....... SUCCESS [  0.680 s]
[INFO] NetarchiveSuite - harvestChannel - webapp .......... SUCCESS [  0.121 s]
[INFO] NetarchiveSuite - deploy - distribution ............ SUCCESS [ 16.397 s]
[INFO] NetarchiveSuite - deploy - test .................... SUCCESS [  1.670 s]
[INFO] Netarchivesuite - Heritrix3 Bundler ................ SUCCESS [ 10.065 s]
[INFO] NetarchiveSuite - harvester - test ................. SUCCESS [  4.765 s]
[INFO] NetarchiveSuite - monitor - test ................... SUCCESS [  0.570 s]
[INFO] NetarchiveSuite - wayback resourceStore ............ SUCCESS [  0.837 s]
[INFO] NetarchiveSuite - wayback - test ................... SUCCESS [  0.962 s]
[INFO] NetarchiveSuite - integration tests ................ SUCCESS [  0.003 s]
[INFO] NetarchiveSuite System test ........................ FAILURE [  21:00 h]
[INFO] ------------------------------------------------------------------------
[INFO] BUILD FAILURE
[INFO] ------------------------------------------------------------------------
[INFO] Total time: 21:01 h
[INFO] Finished at: 2017-05-30T09:40:51+02:00
[INFO] Final Memory: 84M/244M
[INFO] ------------------------------------------------------------------------
[ERROR] Failed to execute goal org.apache.maven.plugins:maven-surefire-plugin:2.17:test (surefire-it) on project system-test: There are test failures.
[ERROR] 
[ERROR] Please refer to /home/cibuild02/workspace/Netarchivesuite-db-full-migration-test/integration-test/system-test/target/surefire-reports for the individual test results.
[ERROR] -> [Help 1]
[ERROR] 
[ERROR] To see the full stack trace of the errors, re-run Maven with the -e switch.
[ERROR] Re-run Maven using the -X switch to enable full debug logging.
[ERROR] 
[ERROR] For more information about the errors and possible solutions, please read the following articles:
[ERROR] [Help 1] http://cwiki.apache.org/confluence/display/MAVEN/MojoFailureException
[ERROR] 
[ERROR] After correcting the problems, you can resume the build with the command
[ERROR]   mvn <goals> -rf :system-test
Build step 'Invoke top-level Maven targets' marked build as failure
Started indexing related Jira issue keys
Successfully indexed related Jira issue keys
TestNG Reports Processing: START
Looking for TestNG results report in workspace using pattern: **netarchivesuite-integration-test/target/surefire-reports/testng-results.xml
Did not find any matching files.
Sending e-mails to: csr@statsbiblioteket.dk
Finished: FAILURE