FailedConsole Output

Skipping 111 KB.. Full Log
ng 3 source files to /home/cibuild02/workspace/NetarchiveSuite-system-test/deploy/deploy-core/target/test-classes
[INFO] 
[INFO] --- maven-surefire-plugin:2.17:test (default-test) @ deploy-core ---
[INFO] Tests are skipped.
[INFO] 
[INFO] --- maven-jgit-buildnumber-plugin:1.2.9:extract-buildnumber (git-buildnumber) @ deploy-core ---
[INFO] 
[INFO] --- maven-jar-plugin:2.4:jar (default-jar) @ deploy-core ---
[INFO] Building jar: /home/cibuild02/workspace/NetarchiveSuite-system-test/deploy/deploy-core/target/deploy-core-5.4-SNAPSHOT.jar
[INFO] 
[INFO] >>> maven-source-plugin:2.2.1:jar (attach-sources) > generate-sources @ deploy-core >>>
[INFO] 
[INFO] --- jacoco-maven-plugin:0.7.9:prepare-agent (agent) @ deploy-core ---
[INFO] argLine set to -javaagent:/home/cibuild02/.m2/repository/org/jacoco/org.jacoco.agent/0.7.9/org.jacoco.agent-0.7.9-runtime.jar=destfile=/home/cibuild02/workspace/NetarchiveSuite-system-test/deploy/deploy-core/../target/jacoco.exec,append=true
[INFO] 
[INFO] <<< maven-source-plugin:2.2.1:jar (attach-sources) < generate-sources @ deploy-core <<<
[INFO] 
[INFO] --- maven-source-plugin:2.2.1:jar (attach-sources) @ deploy-core ---
[INFO] Building jar: /home/cibuild02/workspace/NetarchiveSuite-system-test/deploy/deploy-core/target/deploy-core-5.4-SNAPSHOT-sources.jar
[INFO] 
[INFO] --- maven-javadoc-plugin:2.10.3:jar (attach-javadocs) @ deploy-core ---
[INFO] Building jar: /home/cibuild02/workspace/NetarchiveSuite-system-test/deploy/deploy-core/target/deploy-core-5.4-SNAPSHOT-javadoc.jar
[INFO] 
[INFO] --- maven-install-plugin:2.4:install (default-install) @ deploy-core ---
[INFO] Installing /home/cibuild02/workspace/NetarchiveSuite-system-test/deploy/deploy-core/target/deploy-core-5.4-SNAPSHOT.jar to /home/cibuild02/.m2/repository/org/netarchivesuite/deploy-core/5.4-SNAPSHOT/deploy-core-5.4-SNAPSHOT.jar
[INFO] Installing /home/cibuild02/workspace/NetarchiveSuite-system-test/deploy/deploy-core/pom.xml to /home/cibuild02/.m2/repository/org/netarchivesuite/deploy-core/5.4-SNAPSHOT/deploy-core-5.4-SNAPSHOT.pom
[INFO] Installing /home/cibuild02/workspace/NetarchiveSuite-system-test/deploy/deploy-core/target/deploy-core-5.4-SNAPSHOT-sources.jar to /home/cibuild02/.m2/repository/org/netarchivesuite/deploy-core/5.4-SNAPSHOT/deploy-core-5.4-SNAPSHOT-sources.jar
[INFO] Installing /home/cibuild02/workspace/NetarchiveSuite-system-test/deploy/deploy-core/target/deploy-core-5.4-SNAPSHOT-javadoc.jar to /home/cibuild02/.m2/repository/org/netarchivesuite/deploy-core/5.4-SNAPSHOT/deploy-core-5.4-SNAPSHOT-javadoc.jar
[INFO]                                                                         
[INFO] ------------------------------------------------------------------------
[INFO] Building NetarchiveSuite - harvester - heritrix3 5.4-SNAPSHOT
[INFO] ------------------------------------------------------------------------
[INFO] 
[INFO] --- maven-clean-plugin:2.5:clean (default-clean) @ heritrix3 ---
[INFO] 
[INFO] --- maven-jgit-buildnumber-plugin:1.2.9:extract-buildnumber (git-buildnumber) @ heritrix3 ---
[INFO] 
[INFO] >>> maven-source-plugin:2.2.1:jar (attach-sources) > generate-sources @ heritrix3 >>>
[INFO] 
[INFO] <<< maven-source-plugin:2.2.1:jar (attach-sources) < generate-sources @ heritrix3 <<<
[INFO] 
[INFO] --- maven-source-plugin:2.2.1:jar (attach-sources) @ heritrix3 ---
[INFO] 
[INFO] --- maven-javadoc-plugin:2.10.3:jar (attach-javadocs) @ heritrix3 ---
[INFO] Not executing Javadoc as the project is not a Java classpath-capable package
[INFO] 
[INFO] --- maven-install-plugin:2.4:install (default-install) @ heritrix3 ---
[INFO] Installing /home/cibuild02/workspace/NetarchiveSuite-system-test/harvester/heritrix3/pom.xml to /home/cibuild02/.m2/repository/org/netarchivesuite/heritrix3/5.4-SNAPSHOT/heritrix3-5.4-SNAPSHOT.pom
[INFO]                                                                         
[INFO] ------------------------------------------------------------------------
[INFO] Building Netarchivesuite - Heritrix3 Extensions 5.4-SNAPSHOT
[INFO] ------------------------------------------------------------------------
[INFO] 
[INFO] --- maven-clean-plugin:2.5:clean (default-clean) @ heritrix3-extensions ---
[INFO] 
[INFO] --- maven-resources-plugin:2.6:resources (default-resources) @ heritrix3-extensions ---
[INFO] Using 'UTF-8' encoding to copy filtered resources.
[INFO] skip non existing resourceDirectory /home/cibuild02/workspace/NetarchiveSuite-system-test/harvester/heritrix3/heritrix3-extensions/src/main/resources
[INFO] 
[INFO] --- maven-compiler-plugin:3.1:compile (default-compile) @ heritrix3-extensions ---
[INFO] Changes detected - recompiling the module!
[INFO] Compiling 14 source files to /home/cibuild02/workspace/NetarchiveSuite-system-test/harvester/heritrix3/heritrix3-extensions/target/classes
[WARNING] /home/cibuild02/workspace/NetarchiveSuite-system-test/harvester/heritrix3/heritrix3-extensions/src/main/java/org/archive/crawler/framework/ToeThread.java: /home/cibuild02/workspace/NetarchiveSuite-system-test/harvester/heritrix3/heritrix3-extensions/src/main/java/org/archive/crawler/framework/ToeThread.java uses or overrides a deprecated API.
[WARNING] /home/cibuild02/workspace/NetarchiveSuite-system-test/harvester/heritrix3/heritrix3-extensions/src/main/java/org/archive/crawler/framework/ToeThread.java: Recompile with -Xlint:deprecation for details.
[INFO] 
[INFO] --- maven-resources-plugin:2.6:testResources (default-testResources) @ heritrix3-extensions ---
[INFO] Using 'UTF-8' encoding to copy filtered resources.
[INFO] skip non existing resourceDirectory /home/cibuild02/workspace/NetarchiveSuite-system-test/harvester/heritrix3/heritrix3-extensions/src/test/resources
[INFO] 
[INFO] --- maven-compiler-plugin:3.1:testCompile (default-testCompile) @ heritrix3-extensions ---
[INFO] Changes detected - recompiling the module!
[INFO] Compiling 9 source files to /home/cibuild02/workspace/NetarchiveSuite-system-test/harvester/heritrix3/heritrix3-extensions/target/test-classes
[WARNING] /home/cibuild02/workspace/NetarchiveSuite-system-test/harvester/heritrix3/heritrix3-extensions/src/test/java/dk/netarkivet/harvester/harvesting/extractor/ExtractorOAITest.java: /home/cibuild02/workspace/NetarchiveSuite-system-test/harvester/heritrix3/heritrix3-extensions/src/test/java/dk/netarkivet/harvester/harvesting/extractor/ExtractorOAITest.java uses or overrides a deprecated API.
[WARNING] /home/cibuild02/workspace/NetarchiveSuite-system-test/harvester/heritrix3/heritrix3-extensions/src/test/java/dk/netarkivet/harvester/harvesting/extractor/ExtractorOAITest.java: Recompile with -Xlint:deprecation for details.
[INFO] 
[INFO] --- maven-surefire-plugin:2.17:test (default-test) @ heritrix3-extensions ---
[INFO] Tests are skipped.
[INFO] 
[INFO] --- maven-jgit-buildnumber-plugin:1.2.9:extract-buildnumber (git-buildnumber) @ heritrix3-extensions ---
[INFO] 
[INFO] --- maven-jar-plugin:2.4:jar (default-jar) @ heritrix3-extensions ---
[INFO] Building jar: /home/cibuild02/workspace/NetarchiveSuite-system-test/harvester/heritrix3/heritrix3-extensions/target/heritrix3-extensions-5.4-SNAPSHOT.jar
[INFO] 
[INFO] >>> maven-source-plugin:2.2.1:jar (attach-sources) > generate-sources @ heritrix3-extensions >>>
[INFO] 
[INFO] <<< maven-source-plugin:2.2.1:jar (attach-sources) < generate-sources @ heritrix3-extensions <<<
[INFO] 
[INFO] --- maven-source-plugin:2.2.1:jar (attach-sources) @ heritrix3-extensions ---
[INFO] Building jar: /home/cibuild02/workspace/NetarchiveSuite-system-test/harvester/heritrix3/heritrix3-extensions/target/heritrix3-extensions-5.4-SNAPSHOT-sources.jar
[INFO] 
[INFO] --- maven-javadoc-plugin:2.10.3:jar (attach-javadocs) @ heritrix3-extensions ---
[INFO] 
1 warning
[WARNING] Javadoc Warnings
[WARNING] /home/cibuild02/workspace/NetarchiveSuite-system-test/harvester/heritrix3/heritrix3-extensions/src/main/java/dk/netarkivet/harvester/harvesting/extractor/IcelandicExtractorJS.java:66: warning - @contributor is an unknown tag.
[INFO] Building jar: /home/cibuild02/workspace/NetarchiveSuite-system-test/harvester/heritrix3/heritrix3-extensions/target/heritrix3-extensions-5.4-SNAPSHOT-javadoc.jar
[INFO] 
[INFO] --- maven-install-plugin:2.4:install (default-install) @ heritrix3-extensions ---
[INFO] Installing /home/cibuild02/workspace/NetarchiveSuite-system-test/harvester/heritrix3/heritrix3-extensions/target/heritrix3-extensions-5.4-SNAPSHOT.jar to /home/cibuild02/.m2/repository/org/netarchivesuite/heritrix3-extensions/5.4-SNAPSHOT/heritrix3-extensions-5.4-SNAPSHOT.jar
[INFO] Installing /home/cibuild02/workspace/NetarchiveSuite-system-test/harvester/heritrix3/heritrix3-extensions/pom.xml to /home/cibuild02/.m2/repository/org/netarchivesuite/heritrix3-extensions/5.4-SNAPSHOT/heritrix3-extensions-5.4-SNAPSHOT.pom
[INFO] Installing /home/cibuild02/workspace/NetarchiveSuite-system-test/harvester/heritrix3/heritrix3-extensions/target/heritrix3-extensions-5.4-SNAPSHOT-sources.jar to /home/cibuild02/.m2/repository/org/netarchivesuite/heritrix3-extensions/5.4-SNAPSHOT/heritrix3-extensions-5.4-SNAPSHOT-sources.jar
[INFO] Installing /home/cibuild02/workspace/NetarchiveSuite-system-test/harvester/heritrix3/heritrix3-extensions/target/heritrix3-extensions-5.4-SNAPSHOT-javadoc.jar to /home/cibuild02/.m2/repository/org/netarchivesuite/heritrix3-extensions/5.4-SNAPSHOT/heritrix3-extensions-5.4-SNAPSHOT-javadoc.jar
[INFO]                                                                         
[INFO] ------------------------------------------------------------------------
[INFO] Building NetarchiveSuite - heritrix3 controller 5.4-SNAPSHOT
[INFO] ------------------------------------------------------------------------
[INFO] 
[INFO] --- maven-clean-plugin:2.5:clean (default-clean) @ heritrix3-controller ---
[INFO] 
[INFO] --- maven-resources-plugin:2.6:resources (default-resources) @ heritrix3-controller ---
[INFO] Using 'UTF-8' encoding to copy filtered resources.
[INFO] Copying 1 resource
[INFO] 
[INFO] --- maven-compiler-plugin:3.1:compile (default-compile) @ heritrix3-controller ---
[INFO] Changes detected - recompiling the module!
[INFO] Compiling 22 source files to /home/cibuild02/workspace/NetarchiveSuite-system-test/harvester/heritrix3/heritrix3-controller/target/classes
[INFO] 
[INFO] --- maven-resources-plugin:2.6:testResources (default-testResources) @ heritrix3-controller ---
[INFO] Using 'UTF-8' encoding to copy filtered resources.
[INFO] Copying 3 resources
[INFO] 
[INFO] --- maven-compiler-plugin:3.1:testCompile (default-testCompile) @ heritrix3-controller ---
[INFO] Changes detected - recompiling the module!
[INFO] Compiling 3 source files to /home/cibuild02/workspace/NetarchiveSuite-system-test/harvester/heritrix3/heritrix3-controller/target/test-classes
[INFO] 
[INFO] --- maven-surefire-plugin:2.17:test (default-test) @ heritrix3-controller ---
[INFO] Tests are skipped.
[INFO] 
[INFO] --- maven-jgit-buildnumber-plugin:1.2.9:extract-buildnumber (git-buildnumber) @ heritrix3-controller ---
[INFO] 
[INFO] --- maven-jar-plugin:2.4:jar (default-jar) @ heritrix3-controller ---
[INFO] Building jar: /home/cibuild02/workspace/NetarchiveSuite-system-test/harvester/heritrix3/heritrix3-controller/target/heritrix3-controller-5.4-SNAPSHOT.jar
[INFO] 
[INFO] >>> maven-source-plugin:2.2.1:jar (attach-sources) > generate-sources @ heritrix3-controller >>>
[INFO] 
[INFO] <<< maven-source-plugin:2.2.1:jar (attach-sources) < generate-sources @ heritrix3-controller <<<
[INFO] 
[INFO] --- maven-source-plugin:2.2.1:jar (attach-sources) @ heritrix3-controller ---
[INFO] Building jar: /home/cibuild02/workspace/NetarchiveSuite-system-test/harvester/heritrix3/heritrix3-controller/target/heritrix3-controller-5.4-SNAPSHOT-sources.jar
[INFO] 
[INFO] --- maven-javadoc-plugin:2.10.3:jar (attach-javadocs) @ heritrix3-controller ---
[INFO] 
3 warnings
[WARNING] Javadoc Warnings
[WARNING] /home/cibuild02/workspace/NetarchiveSuite-system-test/harvester/heritrix3/heritrix3-controller/src/main/java/dk/netarkivet/harvester/heritrix3/Heritrix3Settings.java:174: warning - Tag @see: can't find documentHarvest(dk.netarkivet.harvester.harvesting.IngestableFiles) in dk.netarkivet.harvester.heritrix3.HarvestDocumentation
[WARNING] /home/cibuild02/workspace/NetarchiveSuite-system-test/harvester/heritrix3/heritrix3-controller/src/main/java/dk/netarkivet/harvester/heritrix3/Heritrix3Settings.java:165: warning - Tag @see: can't find documentHarvest(dk.netarkivet.harvester.harvesting.IngestableFiles) in dk.netarkivet.harvester.heritrix3.HarvestDocumentation
[WARNING] /home/cibuild02/workspace/NetarchiveSuite-system-test/harvester/heritrix3/heritrix3-controller/src/main/java/dk/netarkivet/harvester/heritrix3/Heritrix3Settings.java:156: warning - Tag @see: can't find documentHarvest(dk.netarkivet.harvester.harvesting.IngestableFiles) in dk.netarkivet.harvester.heritrix3.HarvestDocumentation
[INFO] Building jar: /home/cibuild02/workspace/NetarchiveSuite-system-test/harvester/heritrix3/heritrix3-controller/target/heritrix3-controller-5.4-SNAPSHOT-javadoc.jar
[INFO] 
[INFO] --- maven-install-plugin:2.4:install (default-install) @ heritrix3-controller ---
[INFO] Installing /home/cibuild02/workspace/NetarchiveSuite-system-test/harvester/heritrix3/heritrix3-controller/target/heritrix3-controller-5.4-SNAPSHOT.jar to /home/cibuild02/.m2/repository/org/netarchivesuite/heritrix3-controller/5.4-SNAPSHOT/heritrix3-controller-5.4-SNAPSHOT.jar
[INFO] Installing /home/cibuild02/workspace/NetarchiveSuite-system-test/harvester/heritrix3/heritrix3-controller/pom.xml to /home/cibuild02/.m2/repository/org/netarchivesuite/heritrix3-controller/5.4-SNAPSHOT/heritrix3-controller-5.4-SNAPSHOT.pom
[INFO] Installing /home/cibuild02/workspace/NetarchiveSuite-system-test/harvester/heritrix3/heritrix3-controller/target/heritrix3-controller-5.4-SNAPSHOT-sources.jar to /home/cibuild02/.m2/repository/org/netarchivesuite/heritrix3-controller/5.4-SNAPSHOT/heritrix3-controller-5.4-SNAPSHOT-sources.jar
[INFO] Installing /home/cibuild02/workspace/NetarchiveSuite-system-test/harvester/heritrix3/heritrix3-controller/target/heritrix3-controller-5.4-SNAPSHOT-javadoc.jar to /home/cibuild02/.m2/repository/org/netarchivesuite/heritrix3-controller/5.4-SNAPSHOT/heritrix3-controller-5.4-SNAPSHOT-javadoc.jar
[INFO]                                                                         
[INFO] ------------------------------------------------------------------------
[INFO] Building NetarchiveSuite - Status - Webapp 5.4-SNAPSHOT
[INFO] ------------------------------------------------------------------------
[INFO] 
[INFO] --- maven-clean-plugin:2.5:clean (default-clean) @ status-gui ---
[INFO] 
[INFO] --- maven-resources-plugin:2.6:resources (default-resources) @ status-gui ---
[INFO] Using 'UTF-8' encoding to copy filtered resources.
[INFO] skip non existing resourceDirectory /home/cibuild02/workspace/NetarchiveSuite-system-test/monitor/status-gui/src/main/resources
[INFO] 
[INFO] --- maven-compiler-plugin:3.1:compile (default-compile) @ status-gui ---
[INFO] No sources to compile
[INFO] 
[INFO] --- maven-resources-plugin:2.6:testResources (default-testResources) @ status-gui ---
[INFO] Using 'UTF-8' encoding to copy filtered resources.
[INFO] skip non existing resourceDirectory /home/cibuild02/workspace/NetarchiveSuite-system-test/monitor/status-gui/src/test/resources
[INFO] 
[INFO] --- maven-compiler-plugin:3.1:testCompile (default-testCompile) @ status-gui ---
[INFO] No sources to compile
[INFO] 
[INFO] --- maven-surefire-plugin:2.17:test (default-test) @ status-gui ---
[INFO] Tests are skipped.
[INFO] 
[INFO] --- maven-jgit-buildnumber-plugin:1.2.9:extract-buildnumber (git-buildnumber) @ status-gui ---
[INFO] 
[INFO] --- maven-war-plugin:2.2:war (default-war) @ status-gui ---
[INFO] Packaging webapp
[INFO] Assembling webapp [status-gui] in [/home/cibuild02/workspace/NetarchiveSuite-system-test/monitor/status-gui/target/Status]
[INFO] Processing war project
[INFO] Copying webapp resources [/home/cibuild02/workspace/NetarchiveSuite-system-test/monitor/status-gui/src/main/webapp]
[INFO] Webapp assembled in [59 msecs]
[INFO] Building war: /home/cibuild02/workspace/NetarchiveSuite-system-test/monitor/status-gui/target/Status.war
[INFO] WEB-INF/web.xml already added, skipping
[INFO] 
[INFO] >>> maven-source-plugin:2.2.1:jar (attach-sources) > generate-sources @ status-gui >>>
[INFO] 
[INFO] <<< maven-source-plugin:2.2.1:jar (attach-sources) < generate-sources @ status-gui <<<
[INFO] 
[INFO] --- maven-source-plugin:2.2.1:jar (attach-sources) @ status-gui ---
[INFO] No sources in project. Archive not created.
[INFO] 
[INFO] --- maven-javadoc-plugin:2.10.3:jar (attach-javadocs) @ status-gui ---
[INFO] 
[INFO] --- maven-install-plugin:2.4:install (default-install) @ status-gui ---
[INFO] Installing /home/cibuild02/workspace/NetarchiveSuite-system-test/monitor/status-gui/target/Status.war to /home/cibuild02/.m2/repository/org/netarchivesuite/status-gui/5.4-SNAPSHOT/status-gui-5.4-SNAPSHOT.war
[INFO] Installing /home/cibuild02/workspace/NetarchiveSuite-system-test/monitor/status-gui/pom.xml to /home/cibuild02/.m2/repository/org/netarchivesuite/status-gui/5.4-SNAPSHOT/status-gui-5.4-SNAPSHOT.pom
[INFO]                                                                         
[INFO] ------------------------------------------------------------------------
[INFO] Building NetarchiveSuite - qa - webapp 5.4-SNAPSHOT
[INFO] ------------------------------------------------------------------------
[INFO] 
[INFO] --- maven-clean-plugin:2.5:clean (default-clean) @ qa-gui ---
[INFO] 
[INFO] --- maven-resources-plugin:2.6:resources (default-resources) @ qa-gui ---
[INFO] Using 'UTF-8' encoding to copy filtered resources.
[INFO] skip non existing resourceDirectory /home/cibuild02/workspace/NetarchiveSuite-system-test/harvester/qa-gui/src/main/resources
[INFO] 
[INFO] --- maven-compiler-plugin:3.1:compile (default-compile) @ qa-gui ---
[INFO] No sources to compile
[INFO] 
[INFO] --- maven-resources-plugin:2.6:testResources (default-testResources) @ qa-gui ---
[INFO] Using 'UTF-8' encoding to copy filtered resources.
[INFO] skip non existing resourceDirectory /home/cibuild02/workspace/NetarchiveSuite-system-test/harvester/qa-gui/src/test/resources
[INFO] 
[INFO] --- maven-compiler-plugin:3.1:testCompile (default-testCompile) @ qa-gui ---
[INFO] No sources to compile
[INFO] 
[INFO] --- maven-surefire-plugin:2.17:test (default-test) @ qa-gui ---
[INFO] Tests are skipped.
[INFO] 
[INFO] --- maven-jgit-buildnumber-plugin:1.2.9:extract-buildnumber (git-buildnumber) @ qa-gui ---
[INFO] 
[INFO] --- maven-war-plugin:2.2:war (default-war) @ qa-gui ---
[INFO] Packaging webapp
[INFO] Assembling webapp [qa-gui] in [/home/cibuild02/workspace/NetarchiveSuite-system-test/harvester/qa-gui/target/QA]
[INFO] Processing war project
[INFO] Copying webapp resources [/home/cibuild02/workspace/NetarchiveSuite-system-test/harvester/qa-gui/src/main/webapp]
[INFO] Webapp assembled in [9 msecs]
[INFO] Building war: /home/cibuild02/workspace/NetarchiveSuite-system-test/harvester/qa-gui/target/QA.war
[INFO] WEB-INF/web.xml already added, skipping
[INFO] 
[INFO] >>> maven-source-plugin:2.2.1:jar (attach-sources) > generate-sources @ qa-gui >>>
[INFO] 
[INFO] <<< maven-source-plugin:2.2.1:jar (attach-sources) < generate-sources @ qa-gui <<<
[INFO] 
[INFO] --- maven-source-plugin:2.2.1:jar (attach-sources) @ qa-gui ---
[INFO] No sources in project. Archive not created.
[INFO] 
[INFO] --- maven-javadoc-plugin:2.10.3:jar (attach-javadocs) @ qa-gui ---
[INFO] 
[INFO] --- maven-install-plugin:2.4:install (default-install) @ qa-gui ---
[INFO] Installing /home/cibuild02/workspace/NetarchiveSuite-system-test/harvester/qa-gui/target/QA.war to /home/cibuild02/.m2/repository/org/netarchivesuite/qa-gui/5.4-SNAPSHOT/qa-gui-5.4-SNAPSHOT.war
[INFO] Installing /home/cibuild02/workspace/NetarchiveSuite-system-test/harvester/qa-gui/pom.xml to /home/cibuild02/.m2/repository/org/netarchivesuite/qa-gui/5.4-SNAPSHOT/qa-gui-5.4-SNAPSHOT.pom
[INFO]                                                                         
[INFO] ------------------------------------------------------------------------
[INFO] Building NetarchiveSuite - history - webapp 5.4-SNAPSHOT
[INFO] ------------------------------------------------------------------------
[INFO] 
[INFO] --- maven-clean-plugin:2.5:clean (default-clean) @ history-gui ---
[INFO] 
[INFO] --- maven-resources-plugin:2.6:resources (default-resources) @ history-gui ---
[INFO] Using 'UTF-8' encoding to copy filtered resources.
[INFO] skip non existing resourceDirectory /home/cibuild02/workspace/NetarchiveSuite-system-test/harvester/history-gui/src/main/resources
[INFO] 
[INFO] --- maven-compiler-plugin:3.1:compile (default-compile) @ history-gui ---
[INFO] No sources to compile
[INFO] 
[INFO] --- maven-resources-plugin:2.6:testResources (default-testResources) @ history-gui ---
[INFO] Using 'UTF-8' encoding to copy filtered resources.
[INFO] skip non existing resourceDirectory /home/cibuild02/workspace/NetarchiveSuite-system-test/harvester/history-gui/src/test/resources
[INFO] 
[INFO] --- maven-compiler-plugin:3.1:testCompile (default-testCompile) @ history-gui ---
[INFO] No sources to compile
[INFO] 
[INFO] --- maven-surefire-plugin:2.17:test (default-test) @ history-gui ---
[INFO] Tests are skipped.
[INFO] 
[INFO] --- maven-jgit-buildnumber-plugin:1.2.9:extract-buildnumber (git-buildnumber) @ history-gui ---
[INFO] 
[INFO] --- maven-war-plugin:2.2:war (default-war) @ history-gui ---
[INFO] Packaging webapp
[INFO] Assembling webapp [history-gui] in [/home/cibuild02/workspace/NetarchiveSuite-system-test/harvester/history-gui/target/History]
[INFO] Processing war project
[INFO] Copying webapp resources [/home/cibuild02/workspace/NetarchiveSuite-system-test/harvester/history-gui/src/main/webapp]
[INFO] Webapp assembled in [43 msecs]
[INFO] Building war: /home/cibuild02/workspace/NetarchiveSuite-system-test/harvester/history-gui/target/History.war
[INFO] WEB-INF/web.xml already added, skipping
[INFO] 
[INFO] >>> maven-source-plugin:2.2.1:jar (attach-sources) > generate-sources @ history-gui >>>
[INFO] 
[INFO] <<< maven-source-plugin:2.2.1:jar (attach-sources) < generate-sources @ history-gui <<<
[INFO] 
[INFO] --- maven-source-plugin:2.2.1:jar (attach-sources) @ history-gui ---
[INFO] No sources in project. Archive not created.
[INFO] 
[INFO] --- maven-javadoc-plugin:2.10.3:jar (attach-javadocs) @ history-gui ---
[INFO] 
[INFO] --- maven-install-plugin:2.4:install (default-install) @ history-gui ---
[INFO] Installing /home/cibuild02/workspace/NetarchiveSuite-system-test/harvester/history-gui/target/History.war to /home/cibuild02/.m2/repository/org/netarchivesuite/history-gui/5.4-SNAPSHOT/history-gui-5.4-SNAPSHOT.war
[INFO] Installing /home/cibuild02/workspace/NetarchiveSuite-system-test/harvester/history-gui/pom.xml to /home/cibuild02/.m2/repository/org/netarchivesuite/history-gui/5.4-SNAPSHOT/history-gui-5.4-SNAPSHOT.pom
[INFO]                                                                         
[INFO] ------------------------------------------------------------------------
[INFO] Building NetarchiveSuite - harvestDefinition - webapp 5.4-SNAPSHOT
[INFO] ------------------------------------------------------------------------
[INFO] 
[INFO] --- maven-clean-plugin:2.5:clean (default-clean) @ harvestdefinition-gui ---
[INFO] 
[INFO] --- maven-resources-plugin:2.6:resources (default-resources) @ harvestdefinition-gui ---
[INFO] Using 'UTF-8' encoding to copy filtered resources.
[INFO] skip non existing resourceDirectory /home/cibuild02/workspace/NetarchiveSuite-system-test/harvester/harvestdefinition-gui/src/main/resources
[INFO] 
[INFO] --- maven-compiler-plugin:3.1:compile (default-compile) @ harvestdefinition-gui ---
[INFO] No sources to compile
[INFO] 
[INFO] --- maven-resources-plugin:2.6:testResources (default-testResources) @ harvestdefinition-gui ---
[INFO] Using 'UTF-8' encoding to copy filtered resources.
[INFO] skip non existing resourceDirectory /home/cibuild02/workspace/NetarchiveSuite-system-test/harvester/harvestdefinition-gui/src/test/resources
[INFO] 
[INFO] --- maven-compiler-plugin:3.1:testCompile (default-testCompile) @ harvestdefinition-gui ---
[INFO] No sources to compile
[INFO] 
[INFO] --- maven-surefire-plugin:2.17:test (default-test) @ harvestdefinition-gui ---
[INFO] Tests are skipped.
[INFO] 
[INFO] --- maven-jgit-buildnumber-plugin:1.2.9:extract-buildnumber (git-buildnumber) @ harvestdefinition-gui ---
[INFO] 
[INFO] --- maven-war-plugin:2.2:war (default-war) @ harvestdefinition-gui ---
[INFO] Packaging webapp
[INFO] Assembling webapp [harvestdefinition-gui] in [/home/cibuild02/workspace/NetarchiveSuite-system-test/harvester/harvestdefinition-gui/target/HarvestDefinition]
[INFO] Processing war project
[INFO] Copying webapp resources [/home/cibuild02/workspace/NetarchiveSuite-system-test/harvester/harvestdefinition-gui/src/main/webapp]
[INFO] Webapp assembled in [54 msecs]
[INFO] Building war: /home/cibuild02/workspace/NetarchiveSuite-system-test/harvester/harvestdefinition-gui/target/HarvestDefinition.war
[INFO] WEB-INF/web.xml already added, skipping
[INFO] 
[INFO] >>> maven-source-plugin:2.2.1:jar (attach-sources) > generate-sources @ harvestdefinition-gui >>>
[INFO] 
[INFO] <<< maven-source-plugin:2.2.1:jar (attach-sources) < generate-sources @ harvestdefinition-gui <<<
[INFO] 
[INFO] --- maven-source-plugin:2.2.1:jar (attach-sources) @ harvestdefinition-gui ---
[INFO] No sources in project. Archive not created.
[INFO] 
[INFO] --- maven-javadoc-plugin:2.10.3:jar (attach-javadocs) @ harvestdefinition-gui ---
[INFO] 
[INFO] --- maven-install-plugin:2.4:install (default-install) @ harvestdefinition-gui ---
[INFO] Installing /home/cibuild02/workspace/NetarchiveSuite-system-test/harvester/harvestdefinition-gui/target/HarvestDefinition.war to /home/cibuild02/.m2/repository/org/netarchivesuite/harvestdefinition-gui/5.4-SNAPSHOT/harvestdefinition-gui-5.4-SNAPSHOT.war
[INFO] Installing /home/cibuild02/workspace/NetarchiveSuite-system-test/harvester/harvestdefinition-gui/pom.xml to /home/cibuild02/.m2/repository/org/netarchivesuite/harvestdefinition-gui/5.4-SNAPSHOT/harvestdefinition-gui-5.4-SNAPSHOT.pom
[INFO]                                                                         
[INFO] ------------------------------------------------------------------------
[INFO] Building NetarchiveSuite - harvestChannel - webapp 5.4-SNAPSHOT
[INFO] ------------------------------------------------------------------------
[INFO] 
[INFO] --- maven-clean-plugin:2.5:clean (default-clean) @ harvestchannel-gui ---
[INFO] 
[INFO] --- maven-resources-plugin:2.6:resources (default-resources) @ harvestchannel-gui ---
[INFO] Using 'UTF-8' encoding to copy filtered resources.
[INFO] skip non existing resourceDirectory /home/cibuild02/workspace/NetarchiveSuite-system-test/harvester/harvestchannel-gui/src/main/resources
[INFO] 
[INFO] --- maven-compiler-plugin:3.1:compile (default-compile) @ harvestchannel-gui ---
[INFO] No sources to compile
[INFO] 
[INFO] --- maven-resources-plugin:2.6:testResources (default-testResources) @ harvestchannel-gui ---
[INFO] Using 'UTF-8' encoding to copy filtered resources.
[INFO] skip non existing resourceDirectory /home/cibuild02/workspace/NetarchiveSuite-system-test/harvester/harvestchannel-gui/src/test/resources
[INFO] 
[INFO] --- maven-compiler-plugin:3.1:testCompile (default-testCompile) @ harvestchannel-gui ---
[INFO] No sources to compile
[INFO] 
[INFO] --- maven-surefire-plugin:2.17:test (default-test) @ harvestchannel-gui ---
[INFO] Tests are skipped.
[INFO] 
[INFO] --- maven-jgit-buildnumber-plugin:1.2.9:extract-buildnumber (git-buildnumber) @ harvestchannel-gui ---
[INFO] 
[INFO] --- maven-war-plugin:2.2:war (default-war) @ harvestchannel-gui ---
[INFO] Packaging webapp
[INFO] Assembling webapp [harvestchannel-gui] in [/home/cibuild02/workspace/NetarchiveSuite-system-test/harvester/harvestchannel-gui/target/HarvestChannel]
[INFO] Processing war project
[INFO] Copying webapp resources [/home/cibuild02/workspace/NetarchiveSuite-system-test/harvester/harvestchannel-gui/src/main/webapp]
[INFO] Webapp assembled in [8 msecs]
[INFO] Building war: /home/cibuild02/workspace/NetarchiveSuite-system-test/harvester/harvestchannel-gui/target/HarvestChannel.war
[INFO] WEB-INF/web.xml already added, skipping
[INFO] 
[INFO] >>> maven-source-plugin:2.2.1:jar (attach-sources) > generate-sources @ harvestchannel-gui >>>
[INFO] 
[INFO] <<< maven-source-plugin:2.2.1:jar (attach-sources) < generate-sources @ harvestchannel-gui <<<
[INFO] 
[INFO] --- maven-source-plugin:2.2.1:jar (attach-sources) @ harvestchannel-gui ---
[INFO] No sources in project. Archive not created.
[INFO] 
[INFO] --- maven-javadoc-plugin:2.10.3:jar (attach-javadocs) @ harvestchannel-gui ---
[INFO] 
[INFO] --- maven-install-plugin:2.4:install (default-install) @ harvestchannel-gui ---
[INFO] Installing /home/cibuild02/workspace/NetarchiveSuite-system-test/harvester/harvestchannel-gui/target/HarvestChannel.war to /home/cibuild02/.m2/repository/org/netarchivesuite/harvestchannel-gui/5.4-SNAPSHOT/harvestchannel-gui-5.4-SNAPSHOT.war
[INFO] Installing /home/cibuild02/workspace/NetarchiveSuite-system-test/harvester/harvestchannel-gui/pom.xml to /home/cibuild02/.m2/repository/org/netarchivesuite/harvestchannel-gui/5.4-SNAPSHOT/harvestchannel-gui-5.4-SNAPSHOT.pom
[INFO]                                                                         
[INFO] ------------------------------------------------------------------------
[INFO] Building NetarchiveSuite - deploy - distribution 5.4-SNAPSHOT
[INFO] ------------------------------------------------------------------------
[INFO] 
[INFO] --- maven-clean-plugin:2.5:clean (default-clean) @ distribution ---
[INFO] 
[INFO] --- maven-jgit-buildnumber-plugin:1.2.9:extract-buildnumber (git-buildnumber) @ distribution ---
[INFO] 
[INFO] --- maven-assembly-plugin:2.4.1:single (distro-assembly) @ distribution ---
[INFO] Reading assembly descriptor: src/main/assembly/distribution.xml
[INFO] Building zip: /home/cibuild02/workspace/NetarchiveSuite-system-test/deploy/distribution/target/NetarchiveSuite-5.4-SNAPSHOT.zip
[INFO] 
[INFO] >>> maven-source-plugin:2.2.1:jar (attach-sources) > generate-sources @ distribution >>>
[INFO] 
[INFO] <<< maven-source-plugin:2.2.1:jar (attach-sources) < generate-sources @ distribution <<<
[INFO] 
[INFO] --- maven-source-plugin:2.2.1:jar (attach-sources) @ distribution ---
[INFO] 
[INFO] --- maven-javadoc-plugin:2.10.3:jar (attach-javadocs) @ distribution ---
[INFO] Not executing Javadoc as the project is not a Java classpath-capable package
[INFO] 
[INFO] --- maven-install-plugin:2.4:install (default-install) @ distribution ---
[INFO] Installing /home/cibuild02/workspace/NetarchiveSuite-system-test/deploy/distribution/pom.xml to /home/cibuild02/.m2/repository/org/netarchivesuite/distribution/5.4-SNAPSHOT/distribution-5.4-SNAPSHOT.pom
[INFO] Installing /home/cibuild02/workspace/NetarchiveSuite-system-test/deploy/distribution/target/NetarchiveSuite-5.4-SNAPSHOT.zip to /home/cibuild02/.m2/repository/org/netarchivesuite/distribution/5.4-SNAPSHOT/distribution-5.4-SNAPSHOT.zip
[INFO]                                                                         
[INFO] ------------------------------------------------------------------------
[INFO] Building NetarchiveSuite - deploy - test 5.4-SNAPSHOT
[INFO] ------------------------------------------------------------------------
[INFO] 
[INFO] --- maven-clean-plugin:2.5:clean (default-clean) @ deploy-test ---
[INFO] 
[INFO] --- jacoco-maven-plugin:0.7.9:prepare-agent (agent) @ deploy-test ---
[INFO] argLine set to -javaagent:/home/cibuild02/.m2/repository/org/jacoco/org.jacoco.agent/0.7.9/org.jacoco.agent-0.7.9-runtime.jar=destfile=/home/cibuild02/workspace/NetarchiveSuite-system-test/deploy/deploy-test/../target/jacoco.exec,append=true
[INFO] 
[INFO] --- maven-resources-plugin:2.6:resources (default-resources) @ deploy-test ---
[INFO] Using 'UTF-8' encoding to copy filtered resources.
[INFO] skip non existing resourceDirectory /home/cibuild02/workspace/NetarchiveSuite-system-test/deploy/deploy-test/src/main/resources
[INFO] 
[INFO] --- maven-compiler-plugin:3.1:compile (default-compile) @ deploy-test ---
[INFO] No sources to compile
[INFO] 
[INFO] --- maven-resources-plugin:2.6:testResources (default-testResources) @ deploy-test ---
[INFO] Using 'UTF-8' encoding to copy filtered resources.
[INFO] Copying 2 resources
[INFO] Copying 502 resources
[INFO] 
[INFO] --- maven-compiler-plugin:3.1:testCompile (default-testCompile) @ deploy-test ---
[INFO] Changes detected - recompiling the module!
[INFO] Compiling 11 source files to /home/cibuild02/workspace/NetarchiveSuite-system-test/deploy/deploy-test/target/test-classes
[INFO] 
[INFO] --- maven-surefire-plugin:2.17:test (default-test) @ deploy-test ---
[INFO] Tests are skipped.
[INFO] 
[INFO] --- maven-jgit-buildnumber-plugin:1.2.9:extract-buildnumber (git-buildnumber) @ deploy-test ---
[INFO] 
[INFO] --- maven-jar-plugin:2.4:jar (default-jar) @ deploy-test ---
[WARNING] JAR will be empty - no content was marked for inclusion!
[INFO] Building jar: /home/cibuild02/workspace/NetarchiveSuite-system-test/deploy/deploy-test/target/deploy-test-5.4-SNAPSHOT.jar
[INFO] 
[INFO] >>> maven-source-plugin:2.2.1:jar (attach-sources) > generate-sources @ deploy-test >>>
[INFO] 
[INFO] --- jacoco-maven-plugin:0.7.9:prepare-agent (agent) @ deploy-test ---
[INFO] argLine set to -javaagent:/home/cibuild02/.m2/repository/org/jacoco/org.jacoco.agent/0.7.9/org.jacoco.agent-0.7.9-runtime.jar=destfile=/home/cibuild02/workspace/NetarchiveSuite-system-test/deploy/deploy-test/../target/jacoco.exec,append=true
[INFO] 
[INFO] <<< maven-source-plugin:2.2.1:jar (attach-sources) < generate-sources @ deploy-test <<<
[INFO] 
[INFO] --- maven-source-plugin:2.2.1:jar (attach-sources) @ deploy-test ---
[INFO] No sources in project. Archive not created.
[INFO] 
[INFO] --- maven-javadoc-plugin:2.10.3:jar (attach-javadocs) @ deploy-test ---
[INFO] 
[INFO] --- maven-install-plugin:2.4:install (default-install) @ deploy-test ---
[INFO] Installing /home/cibuild02/workspace/NetarchiveSuite-system-test/deploy/deploy-test/target/deploy-test-5.4-SNAPSHOT.jar to /home/cibuild02/.m2/repository/org/netarchivesuite/deploy-test/5.4-SNAPSHOT/deploy-test-5.4-SNAPSHOT.jar
[INFO] Installing /home/cibuild02/workspace/NetarchiveSuite-system-test/deploy/deploy-test/pom.xml to /home/cibuild02/.m2/repository/org/netarchivesuite/deploy-test/5.4-SNAPSHOT/deploy-test-5.4-SNAPSHOT.pom
[INFO]                                                                         
[INFO] ------------------------------------------------------------------------
[INFO] Building Netarchivesuite - Heritrix3 Bundler 5.4-SNAPSHOT
[INFO] ------------------------------------------------------------------------
Downloading: https://sbforge.org/nexus/content/groups/public/is/landsbokasafn/crawl-rss/crawl-rss/0.0.1-SNAPSHOT/maven-metadata.xml
2/2 KB   
         
Downloaded: https://sbforge.org/nexus/content/groups/public/is/landsbokasafn/crawl-rss/crawl-rss/0.0.1-SNAPSHOT/maven-metadata.xml (2 KB at 2.0 KB/sec)
[INFO] 
[INFO] --- maven-clean-plugin:2.5:clean (default-clean) @ heritrix3-bundler ---
[INFO] 
[INFO] --- maven-jgit-buildnumber-plugin:1.2.9:extract-buildnumber (git-buildnumber) @ heritrix3-bundler ---
[INFO] 
[INFO] --- maven-assembly-plugin:2.4.1:single (distro-assembly) @ heritrix3-bundler ---
[INFO] Reading assembly descriptor: src/main/assembly/distribution.xml
[WARNING] The following patterns were never triggered in this artifact exclusion filter:
o  'org.eclipse.jetty:*:jar'
o  'org.eclipse.jetty.websocket:*:jar'
o  'org.eclipse.jetty.orbit:*:jar'
o  'org.glassfish:*:jar'
o  'org.glassfish.web:*:jar'
o  'javax.servlet:*:jar'
o  'org.ow2.asm:*:jar'
o  'org.apache.httpcomponents:httpclient:jar:4.2.5'
o  'org.apache.httpcomponents:httpcore:jar:4.2.4'

[INFO] Building zip: /home/cibuild02/workspace/NetarchiveSuite-system-test/harvester/heritrix3/heritrix3-bundler/target/NetarchiveSuite-heritrix3-bundler-5.4-SNAPSHOT.zip
[INFO] 
[INFO] >>> maven-source-plugin:2.2.1:jar (attach-sources) > generate-sources @ heritrix3-bundler >>>
[INFO] 
[INFO] <<< maven-source-plugin:2.2.1:jar (attach-sources) < generate-sources @ heritrix3-bundler <<<
[INFO] 
[INFO] --- maven-source-plugin:2.2.1:jar (attach-sources) @ heritrix3-bundler ---
[INFO] 
[INFO] --- maven-javadoc-plugin:2.10.3:jar (attach-javadocs) @ heritrix3-bundler ---
[INFO] Not executing Javadoc as the project is not a Java classpath-capable package
[INFO] 
[INFO] --- maven-install-plugin:2.4:install (default-install) @ heritrix3-bundler ---
[INFO] Installing /home/cibuild02/workspace/NetarchiveSuite-system-test/harvester/heritrix3/heritrix3-bundler/pom.xml to /home/cibuild02/.m2/repository/org/netarchivesuite/heritrix3-bundler/5.4-SNAPSHOT/heritrix3-bundler-5.4-SNAPSHOT.pom
[INFO] Installing /home/cibuild02/workspace/NetarchiveSuite-system-test/harvester/heritrix3/heritrix3-bundler/target/NetarchiveSuite-heritrix3-bundler-5.4-SNAPSHOT.zip to /home/cibuild02/.m2/repository/org/netarchivesuite/heritrix3-bundler/5.4-SNAPSHOT/heritrix3-bundler-5.4-SNAPSHOT.zip
[INFO]                                                                         
[INFO] ------------------------------------------------------------------------
[INFO] Building NetarchiveSuite - harvester - test 5.4-SNAPSHOT
[INFO] ------------------------------------------------------------------------
[INFO] 
[INFO] --- maven-clean-plugin:2.5:clean (default-clean) @ harvester-test ---
[INFO] 
[INFO] --- jacoco-maven-plugin:0.7.9:prepare-agent (agent) @ harvester-test ---
[INFO] argLine set to -javaagent:/home/cibuild02/.m2/repository/org/jacoco/org.jacoco.agent/0.7.9/org.jacoco.agent-0.7.9-runtime.jar=destfile=/home/cibuild02/workspace/NetarchiveSuite-system-test/harvester/harvester-test/../target/jacoco.exec,append=true
[INFO] 
[INFO] --- maven-resources-plugin:2.6:resources (default-resources) @ harvester-test ---
[INFO] Using 'UTF-8' encoding to copy filtered resources.
[INFO] skip non existing resourceDirectory /home/cibuild02/workspace/NetarchiveSuite-system-test/harvester/harvester-test/src/main/resources
[INFO] 
[INFO] --- maven-compiler-plugin:3.1:compile (default-compile) @ harvester-test ---
[INFO] No sources to compile
[INFO] 
[INFO] --- maven-resources-plugin:2.6:testResources (default-testResources) @ harvester-test ---
[INFO] Using 'UTF-8' encoding to copy filtered resources.
[INFO] Copying 13 resources
[INFO] Copying 441 resources
[INFO] 
[INFO] --- maven-compiler-plugin:3.1:testCompile (default-testCompile) @ harvester-test ---
[INFO] Changes detected - recompiling the module!
[INFO] Compiling 124 source files to /home/cibuild02/workspace/NetarchiveSuite-system-test/harvester/harvester-test/target/test-classes
[WARNING] /home/cibuild02/workspace/NetarchiveSuite-system-test/harvester/harvester-test/src/test/java/dk/netarkivet/viewerproxy/distribute/HTTPControllerServerTester.java: Some input files use or override a deprecated API.
[WARNING] /home/cibuild02/workspace/NetarchiveSuite-system-test/harvester/harvester-test/src/test/java/dk/netarkivet/viewerproxy/distribute/HTTPControllerServerTester.java: Recompile with -Xlint:deprecation for details.
[WARNING] /home/cibuild02/workspace/NetarchiveSuite-system-test/harvester/harvester-test/src/test/java/dk/netarkivet/harvester/indexserver/CombiningMultiFileBasedCacheTester.java: /home/cibuild02/workspace/NetarchiveSuite-system-test/harvester/harvester-test/src/test/java/dk/netarkivet/harvester/indexserver/CombiningMultiFileBasedCacheTester.java uses unchecked or unsafe operations.
[WARNING] /home/cibuild02/workspace/NetarchiveSuite-system-test/harvester/harvester-test/src/test/java/dk/netarkivet/harvester/indexserver/CombiningMultiFileBasedCacheTester.java: Recompile with -Xlint:unchecked for details.
[INFO] 
[INFO] --- maven-surefire-plugin:2.17:test (default-test) @ harvester-test ---
[INFO] Tests are skipped.
[INFO] 
[INFO] --- maven-jgit-buildnumber-plugin:1.2.9:extract-buildnumber (git-buildnumber) @ harvester-test ---
[INFO] 
[INFO] --- maven-jar-plugin:2.4:jar (default-jar) @ harvester-test ---
[WARNING] JAR will be empty - no content was marked for inclusion!
[INFO] Building jar: /home/cibuild02/workspace/NetarchiveSuite-system-test/harvester/harvester-test/target/harvester-test-5.4-SNAPSHOT.jar
[INFO] 
[INFO] >>> maven-source-plugin:2.2.1:jar (attach-sources) > generate-sources @ harvester-test >>>
[INFO] 
[INFO] --- jacoco-maven-plugin:0.7.9:prepare-agent (agent) @ harvester-test ---
[INFO] argLine set to -javaagent:/home/cibuild02/.m2/repository/org/jacoco/org.jacoco.agent/0.7.9/org.jacoco.agent-0.7.9-runtime.jar=destfile=/home/cibuild02/workspace/NetarchiveSuite-system-test/harvester/harvester-test/../target/jacoco.exec,append=true
[INFO] 
[INFO] <<< maven-source-plugin:2.2.1:jar (attach-sources) < generate-sources @ harvester-test <<<
[INFO] 
[INFO] --- maven-source-plugin:2.2.1:jar (attach-sources) @ harvester-test ---
[INFO] No sources in project. Archive not created.
[INFO] 
[INFO] --- maven-javadoc-plugin:2.10.3:jar (attach-javadocs) @ harvester-test ---
[INFO] 
[INFO] --- maven-install-plugin:2.4:install (default-install) @ harvester-test ---
[INFO] Installing /home/cibuild02/workspace/NetarchiveSuite-system-test/harvester/harvester-test/target/harvester-test-5.4-SNAPSHOT.jar to /home/cibuild02/.m2/repository/org/netarchivesuite/harvester-test/5.4-SNAPSHOT/harvester-test-5.4-SNAPSHOT.jar
[INFO] Installing /home/cibuild02/workspace/NetarchiveSuite-system-test/harvester/harvester-test/pom.xml to /home/cibuild02/.m2/repository/org/netarchivesuite/harvester-test/5.4-SNAPSHOT/harvester-test-5.4-SNAPSHOT.pom
[INFO]                                                                         
[INFO] ------------------------------------------------------------------------
[INFO] Building NetarchiveSuite - monitor - test 5.4-SNAPSHOT
[INFO] ------------------------------------------------------------------------
[INFO] 
[INFO] --- maven-clean-plugin:2.5:clean (default-clean) @ monitor-test ---
[INFO] 
[INFO] --- jacoco-maven-plugin:0.7.9:prepare-agent (agent) @ monitor-test ---
[INFO] argLine set to -javaagent:/home/cibuild02/.m2/repository/org/jacoco/org.jacoco.agent/0.7.9/org.jacoco.agent-0.7.9-runtime.jar=destfile=/home/cibuild02/workspace/NetarchiveSuite-system-test/monitor/monitor-test/../target/jacoco.exec,append=true
[INFO] 
[INFO] --- maven-resources-plugin:2.6:resources (default-resources) @ monitor-test ---
[INFO] Using 'UTF-8' encoding to copy filtered resources.
[INFO] skip non existing resourceDirectory /home/cibuild02/workspace/NetarchiveSuite-system-test/monitor/monitor-test/src/main/resources
[INFO] 
[INFO] --- maven-compiler-plugin:3.1:compile (default-compile) @ monitor-test ---
[INFO] No sources to compile
[INFO] 
[INFO] --- maven-resources-plugin:2.6:testResources (default-testResources) @ monitor-test ---
[INFO] Using 'UTF-8' encoding to copy filtered resources.
[INFO] Copying 1 resource
[INFO] Copying 8 resources
[INFO] 
[INFO] --- maven-compiler-plugin:3.1:testCompile (default-testCompile) @ monitor-test ---
[INFO] Changes detected - recompiling the module!
[INFO] Compiling 4 source files to /home/cibuild02/workspace/NetarchiveSuite-system-test/monitor/monitor-test/target/test-classes
[INFO] 
[INFO] --- maven-surefire-plugin:2.17:test (default-test) @ monitor-test ---
[INFO] Tests are skipped.
[INFO] 
[INFO] --- maven-jgit-buildnumber-plugin:1.2.9:extract-buildnumber (git-buildnumber) @ monitor-test ---
[INFO] 
[INFO] --- maven-jar-plugin:2.4:jar (default-jar) @ monitor-test ---
[WARNING] JAR will be empty - no content was marked for inclusion!
[INFO] Building jar: /home/cibuild02/workspace/NetarchiveSuite-system-test/monitor/monitor-test/target/monitor-test-5.4-SNAPSHOT.jar
[INFO] 
[INFO] >>> maven-source-plugin:2.2.1:jar (attach-sources) > generate-sources @ monitor-test >>>
[INFO] 
[INFO] --- jacoco-maven-plugin:0.7.9:prepare-agent (agent) @ monitor-test ---
[INFO] argLine set to -javaagent:/home/cibuild02/.m2/repository/org/jacoco/org.jacoco.agent/0.7.9/org.jacoco.agent-0.7.9-runtime.jar=destfile=/home/cibuild02/workspace/NetarchiveSuite-system-test/monitor/monitor-test/../target/jacoco.exec,append=true
[INFO] 
[INFO] <<< maven-source-plugin:2.2.1:jar (attach-sources) < generate-sources @ monitor-test <<<
[INFO] 
[INFO] --- maven-source-plugin:2.2.1:jar (attach-sources) @ monitor-test ---
[INFO] No sources in project. Archive not created.
[INFO] 
[INFO] --- maven-javadoc-plugin:2.10.3:jar (attach-javadocs) @ monitor-test ---
[INFO] 
[INFO] --- maven-install-plugin:2.4:install (default-install) @ monitor-test ---
[INFO] Installing /home/cibuild02/workspace/NetarchiveSuite-system-test/monitor/monitor-test/target/monitor-test-5.4-SNAPSHOT.jar to /home/cibuild02/.m2/repository/org/netarchivesuite/monitor-test/5.4-SNAPSHOT/monitor-test-5.4-SNAPSHOT.jar
[INFO] Installing /home/cibuild02/workspace/NetarchiveSuite-system-test/monitor/monitor-test/pom.xml to /home/cibuild02/.m2/repository/org/netarchivesuite/monitor-test/5.4-SNAPSHOT/monitor-test-5.4-SNAPSHOT.pom
[INFO]                                                                         
[INFO] ------------------------------------------------------------------------
[INFO] Building NetarchiveSuite - wayback resourceStore 5.4-SNAPSHOT
[INFO] ------------------------------------------------------------------------
[INFO] 
[INFO] --- maven-clean-plugin:2.5:clean (default-clean) @ wayback-resourcestore ---
[INFO] 
[INFO] --- jacoco-maven-plugin:0.7.9:prepare-agent (agent) @ wayback-resourcestore ---
[INFO] argLine set to -javaagent:/home/cibuild02/.m2/repository/org/jacoco/org.jacoco.agent/0.7.9/org.jacoco.agent-0.7.9-runtime.jar=destfile=/home/cibuild02/workspace/NetarchiveSuite-system-test/wayback/wayback-resourcestore/../target/jacoco.exec,append=true
[INFO] 
[INFO] --- maven-resources-plugin:2.6:resources (default-resources) @ wayback-resourcestore ---
[INFO] Using 'UTF-8' encoding to copy filtered resources.
[INFO] skip non existing resourceDirectory /home/cibuild02/workspace/NetarchiveSuite-system-test/wayback/wayback-resourcestore/src/main/resources
[INFO] 
[INFO] --- maven-compiler-plugin:3.1:compile (default-compile) @ wayback-resourcestore ---
[INFO] Changes detected - recompiling the module!
[INFO] Compiling 7 source files to /home/cibuild02/workspace/NetarchiveSuite-system-test/wayback/wayback-resourcestore/target/classes
[INFO] 
[INFO] --- maven-resources-plugin:2.6:testResources (default-testResources) @ wayback-resourcestore ---
[INFO] Using 'UTF-8' encoding to copy filtered resources.
[INFO] skip non existing resourceDirectory /home/cibuild02/workspace/NetarchiveSuite-system-test/wayback/wayback-resourcestore/src/test/resources
[INFO] 
[INFO] --- maven-compiler-plugin:3.1:testCompile (default-testCompile) @ wayback-resourcestore ---
[INFO] Changes detected - recompiling the module!
[INFO] Compiling 4 source files to /home/cibuild02/workspace/NetarchiveSuite-system-test/wayback/wayback-resourcestore/target/test-classes
[INFO] 
[INFO] --- maven-surefire-plugin:2.17:test (default-test) @ wayback-resourcestore ---
[INFO] Tests are skipped.
[INFO] 
[INFO] --- maven-jgit-buildnumber-plugin:1.2.9:extract-buildnumber (git-buildnumber) @ wayback-resourcestore ---
[INFO] 
[INFO] --- maven-jar-plugin:2.4:jar (default-jar) @ wayback-resourcestore ---
[INFO] Building jar: /home/cibuild02/workspace/NetarchiveSuite-system-test/wayback/wayback-resourcestore/target/wayback-resourcestore-5.4-SNAPSHOT.jar
[INFO] 
[INFO] >>> maven-source-plugin:2.2.1:jar (attach-sources) > generate-sources @ wayback-resourcestore >>>
[INFO] 
[INFO] --- jacoco-maven-plugin:0.7.9:prepare-agent (agent) @ wayback-resourcestore ---
[INFO] argLine set to -javaagent:/home/cibuild02/.m2/repository/org/jacoco/org.jacoco.agent/0.7.9/org.jacoco.agent-0.7.9-runtime.jar=destfile=/home/cibuild02/workspace/NetarchiveSuite-system-test/wayback/wayback-resourcestore/../target/jacoco.exec,append=true
[INFO] 
[INFO] <<< maven-source-plugin:2.2.1:jar (attach-sources) < generate-sources @ wayback-resourcestore <<<
[INFO] 
[INFO] --- maven-source-plugin:2.2.1:jar (attach-sources) @ wayback-resourcestore ---
[INFO] Building jar: /home/cibuild02/workspace/NetarchiveSuite-system-test/wayback/wayback-resourcestore/target/wayback-resourcestore-5.4-SNAPSHOT-sources.jar
[INFO] 
[INFO] --- maven-javadoc-plugin:2.10.3:jar (attach-javadocs) @ wayback-resourcestore ---
[INFO] Building jar: /home/cibuild02/workspace/NetarchiveSuite-system-test/wayback/wayback-resourcestore/target/wayback-resourcestore-5.4-SNAPSHOT-javadoc.jar
[INFO] 
[INFO] --- maven-install-plugin:2.4:install (default-install) @ wayback-resourcestore ---
[INFO] Installing /home/cibuild02/workspace/NetarchiveSuite-system-test/wayback/wayback-resourcestore/target/wayback-resourcestore-5.4-SNAPSHOT.jar to /home/cibuild02/.m2/repository/org/netarchivesuite/wayback-resourcestore/5.4-SNAPSHOT/wayback-resourcestore-5.4-SNAPSHOT.jar
[INFO] Installing /home/cibuild02/workspace/NetarchiveSuite-system-test/wayback/wayback-resourcestore/pom.xml to /home/cibuild02/.m2/repository/org/netarchivesuite/wayback-resourcestore/5.4-SNAPSHOT/wayback-resourcestore-5.4-SNAPSHOT.pom
[INFO] Installing /home/cibuild02/workspace/NetarchiveSuite-system-test/wayback/wayback-resourcestore/target/wayback-resourcestore-5.4-SNAPSHOT-sources.jar to /home/cibuild02/.m2/repository/org/netarchivesuite/wayback-resourcestore/5.4-SNAPSHOT/wayback-resourcestore-5.4-SNAPSHOT-sources.jar
[INFO] Installing /home/cibuild02/workspace/NetarchiveSuite-system-test/wayback/wayback-resourcestore/target/wayback-resourcestore-5.4-SNAPSHOT-javadoc.jar to /home/cibuild02/.m2/repository/org/netarchivesuite/wayback-resourcestore/5.4-SNAPSHOT/wayback-resourcestore-5.4-SNAPSHOT-javadoc.jar
[INFO]                                                                         
[INFO] ------------------------------------------------------------------------
[INFO] Building NetarchiveSuite - wayback - test 5.4-SNAPSHOT
[INFO] ------------------------------------------------------------------------
[INFO] 
[INFO] --- maven-clean-plugin:2.5:clean (default-clean) @ wayback-test ---
[INFO] 
[INFO] --- jacoco-maven-plugin:0.7.9:prepare-agent (agent) @ wayback-test ---
[INFO] argLine set to -javaagent:/home/cibuild02/.m2/repository/org/jacoco/org.jacoco.agent/0.7.9/org.jacoco.agent-0.7.9-runtime.jar=destfile=/home/cibuild02/workspace/NetarchiveSuite-system-test/wayback/wayback-test/../target/jacoco.exec,append=true
[INFO] 
[INFO] --- maven-resources-plugin:2.6:resources (default-resources) @ wayback-test ---
[INFO] Using 'UTF-8' encoding to copy filtered resources.
[INFO] skip non existing resourceDirectory /home/cibuild02/workspace/NetarchiveSuite-system-test/wayback/wayback-test/src/main/resources
[INFO] 
[INFO] --- maven-compiler-plugin:3.1:compile (default-compile) @ wayback-test ---
[INFO] No sources to compile
[INFO] 
[INFO] --- maven-resources-plugin:2.6:testResources (default-testResources) @ wayback-test ---
[INFO] Using 'UTF-8' encoding to copy filtered resources.
[INFO] Copying 1 resource
[INFO] Copying 28 resources
[INFO] 
[INFO] --- maven-compiler-plugin:3.1:testCompile (default-testCompile) @ wayback-test ---
[INFO] Changes detected - recompiling the module!
[INFO] Compiling 15 source files to /home/cibuild02/workspace/NetarchiveSuite-system-test/wayback/wayback-test/target/test-classes
[INFO] 
[INFO] --- maven-surefire-plugin:2.17:test (default-test) @ wayback-test ---
[INFO] Tests are skipped.
[INFO] 
[INFO] --- maven-jgit-buildnumber-plugin:1.2.9:extract-buildnumber (git-buildnumber) @ wayback-test ---
[INFO] 
[INFO] --- maven-jar-plugin:2.4:jar (default-jar) @ wayback-test ---
[WARNING] JAR will be empty - no content was marked for inclusion!
[INFO] Building jar: /home/cibuild02/workspace/NetarchiveSuite-system-test/wayback/wayback-test/target/wayback-test-5.4-SNAPSHOT.jar
[INFO] 
[INFO] >>> maven-source-plugin:2.2.1:jar (attach-sources) > generate-sources @ wayback-test >>>
[INFO] 
[INFO] --- jacoco-maven-plugin:0.7.9:prepare-agent (agent) @ wayback-test ---
[INFO] argLine set to -javaagent:/home/cibuild02/.m2/repository/org/jacoco/org.jacoco.agent/0.7.9/org.jacoco.agent-0.7.9-runtime.jar=destfile=/home/cibuild02/workspace/NetarchiveSuite-system-test/wayback/wayback-test/../target/jacoco.exec,append=true
[INFO] 
[INFO] <<< maven-source-plugin:2.2.1:jar (attach-sources) < generate-sources @ wayback-test <<<
[INFO] 
[INFO] --- maven-source-plugin:2.2.1:jar (attach-sources) @ wayback-test ---
[INFO] No sources in project. Archive not created.
[INFO] 
[INFO] --- maven-javadoc-plugin:2.10.3:jar (attach-javadocs) @ wayback-test ---
[INFO] 
[INFO] --- maven-install-plugin:2.4:install (default-install) @ wayback-test ---
[INFO] Installing /home/cibuild02/workspace/NetarchiveSuite-system-test/wayback/wayback-test/target/wayback-test-5.4-SNAPSHOT.jar to /home/cibuild02/.m2/repository/org/netarchivesuite/wayback-test/5.4-SNAPSHOT/wayback-test-5.4-SNAPSHOT.jar
[INFO] Installing /home/cibuild02/workspace/NetarchiveSuite-system-test/wayback/wayback-test/pom.xml to /home/cibuild02/.m2/repository/org/netarchivesuite/wayback-test/5.4-SNAPSHOT/wayback-test-5.4-SNAPSHOT.pom
[INFO]                                                                         
[INFO] ------------------------------------------------------------------------
[INFO] Building NetarchiveSuite - integration tests 5.4-SNAPSHOT
[INFO] ------------------------------------------------------------------------
[INFO] 
[INFO] --- maven-clean-plugin:2.5:clean (default-clean) @ integration-test ---
[INFO] 
[INFO] --- maven-jgit-buildnumber-plugin:1.2.9:extract-buildnumber (git-buildnumber) @ integration-test ---
[INFO] 
[INFO] >>> maven-source-plugin:2.2.1:jar (attach-sources) > generate-sources @ integration-test >>>
[INFO] 
[INFO] <<< maven-source-plugin:2.2.1:jar (attach-sources) < generate-sources @ integration-test <<<
[INFO] 
[INFO] --- maven-source-plugin:2.2.1:jar (attach-sources) @ integration-test ---
[INFO] 
[INFO] --- maven-javadoc-plugin:2.10.3:jar (attach-javadocs) @ integration-test ---
[INFO] Not executing Javadoc as the project is not a Java classpath-capable package
[INFO] 
[INFO] --- maven-install-plugin:2.4:install (default-install) @ integration-test ---
[INFO] Installing /home/cibuild02/workspace/NetarchiveSuite-system-test/integration-test/pom.xml to /home/cibuild02/.m2/repository/org/netarchivesuite/integration-test/5.4-SNAPSHOT/integration-test-5.4-SNAPSHOT.pom
[INFO]                                                                         
[INFO] ------------------------------------------------------------------------
[INFO] Building NetarchiveSuite System test 5.4-SNAPSHOT
[INFO] ------------------------------------------------------------------------
[INFO] 
[INFO] --- maven-clean-plugin:2.5:clean (default-clean) @ system-test ---
[INFO] 
[INFO] --- maven-resources-plugin:2.6:resources (default-resources) @ system-test ---
[INFO] Using 'UTF-8' encoding to copy filtered resources.
[INFO] skip non existing resourceDirectory /home/cibuild02/workspace/NetarchiveSuite-system-test/integration-test/system-test/src/main/resources
[INFO] 
[INFO] --- maven-compiler-plugin:3.1:compile (default-compile) @ system-test ---
[INFO] No sources to compile
[INFO] 
[INFO] --- maven-resources-plugin:2.6:testResources (default-testResources) @ system-test ---
[INFO] Using 'UTF-8' encoding to copy filtered resources.
[INFO] Copying 4 resources
[INFO] 
[INFO] --- maven-compiler-plugin:3.1:testCompile (default-testCompile) @ system-test ---
[INFO] Changes detected - recompiling the module!
[INFO] Compiling 33 source files to /home/cibuild02/workspace/NetarchiveSuite-system-test/integration-test/system-test/target/test-classes
[INFO] 
[INFO] --- maven-surefire-plugin:2.17:test (default-test) @ system-test ---
[INFO] Tests are skipped.
[INFO] 
[INFO] --- maven-jgit-buildnumber-plugin:1.2.9:extract-buildnumber (git-buildnumber) @ system-test ---
[INFO] 
[INFO] --- maven-jar-plugin:2.4:jar (default-jar) @ system-test ---
[WARNING] JAR will be empty - no content was marked for inclusion!
[INFO] Building jar: /home/cibuild02/workspace/NetarchiveSuite-system-test/integration-test/system-test/target/system-test-5.4-SNAPSHOT.jar
[INFO] 
[INFO] >>> maven-source-plugin:2.2.1:jar (attach-sources) > generate-sources @ system-test >>>
[INFO] 
[INFO] <<< maven-source-plugin:2.2.1:jar (attach-sources) < generate-sources @ system-test <<<
[INFO] 
[INFO] --- maven-source-plugin:2.2.1:jar (attach-sources) @ system-test ---
[INFO] No sources in project. Archive not created.
[INFO] 
[INFO] --- maven-javadoc-plugin:2.10.3:jar (attach-javadocs) @ system-test ---
[INFO] 
[INFO] --- maven-install-plugin:2.4:install (default-install) @ system-test ---
[INFO] Installing /home/cibuild02/workspace/NetarchiveSuite-system-test/integration-test/system-test/target/system-test-5.4-SNAPSHOT.jar to /home/cibuild02/.m2/repository/org/netarchivesuite/system-test/5.4-SNAPSHOT/system-test-5.4-SNAPSHOT.jar
[INFO] Installing /home/cibuild02/workspace/NetarchiveSuite-system-test/integration-test/system-test/pom.xml to /home/cibuild02/.m2/repository/org/netarchivesuite/system-test/5.4-SNAPSHOT/system-test-5.4-SNAPSHOT.pom
[INFO] ------------------------------------------------------------------------
[INFO] Reactor Summary:
[INFO] 
[INFO] NetarchiveSuite .................................... SUCCESS [  6.673 s]
[INFO] NetarchiveSuite - build-tools ...................... SUCCESS [  1.503 s]
[INFO] NetarchiveSuite - common ........................... SUCCESS [  0.054 s]
[INFO] NetarchiveSuite - test utils ....................... SUCCESS [  4.953 s]
[INFO] NetarchiveSuite - common - core .................... SUCCESS [ 17.629 s]
[INFO] NetarchiveSuite - common - test .................... SUCCESS [ 10.531 s]
[INFO] NetarchiveSuite - archive .......................... SUCCESS [  0.045 s]
[INFO] NetarchiveSuite - archive - core ................... SUCCESS [ 10.467 s]
[INFO] NetarchiveSuite - harvester ........................ SUCCESS [  0.033 s]
[INFO] NetarchiveSuite - harvester - heritrix1 ............ SUCCESS [  0.033 s]
[INFO] NetarchiveSuite - heritrix1 frontier ............... SUCCESS [  3.565 s]
[INFO] NetarchiveSuite - harvester - core ................. SUCCESS [ 17.139 s]
[INFO] NetarchiveSuite - archive - test ................... SUCCESS [  2.237 s]
[INFO] NetarchiveSuite - bitpreservation - webapp ......... SUCCESS [  0.988 s]
[INFO] NetarchiveSuite - heritrix1 extensions ............. SUCCESS [  5.536 s]
[INFO] NetarchiveSuite - heritrix1 controller ............. SUCCESS [  5.741 s]
[INFO] NetarchiveSuite - Harvest Scheduler ................ SUCCESS [  4.035 s]
[INFO] NetarchiveSuite - monitor .......................... SUCCESS [  0.030 s]
[INFO] NetarchiveSuite - monitor - core ................... SUCCESS [  5.216 s]
[INFO] NetarchiveSuite - wayback .......................... SUCCESS [  0.812 s]
[INFO] NetarchiveSuite - wayback - indexer ................ SUCCESS [  5.376 s]
[INFO] NetarchiveSuite - deploy ........................... SUCCESS [  0.046 s]
[INFO] NetarchiveSuite - deploy - core .................... SUCCESS [  6.449 s]
[INFO] NetarchiveSuite - harvester - heritrix3 ............ SUCCESS [  0.049 s]
[INFO] Netarchivesuite - Heritrix3 Extensions ............. SUCCESS [  8.154 s]
[INFO] NetarchiveSuite - heritrix3 controller ............. SUCCESS [  5.417 s]
[INFO] NetarchiveSuite - Status - Webapp .................. SUCCESS [  0.229 s]
[INFO] NetarchiveSuite - qa - webapp ...................... SUCCESS [  0.120 s]
[INFO] NetarchiveSuite - history - webapp ................. SUCCESS [  0.228 s]
[INFO] NetarchiveSuite - harvestDefinition - webapp ....... SUCCESS [  0.374 s]
[INFO] NetarchiveSuite - harvestChannel - webapp .......... SUCCESS [  0.083 s]
[INFO] NetarchiveSuite - deploy - distribution ............ SUCCESS [ 20.453 s]
[INFO] NetarchiveSuite - deploy - test .................... SUCCESS [  2.593 s]
[INFO] Netarchivesuite - Heritrix3 Bundler ................ SUCCESS [ 16.209 s]
[INFO] NetarchiveSuite - harvester - test ................. SUCCESS [  4.694 s]
[INFO] NetarchiveSuite - monitor - test ................... SUCCESS [  0.376 s]
[INFO] NetarchiveSuite - wayback resourceStore ............ SUCCESS [  3.607 s]
[INFO] NetarchiveSuite - wayback - test ................... SUCCESS [  0.923 s]
[INFO] NetarchiveSuite - integration tests ................ SUCCESS [  0.039 s]
[INFO] NetarchiveSuite System test ........................ SUCCESS [  1.260 s]
[INFO] ------------------------------------------------------------------------
[INFO] BUILD SUCCESS
[INFO] ------------------------------------------------------------------------
[INFO] Total time: 02:55 min
[INFO] Finished at: 2017-10-07T00:03:21+02:00
[INFO] Final Memory: 94M/224M
[INFO] ------------------------------------------------------------------------
+ scp ./deploy/distribution/target/NetarchiveSuite-5.4-SNAPSHOT.zip devel@kb-prod-udv-001.kb.dk:nas_versions/NetarchiveSuite-SystemTest.zip
+ scp ./harvester/heritrix3/heritrix3-bundler/target/NetarchiveSuite-heritrix3-bundler-5.4-SNAPSHOT.zip devel@kb-prod-udv-001.kb.dk:nas_versions/bundler/NetarchiveSuite-heritrix3-bundler-systemtest.zip
Parsing POMs
Established TCP socket on 43623
maven32-agent.jar already up to date
maven32-interceptor.jar already up to date
maven3-interceptor-commons.jar already up to date
[NetarchiveSuite-system-test] $ /home/cibuild02/tools/hudson.model.JDK/Java8/bin/java -Dmaven.test.failure.ignore=false -cp /home/cibuild02/maven32-agent.jar:/home/cibuild02/tools/hudson.tasks.Maven_MavenInstallation/Maven3.2/boot/plexus-classworlds-2.5.2.jar:/home/cibuild02/tools/hudson.tasks.Maven_MavenInstallation/Maven3.2/conf/logging jenkins.maven3.agent.Maven32Main /home/cibuild02/tools/hudson.tasks.Maven_MavenInstallation/Maven3.2 /home/cibuild02/slave.jar /home/cibuild02/maven32-interceptor.jar /home/cibuild02/maven3-interceptor-commons.jar 43623
<===[JENKINS REMOTING CAPACITY]===>channel started
Executing Maven:  -B -f /home/cibuild02/workspace/NetarchiveSuite-system-test/pom.xml clean integration-test -PsystemTest -rf :system-test -Dorg.slf4j.simpleLogger.defaultloglevel=info -Dsystemtest.h3zip=/home/devel/nas_versions/bundler/NetarchiveSuite-heritrix3-bundler-systemtest.zip -Dsystemtest.mailreceivers=csr@statsbiblioteket.dk
[INFO] Scanning for projects...
[WARNING] 
[WARNING] Some problems were encountered while building the effective model for org.netarchivesuite:build-tools:jar:5.4-SNAPSHOT
[WARNING] 'dependencyManagement.dependencies.dependency.(groupId:artifactId:type:classifier)' must be unique: javax.inject:javax.inject:jar -> duplicate declaration of version ${javax.inject.version} @ org.netarchivesuite:netarchivesuite:5.4-SNAPSHOT, /home/cibuild02/workspace/NetarchiveSuite-system-test/pom.xml, line 750, column 19
[WARNING] 
[WARNING] Some problems were encountered while building the effective model for org.netarchivesuite:archive-core:jar:5.4-SNAPSHOT
[WARNING] 'dependencyManagement.dependencies.dependency.(groupId:artifactId:type:classifier)' must be unique: javax.inject:javax.inject:jar -> duplicate declaration of version ${javax.inject.version} @ org.netarchivesuite:netarchivesuite:5.4-SNAPSHOT, /home/cibuild02/workspace/NetarchiveSuite-system-test/pom.xml, line 750, column 19
[WARNING] 
[WARNING] Some problems were encountered while building the effective model for org.netarchivesuite:archive-test:jar:5.4-SNAPSHOT
[WARNING] 'dependencyManagement.dependencies.dependency.(groupId:artifactId:type:classifier)' must be unique: javax.inject:javax.inject:jar -> duplicate declaration of version ${javax.inject.version} @ org.netarchivesuite:netarchivesuite:5.4-SNAPSHOT, /home/cibuild02/workspace/NetarchiveSuite-system-test/pom.xml, line 750, column 19
[WARNING] 
[WARNING] Some problems were encountered while building the effective model for org.netarchivesuite:bitpreservation-gui:war:5.4-SNAPSHOT
[WARNING] 'dependencyManagement.dependencies.dependency.(groupId:artifactId:type:classifier)' must be unique: javax.inject:javax.inject:jar -> duplicate declaration of version ${javax.inject.version} @ org.netarchivesuite:netarchivesuite:5.4-SNAPSHOT, /home/cibuild02/workspace/NetarchiveSuite-system-test/pom.xml, line 750, column 19
[WARNING] 
[WARNING] Some problems were encountered while building the effective model for org.netarchivesuite:archive:pom:5.4-SNAPSHOT
[WARNING] 'dependencyManagement.dependencies.dependency.(groupId:artifactId:type:classifier)' must be unique: javax.inject:javax.inject:jar -> duplicate declaration of version ${javax.inject.version} @ org.netarchivesuite:netarchivesuite:5.4-SNAPSHOT, /home/cibuild02/workspace/NetarchiveSuite-system-test/pom.xml, line 750, column 19
[WARNING] 
[WARNING] Some problems were encountered while building the effective model for org.netarchivesuite:netarchivesuite-test-utils:jar:5.4-SNAPSHOT
[WARNING] 'dependencyManagement.dependencies.dependency.(groupId:artifactId:type:classifier)' must be unique: javax.inject:javax.inject:jar -> duplicate declaration of version ${javax.inject.version} @ org.netarchivesuite:netarchivesuite:5.4-SNAPSHOT, /home/cibuild02/workspace/NetarchiveSuite-system-test/pom.xml, line 750, column 19
[WARNING] 
[WARNING] Some problems were encountered while building the effective model for org.netarchivesuite:common-core:jar:5.4-SNAPSHOT
[WARNING] 'dependencyManagement.dependencies.dependency.(groupId:artifactId:type:classifier)' must be unique: javax.inject:javax.inject:jar -> duplicate declaration of version ${javax.inject.version} @ org.netarchivesuite:netarchivesuite:5.4-SNAPSHOT, /home/cibuild02/workspace/NetarchiveSuite-system-test/pom.xml, line 750, column 19
[WARNING] 
[WARNING] Some problems were encountered while building the effective model for org.netarchivesuite:common-test:jar:5.4-SNAPSHOT
[WARNING] 'dependencyManagement.dependencies.dependency.(groupId:artifactId:type:classifier)' must be unique: javax.inject:javax.inject:jar -> duplicate declaration of version ${javax.inject.version} @ org.netarchivesuite:netarchivesuite:5.4-SNAPSHOT, /home/cibuild02/workspace/NetarchiveSuite-system-test/pom.xml, line 750, column 19
[WARNING] 
[WARNING] Some problems were encountered while building the effective model for org.netarchivesuite:common:pom:5.4-SNAPSHOT
[WARNING] 'dependencyManagement.dependencies.dependency.(groupId:artifactId:type:classifier)' must be unique: javax.inject:javax.inject:jar -> duplicate declaration of version ${javax.inject.version} @ org.netarchivesuite:netarchivesuite:5.4-SNAPSHOT, /home/cibuild02/workspace/NetarchiveSuite-system-test/pom.xml, line 750, column 19
[WARNING] 
[WARNING] Some problems were encountered while building the effective model for org.netarchivesuite:deploy-core:jar:5.4-SNAPSHOT
[WARNING] 'dependencyManagement.dependencies.dependency.(groupId:artifactId:type:classifier)' must be unique: javax.inject:javax.inject:jar -> duplicate declaration of version ${javax.inject.version} @ org.netarchivesuite:netarchivesuite:5.4-SNAPSHOT, /home/cibuild02/workspace/NetarchiveSuite-system-test/pom.xml, line 750, column 19
[WARNING] 
[WARNING] Some problems were encountered while building the effective model for org.netarchivesuite:distribution:pom:5.4-SNAPSHOT
[WARNING] 'dependencyManagement.dependencies.dependency.(groupId:artifactId:type:classifier)' must be unique: javax.inject:javax.inject:jar -> duplicate declaration of version ${javax.inject.version} @ org.netarchivesuite:netarchivesuite:5.4-SNAPSHOT, /home/cibuild02/workspace/NetarchiveSuite-system-test/pom.xml, line 750, column 19
[WARNING] 
[WARNING] Some problems were encountered while building the effective model for org.netarchivesuite:deploy-test:jar:5.4-SNAPSHOT
[WARNING] 'dependencyManagement.dependencies.dependency.(groupId:artifactId:type:classifier)' must be unique: javax.inject:javax.inject:jar -> duplicate declaration of version ${javax.inject.version} @ org.netarchivesuite:netarchivesuite:5.4-SNAPSHOT, /home/cibuild02/workspace/NetarchiveSuite-system-test/pom.xml, line 750, column 19
[WARNING] 
[WARNING] Some problems were encountered while building the effective model for org.netarchivesuite:deploy:pom:5.4-SNAPSHOT
[WARNING] 'dependencyManagement.dependencies.dependency.(groupId:artifactId:type:classifier)' must be unique: javax.inject:javax.inject:jar -> duplicate declaration of version ${javax.inject.version} @ org.netarchivesuite:netarchivesuite:5.4-SNAPSHOT, /home/cibuild02/workspace/NetarchiveSuite-system-test/pom.xml, line 750, column 19
[WARNING] 
[WARNING] Some problems were encountered while building the effective model for org.netarchivesuite:harvester-core:jar:5.4-SNAPSHOT
[WARNING] 'dependencyManagement.dependencies.dependency.(groupId:artifactId:type:classifier)' must be unique: javax.inject:javax.inject:jar -> duplicate declaration of version ${javax.inject.version} @ org.netarchivesuite:netarchivesuite:5.4-SNAPSHOT, /home/cibuild02/workspace/NetarchiveSuite-system-test/pom.xml, line 750, column 19
[WARNING] 
[WARNING] Some problems were encountered while building the effective model for org.netarchivesuite:heritrix1-extensions:jar:5.4-SNAPSHOT
[WARNING] 'dependencyManagement.dependencies.dependency.(groupId:artifactId:type:classifier)' must be unique: javax.inject:javax.inject:jar -> duplicate declaration of version ${javax.inject.version} @ org.netarchivesuite:netarchivesuite:5.4-SNAPSHOT, /home/cibuild02/workspace/NetarchiveSuite-system-test/pom.xml, line 750, column 19
[WARNING] 
[WARNING] Some problems were encountered while building the effective model for org.netarchivesuite:heritrix1-frontier:jar:5.4-SNAPSHOT
[WARNING] 'dependencyManagement.dependencies.dependency.(groupId:artifactId:type:classifier)' must be unique: javax.inject:javax.inject:jar -> duplicate declaration of version ${javax.inject.version} @ org.netarchivesuite:netarchivesuite:5.4-SNAPSHOT, /home/cibuild02/workspace/NetarchiveSuite-system-test/pom.xml, line 750, column 19
[WARNING] 
[WARNING] Some problems were encountered while building the effective model for org.netarchivesuite:heritrix1-controller:jar:5.4-SNAPSHOT
[WARNING] 'dependencyManagement.dependencies.dependency.(groupId:artifactId:type:classifier)' must be unique: javax.inject:javax.inject:jar -> duplicate declaration of version ${javax.inject.version} @ org.netarchivesuite:netarchivesuite:5.4-SNAPSHOT, /home/cibuild02/workspace/NetarchiveSuite-system-test/pom.xml, line 750, column 19
[WARNING] 
[WARNING] Some problems were encountered while building the effective model for org.netarchivesuite:heritrix1:pom:5.4-SNAPSHOT
[WARNING] 'dependencyManagement.dependencies.dependency.(groupId:artifactId:type:classifier)' must be unique: javax.inject:javax.inject:jar -> duplicate declaration of version ${javax.inject.version} @ org.netarchivesuite:netarchivesuite:5.4-SNAPSHOT, /home/cibuild02/workspace/NetarchiveSuite-system-test/pom.xml, line 750, column 19
[WARNING] 
[WARNING] Some problems were encountered while building the effective model for org.netarchivesuite:heritrix3-extensions:jar:5.4-SNAPSHOT
[WARNING] 'dependencyManagement.dependencies.dependency.(groupId:artifactId:type:classifier)' must be unique: javax.inject:javax.inject:jar -> duplicate declaration of version ${javax.inject.version} @ org.netarchivesuite:netarchivesuite:5.4-SNAPSHOT, /home/cibuild02/workspace/NetarchiveSuite-system-test/pom.xml, line 750, column 19
[WARNING] 
[WARNING] Some problems were encountered while building the effective model for org.netarchivesuite:heritrix3-bundler:pom:5.4-SNAPSHOT
[WARNING] 'dependencyManagement.dependencies.dependency.(groupId:artifactId:type:classifier)' must be unique: javax.inject:javax.inject:jar -> duplicate declaration of version ${javax.inject.version} @ org.netarchivesuite:netarchivesuite:5.4-SNAPSHOT, /home/cibuild02/workspace/NetarchiveSuite-system-test/pom.xml, line 750, column 19
[WARNING] 
[WARNING] Some problems were encountered while building the effective model for org.netarchivesuite:heritrix3-controller:jar:5.4-SNAPSHOT
[WARNING] 'dependencyManagement.dependencies.dependency.(groupId:artifactId:type:classifier)' must be unique: javax.inject:javax.inject:jar -> duplicate declaration of version ${javax.inject.version} @ org.netarchivesuite:netarchivesuite:5.4-SNAPSHOT, /home/cibuild02/workspace/NetarchiveSuite-system-test/pom.xml, line 750, column 19
[WARNING] 
[WARNING] Some problems were encountered while building the effective model for org.netarchivesuite:heritrix3:pom:5.4-SNAPSHOT
[WARNING] 'dependencyManagement.dependencies.dependency.(groupId:artifactId:type:classifier)' must be unique: javax.inject:javax.inject:jar -> duplicate declaration of version ${javax.inject.version} @ org.netarchivesuite:netarchivesuite:5.4-SNAPSHOT, /home/cibuild02/workspace/NetarchiveSuite-system-test/pom.xml, line 750, column 19
[WARNING] 
[WARNING] Some problems were encountered while building the effective model for org.netarchivesuite:harvest-scheduler:jar:5.4-SNAPSHOT
[WARNING] 'dependencyManagement.dependencies.dependency.(groupId:artifactId:type:classifier)' must be unique: javax.inject:javax.inject:jar -> duplicate declaration of version ${javax.inject.version} @ org.netarchivesuite:netarchivesuite:5.4-SNAPSHOT, /home/cibuild02/workspace/NetarchiveSuite-system-test/pom.xml, line 750, column 19
[WARNING] 
[WARNING] Some problems were encountered while building the effective model for org.netarchivesuite:harvestchannel-gui:war:5.4-SNAPSHOT
[WARNING] 'dependencyManagement.dependencies.dependency.(groupId:artifactId:type:classifier)' must be unique: javax.inject:javax.inject:jar -> duplicate declaration of version ${javax.inject.version} @ org.netarchivesuite:netarchivesuite:5.4-SNAPSHOT, /home/cibuild02/workspace/NetarchiveSuite-system-test/pom.xml, line 750, column 19
[WARNING] 
[WARNING] Some problems were encountered while building the effective model for org.netarchivesuite:harvestdefinition-gui:war:5.4-SNAPSHOT
[WARNING] 'dependencyManagement.dependencies.dependency.(groupId:artifactId:type:classifier)' must be unique: javax.inject:javax.inject:jar -> duplicate declaration of version ${javax.inject.version} @ org.netarchivesuite:netarchivesuite:5.4-SNAPSHOT, /home/cibuild02/workspace/NetarchiveSuite-system-test/pom.xml, line 750, column 19
[WARNING] 
[WARNING] Some problems were encountered while building the effective model for org.netarchivesuite:history-gui:war:5.4-SNAPSHOT
[WARNING] 'dependencyManagement.dependencies.dependency.(groupId:artifactId:type:classifier)' must be unique: javax.inject:javax.inject:jar -> duplicate declaration of version ${javax.inject.version} @ org.netarchivesuite:netarchivesuite:5.4-SNAPSHOT, /home/cibuild02/workspace/NetarchiveSuite-system-test/pom.xml, line 750, column 19
[WARNING] 
[WARNING] Some problems were encountered while building the effective model for org.netarchivesuite:qa-gui:war:5.4-SNAPSHOT
[WARNING] 'dependencyManagement.dependencies.dependency.(groupId:artifactId:type:classifier)' must be unique: javax.inject:javax.inject:jar -> duplicate declaration of version ${javax.inject.version} @ org.netarchivesuite:netarchivesuite:5.4-SNAPSHOT, /home/cibuild02/workspace/NetarchiveSuite-system-test/pom.xml, line 750, column 19
[WARNING] 
[WARNING] Some problems were encountered while building the effective model for org.netarchivesuite:harvester-test:jar:5.4-SNAPSHOT
[WARNING] 'dependencyManagement.dependencies.dependency.(groupId:artifactId:type:classifier)' must be unique: javax.inject:javax.inject:jar -> duplicate declaration of version ${javax.inject.version} @ org.netarchivesuite:netarchivesuite:5.4-SNAPSHOT, /home/cibuild02/workspace/NetarchiveSuite-system-test/pom.xml, line 750, column 19
[WARNING] 
[WARNING] Some problems were encountered while building the effective model for org.netarchivesuite:harvester:pom:5.4-SNAPSHOT
[WARNING] 'dependencyManagement.dependencies.dependency.(groupId:artifactId:type:classifier)' must be unique: javax.inject:javax.inject:jar -> duplicate declaration of version ${javax.inject.version} @ org.netarchivesuite:netarchivesuite:5.4-SNAPSHOT, /home/cibuild02/workspace/NetarchiveSuite-system-test/pom.xml, line 750, column 19
[WARNING] 
[WARNING] Some problems were encountered while building the effective model for org.netarchivesuite:monitor-core:jar:5.4-SNAPSHOT
[WARNING] 'dependencyManagement.dependencies.dependency.(groupId:artifactId:type:classifier)' must be unique: javax.inject:javax.inject:jar -> duplicate declaration of version ${javax.inject.version} @ org.netarchivesuite:netarchivesuite:5.4-SNAPSHOT, /home/cibuild02/workspace/NetarchiveSuite-system-test/pom.xml, line 750, column 19
[WARNING] 
[WARNING] Some problems were encountered while building the effective model for org.netarchivesuite:monitor-test:jar:5.4-SNAPSHOT
[WARNING] 'dependencyManagement.dependencies.dependency.(groupId:artifactId:type:classifier)' must be unique: javax.inject:javax.inject:jar -> duplicate declaration of version ${javax.inject.version} @ org.netarchivesuite:netarchivesuite:5.4-SNAPSHOT, /home/cibuild02/workspace/NetarchiveSuite-system-test/pom.xml, line 750, column 19
[WARNING] 
[WARNING] Some problems were encountered while building the effective model for org.netarchivesuite:status-gui:war:5.4-SNAPSHOT
[WARNING] 'dependencyManagement.dependencies.dependency.(groupId:artifactId:type:classifier)' must be unique: javax.inject:javax.inject:jar -> duplicate declaration of version ${javax.inject.version} @ org.netarchivesuite:netarchivesuite:5.4-SNAPSHOT, /home/cibuild02/workspace/NetarchiveSuite-system-test/pom.xml, line 750, column 19
[WARNING] 
[WARNING] Some problems were encountered while building the effective model for org.netarchivesuite:monitor:pom:5.4-SNAPSHOT
[WARNING] 'dependencyManagement.dependencies.dependency.(groupId:artifactId:type:classifier)' must be unique: javax.inject:javax.inject:jar -> duplicate declaration of version ${javax.inject.version} @ org.netarchivesuite:netarchivesuite:5.4-SNAPSHOT, /home/cibuild02/workspace/NetarchiveSuite-system-test/pom.xml, line 750, column 19
[WARNING] 
[WARNING] Some problems were encountered while building the effective model for org.netarchivesuite:wayback-indexer:jar:5.4-SNAPSHOT
[WARNING] 'dependencyManagement.dependencies.dependency.(groupId:artifactId:type:classifier)' must be unique: javax.inject:javax.inject:jar -> duplicate declaration of version ${javax.inject.version} @ org.netarchivesuite:netarchivesuite:5.4-SNAPSHOT, /home/cibuild02/workspace/NetarchiveSuite-system-test/pom.xml, line 750, column 19
[WARNING] 
[WARNING] Some problems were encountered while building the effective model for org.netarchivesuite:wayback-resourcestore:jar:5.4-SNAPSHOT
[WARNING] 'dependencyManagement.dependencies.dependency.(groupId:artifactId:type:classifier)' must be unique: javax.inject:javax.inject:jar -> duplicate declaration of version ${javax.inject.version} @ org.netarchivesuite:netarchivesuite:5.4-SNAPSHOT, /home/cibuild02/workspace/NetarchiveSuite-system-test/pom.xml, line 750, column 19
[WARNING] 
[WARNING] Some problems were encountered while building the effective model for org.netarchivesuite:wayback-test:jar:5.4-SNAPSHOT
[WARNING] 'dependencyManagement.dependencies.dependency.(groupId:artifactId:type:classifier)' must be unique: javax.inject:javax.inject:jar -> duplicate declaration of version ${javax.inject.version} @ org.netarchivesuite:netarchivesuite:5.4-SNAPSHOT, /home/cibuild02/workspace/NetarchiveSuite-system-test/pom.xml, line 750, column 19
[WARNING] 
[WARNING] Some problems were encountered while building the effective model for org.netarchivesuite:wayback:pom:5.4-SNAPSHOT
[WARNING] 'dependencyManagement.dependencies.dependency.(groupId:artifactId:type:classifier)' must be unique: javax.inject:javax.inject:jar -> duplicate declaration of version ${javax.inject.version} @ org.netarchivesuite:netarchivesuite:5.4-SNAPSHOT, /home/cibuild02/workspace/NetarchiveSuite-system-test/pom.xml, line 750, column 19
[WARNING] 
[WARNING] Some problems were encountered while building the effective model for org.netarchivesuite:system-test:jar:5.4-SNAPSHOT
[WARNING] 'dependencyManagement.dependencies.dependency.(groupId:artifactId:type:classifier)' must be unique: javax.inject:javax.inject:jar -> duplicate declaration of version ${javax.inject.version} @ org.netarchivesuite:netarchivesuite:5.4-SNAPSHOT, /home/cibuild02/workspace/NetarchiveSuite-system-test/pom.xml, line 750, column 19
[WARNING] 
[WARNING] Some problems were encountered while building the effective model for org.netarchivesuite:integration-test:pom:5.4-SNAPSHOT
[WARNING] 'dependencyManagement.dependencies.dependency.(groupId:artifactId:type:classifier)' must be unique: javax.inject:javax.inject:jar -> duplicate declaration of version ${javax.inject.version} @ org.netarchivesuite:netarchivesuite:5.4-SNAPSHOT, /home/cibuild02/workspace/NetarchiveSuite-system-test/pom.xml, line 750, column 19
[WARNING] 
[WARNING] Some problems were encountered while building the effective model for org.netarchivesuite:netarchivesuite:pom:5.4-SNAPSHOT
[WARNING] 'dependencyManagement.dependencies.dependency.(groupId:artifactId:type:classifier)' must be unique: javax.inject:javax.inject:jar -> duplicate declaration of version ${javax.inject.version} @ line 750, column 19
[WARNING] 
[WARNING] It is highly recommended to fix these problems because they threaten the stability of your build.
[WARNING] 
[WARNING] For this reason, future Maven versions might no longer support building such malformed projects.
[WARNING] 
[INFO]                                                                         
[INFO] ------------------------------------------------------------------------
[INFO] Building NetarchiveSuite System test 5.4-SNAPSHOT
[INFO] ------------------------------------------------------------------------
[INFO] 
[INFO] --- maven-clean-plugin:2.5:clean (default-clean) @ system-test ---
[INFO] Deleting /home/cibuild02/workspace/NetarchiveSuite-system-test/integration-test/system-test/target
[INFO] 
[INFO] --- maven-resources-plugin:2.6:resources (default-resources) @ system-test ---
[INFO] Using 'UTF-8' encoding to copy filtered resources.
[INFO] skip non existing resourceDirectory /home/cibuild02/workspace/NetarchiveSuite-system-test/integration-test/system-test/src/main/resources
[INFO] 
[INFO] --- maven-compiler-plugin:3.1:compile (default-compile) @ system-test ---
[INFO] No sources to compile
[INFO] 
[INFO] --- maven-resources-plugin:2.6:testResources (default-testResources) @ system-test ---
[INFO] Using 'UTF-8' encoding to copy filtered resources.
[INFO] Copying 4 resources
[INFO] 
[INFO] --- maven-compiler-plugin:3.1:testCompile (default-testCompile) @ system-test ---
[INFO] Changes detected - recompiling the module!
[INFO] Compiling 33 source files to /home/cibuild02/workspace/NetarchiveSuite-system-test/integration-test/system-test/target/test-classes
[INFO] 
[INFO] --- maven-surefire-plugin:2.17:test (default-test) @ system-test ---
[INFO] Tests are skipped.
[INFO] 
[INFO] --- maven-jgit-buildnumber-plugin:1.2.9:extract-buildnumber (git-buildnumber) @ system-test ---
[INFO] Cannot extract Git info, maybe custom build with 'pl' argument is running
[INFO] 
[INFO] --- maven-jar-plugin:2.4:jar (default-jar) @ system-test ---
[WARNING] JAR will be empty - no content was marked for inclusion!
[INFO] Building jar: /home/cibuild02/workspace/NetarchiveSuite-system-test/integration-test/system-test/target/system-test-5.4-SNAPSHOT.jar
[INFO] 
[INFO] --- maven-dependency-plugin:2.8:copy (copy-distribution-zip) @ system-test ---
[INFO] Configured Artifact: org.netarchivesuite:distribution:5.4-SNAPSHOT:zip
[INFO] Copying distribution-5.4-SNAPSHOT.zip to /home/cibuild02/workspace/NetarchiveSuite-system-test/integration-test/system-test/target/NetarchiveSuite-SystemTest.zip
[INFO] 
[INFO] --- maven-antrun-plugin:1.8:run (default) @ system-test ---
[INFO] Executing tasks

main:

deploy2test:
      [scp] Connecting to kb-prod-udv-001.kb.dk:22
      [scp] done.
[INFO] Executed tasks
[INFO] 
[INFO] --- maven-surefire-plugin:2.17:test (surefire-it) @ system-test ---
[INFO] Surefire report directory: /home/cibuild02/workspace/NetarchiveSuite-system-test/integration-test/system-test/target/surefire-reports

-------------------------------------------------------
 T E S T S
-------------------------------------------------------
Running TestSuite
[main] INFO org.jaccept.TestEventManager - Loading properties from file:/home/cibuild02/workspace/NetarchiveSuite-system-test/integration-test/system-test/target/test-classes/jaccept.properties
[main] INFO org.jaccept.TestEventManager - Adding clients: org.jaccept.StdOutLogger
[main] INFO org.jaccept.TestEventManager - Adding JAccept client org.jaccept.StdOutLogger
Starting test project NetarchiveSuite System test
  Suite: Full Functional Acceptance Test
[main] INFO dk.netarkivet.systemtest.environment.TestEnvironmentController - Running JSch command (on null): RemoteCommand 
	source /etc/bashrc;source /etc/profile;source ~/.bash_profile;true;export PORT=8071;export MAILRECEIVERS=csr@statsbiblioteket.dk;export TESTX=SystemTest;true;export H3ZIP=/home/devel/nas_versions/bundler/NetarchiveSuite-heritrix3-bundler-systemtest.zip;
	all_test.sh
[main] WARN dk.netarkivet.systemtest.environment.TestEnvironmentController - ssh error: The system cannot find the path specified.
[main] WARN dk.netarkivet.systemtest.environment.TestEnvironmentController - ssh error: The system cannot find the path specified.
[main] WARN dk.netarkivet.systemtest.environment.TestEnvironmentController - ssh error: The system cannot find the path specified.
[main] WARN dk.netarkivet.systemtest.environment.TestEnvironmentController - ssh error: The system cannot find the path specified.
[main] WARN dk.netarkivet.systemtest.environment.TestEnvironmentController - ssh error: The system cannot find the file specified.
[main] WARN dk.netarkivet.systemtest.environment.TestEnvironmentController - ssh error: The system cannot find the path specified.
[main] WARN dk.netarkivet.systemtest.environment.TestEnvironmentController - ssh error: The volume does not contain a recognized file system.
[main] WARN dk.netarkivet.systemtest.environment.TestEnvironmentController - ssh error: Please make sure that all required file system drivers are loaded and that the volume is not corrupted.
[main] WARN dk.netarkivet.systemtest.environment.TestEnvironmentController - ssh error: The system cannot find the file specified.
[main] WARN dk.netarkivet.systemtest.environment.TestEnvironmentController - ssh error: The system cannot find the file specified.
[main] WARN dk.netarkivet.systemtest.environment.TestEnvironmentController - ssh error: 'unzip.exe' is not recognized as an internal or external command,
[main] WARN dk.netarkivet.systemtest.environment.TestEnvironmentController - ssh error: operable program or batch file.
[main] WARN dk.netarkivet.systemtest.environment.TestEnvironmentController - ssh error: The system cannot find the path specified.
[main] WARN dk.netarkivet.systemtest.environment.TestEnvironmentController - ssh error: scp: SystemTest\conf\: Not a directory.
[main] WARN dk.netarkivet.systemtest.environment.TestEnvironmentController - ssh error: The system cannot find the path specified.
[main] WARN dk.netarkivet.systemtest.environment.TestEnvironmentController - ssh error: The system cannot find the path specified.
[main] WARN dk.netarkivet.systemtest.environment.TestEnvironmentController - ssh error: DEBUG:  transaction ID wrap limit is 2257721481, limited by database "test2056_harvestdb"
[main] WARN dk.netarkivet.systemtest.environment.TestEnvironmentController - ssh error: DEBUG:  transaction ID wrap limit is 2257721481, limited by database "test2056_harvestdb"
[main] WARN dk.netarkivet.systemtest.environment.TestEnvironmentController - ssh error: NOTICE:  CREATE TABLE / PRIMARY KEY will create implicit index "replica_pkey" for table "replica"
[main] WARN dk.netarkivet.systemtest.environment.TestEnvironmentController - ssh error: NOTICE:  CREATE TABLE / UNIQUE will create implicit index "replica_replica_id_key" for table "replica"
[main] WARN dk.netarkivet.systemtest.environment.TestEnvironmentController - ssh error: NOTICE:  CREATE TABLE / UNIQUE will create implicit index "replica_replica_name_key" for table "replica"
[main] WARN dk.netarkivet.systemtest.environment.TestEnvironmentController - ssh error: NOTICE:  CREATE TABLE / PRIMARY KEY will create implicit index "replicafileinfo_pkey" for table "replicafileinfo"
[main] WARN dk.netarkivet.systemtest.environment.TestEnvironmentController - ssh error: NOTICE:  CREATE TABLE / PRIMARY KEY will create implicit index "file_pkey" for table "file"
[main] WARN dk.netarkivet.systemtest.environment.TestEnvironmentController - ssh error: NOTICE:  CREATE TABLE / PRIMARY KEY will create implicit index "segment_pkey" for table "segment"
[main] WARN dk.netarkivet.systemtest.environment.TestEnvironmentController - ssh error: DEBUG:  transaction ID wrap limit is 2257721481, limited by database "test2056_harvestdb"
[main] WARN dk.netarkivet.systemtest.environment.TestEnvironmentController - ssh error: DEBUG:  transaction ID wrap limit is 2257721481, limited by database "test2056_harvestdb"
[main] WARN dk.netarkivet.systemtest.environment.TestEnvironmentController - ssh error: NOTICE:  CREATE TABLE / PRIMARY KEY will create implicit index "domains_pkey" for table "domains"
[main] WARN dk.netarkivet.systemtest.environment.TestEnvironmentController - ssh error: NOTICE:  CREATE TABLE / UNIQUE will create implicit index "domains_name_key" for table "domains"
[main] WARN dk.netarkivet.systemtest.environment.TestEnvironmentController - ssh error: NOTICE:  CREATE TABLE / PRIMARY KEY will create implicit index "configurations_pkey" for table "configurations"
[main] WARN dk.netarkivet.systemtest.environment.TestEnvironmentController - ssh error: NOTICE:  CREATE TABLE / PRIMARY KEY will create implicit index "config_passwords_pkey" for table "config_passwords"
[main] WARN dk.netarkivet.systemtest.environment.TestEnvironmentController - ssh error: NOTICE:  CREATE TABLE / PRIMARY KEY will create implicit index "config_seedlists_pkey" for table "config_seedlists"
[main] WARN dk.netarkivet.systemtest.environment.TestEnvironmentController - ssh error: NOTICE:  CREATE TABLE / PRIMARY KEY will create implicit index "seedlists_pkey" for table "seedlists"
[main] WARN dk.netarkivet.systemtest.environment.TestEnvironmentController - ssh error: NOTICE:  CREATE TABLE / PRIMARY KEY will create implicit index "passwords_pkey" for table "passwords"
[main] WARN dk.netarkivet.systemtest.environment.TestEnvironmentController - ssh error: NOTICE:  CREATE TABLE / PRIMARY KEY will create implicit index "ownerinfo_pkey" for table "ownerinfo"
[main] WARN dk.netarkivet.systemtest.environment.TestEnvironmentController - ssh error: NOTICE:  CREATE TABLE / PRIMARY KEY will create implicit index "historyinfo_pkey" for table "historyinfo"
[main] WARN dk.netarkivet.systemtest.environment.TestEnvironmentController - ssh error: NOTICE:  CREATE TABLE / PRIMARY KEY will create implicit index "harvestdefinitions_pkey" for table "harvestdefinitions"
[main] WARN dk.netarkivet.systemtest.environment.TestEnvironmentController - ssh error: NOTICE:  CREATE TABLE / UNIQUE will create implicit index "harvestdefinitions_name_key" for table "harvestdefinitions"
[main] WARN dk.netarkivet.systemtest.environment.TestEnvironmentController - ssh error: NOTICE:  CREATE TABLE / PRIMARY KEY will create implicit index "fullharvests_pkey" for table "fullharvests"
[main] WARN dk.netarkivet.systemtest.environment.TestEnvironmentController - ssh error: NOTICE:  CREATE TABLE / PRIMARY KEY will create implicit index "partialharvests_pkey" for table "partialharvests"
[main] WARN dk.netarkivet.systemtest.environment.TestEnvironmentController - ssh error: NOTICE:  CREATE TABLE / PRIMARY KEY will create implicit index "harvest_configs_pkey" for table "harvest_configs"
[main] WARN dk.netarkivet.systemtest.environment.TestEnvironmentController - ssh error: NOTICE:  CREATE TABLE / PRIMARY KEY will create implicit index "schedules_pkey" for table "schedules"
[main] WARN dk.netarkivet.systemtest.environment.TestEnvironmentController - ssh error: NOTICE:  CREATE TABLE / UNIQUE will create implicit index "schedules_name_key" for table "schedules"
[main] WARN dk.netarkivet.systemtest.environment.TestEnvironmentController - ssh error: NOTICE:  CREATE TABLE / PRIMARY KEY will create implicit index "ordertemplates_pkey" for table "ordertemplates"
[main] WARN dk.netarkivet.systemtest.environment.TestEnvironmentController - ssh error: NOTICE:  CREATE TABLE / UNIQUE will create implicit index "ordertemplates_name_key" for table "ordertemplates"
[main] WARN dk.netarkivet.systemtest.environment.TestEnvironmentController - ssh error: NOTICE:  CREATE TABLE / PRIMARY KEY will create implicit index "jobs_pkey" for table "jobs"
[main] WARN dk.netarkivet.systemtest.environment.TestEnvironmentController - ssh error: NOTICE:  CREATE TABLE / PRIMARY KEY will create implicit index "job_configs_pkey" for table "job_configs"
[main] WARN dk.netarkivet.systemtest.environment.TestEnvironmentController - ssh error: NOTICE:  CREATE TABLE / PRIMARY KEY will create implicit index "global_crawler_trap_lists_pkey" for table "global_crawler_trap_lists"
[main] WARN dk.netarkivet.systemtest.environment.TestEnvironmentController - ssh error: NOTICE:  CREATE TABLE / UNIQUE will create implicit index "global_crawler_trap_lists_name_key" for table "global_crawler_trap_lists"
[main] WARN dk.netarkivet.systemtest.environment.TestEnvironmentController - ssh error: NOTICE:  CREATE TABLE / PRIMARY KEY will create implicit index "global_crawler_trap_expressions_pkey" for table "global_crawler_trap_expressions"
[main] WARN dk.netarkivet.systemtest.environment.TestEnvironmentController - ssh error: NOTICE:  CREATE TABLE / PRIMARY KEY will create implicit index "pkrunningjobshistory" for table "runningjobshistory"
[main] WARN dk.netarkivet.systemtest.environment.TestEnvironmentController - ssh error: NOTICE:  CREATE TABLE / PRIMARY KEY will create implicit index "pkrunningjobsmonitor" for table "runningjobsmonitor"
[main] WARN dk.netarkivet.systemtest.environment.TestEnvironmentController - ssh error: NOTICE:  CREATE TABLE / UNIQUE will create implicit index "pkfrontierreportlines" for table "frontierreportmonitor"
[main] WARN dk.netarkivet.systemtest.environment.TestEnvironmentController - ssh error: NOTICE:  CREATE TABLE / PRIMARY KEY will create implicit index "extendedfieldtype_pkey" for table "extendedfieldtype"
[main] WARN dk.netarkivet.systemtest.environment.TestEnvironmentController - ssh error: NOTICE:  CREATE TABLE / PRIMARY KEY will create implicit index "extendedfield_pkey" for table "extendedfield"
[main] WARN dk.netarkivet.systemtest.environment.TestEnvironmentController - ssh error: NOTICE:  CREATE TABLE / PRIMARY KEY will create implicit index "extendedfieldvalue_pkey" for table "extendedfieldvalue"
[main] WARN dk.netarkivet.systemtest.environment.TestEnvironmentController - ssh error: NOTICE:  CREATE TABLE / PRIMARY KEY will create implicit index "harvestchannel_pkey" for table "harvestchannel"
[main] WARN dk.netarkivet.systemtest.environment.TestEnvironmentController - ssh error: NOTICE:  CREATE TABLE / UNIQUE will create implicit index "harvestchannel_name_key" for table "harvestchannel"
[main] WARN dk.netarkivet.systemtest.environment.TestEnvironmentController - ssh error: NOTICE:  ALTER TABLE / ADD PRIMARY KEY will create implicit index "eav_type_attribute_pkey" for table "eav_type_attribute"
[main] WARN dk.netarkivet.systemtest.environment.TestEnvironmentController - ssh error: NOTICE:  ALTER TABLE / ADD PRIMARY KEY will create implicit index "eav_attribute_pkey" for table "eav_attribute"
[main] WARN dk.netarkivet.systemtest.environment.TestEnvironmentController - ssh error: The system cannot find the path specified.
[main] WARN dk.netarkivet.systemtest.environment.TestEnvironmentController - ssh error: The system cannot find the path specified.
[main] INFO dk.netarkivet.systemtest.environment.TestEnvironmentController - Command finished in 222 seconds. Exit code was 0
          Stimuli: Waiting for GUI to start.

        Added fixture: Selecting English as language
          Stimuli: Updating configuration defaultconfig
          Stimuli: Loading HarvestDefinition/Definitions-edit-domain.jsp?name=pligtaflevering.dk
    Starting testcase TemplatePageTest
      Test starting: updateTemplateTest
        Description: Tests that harvest tempplates can be updated.
        Step: Goto the template page
          Stimuli: Loading HarvestDefinition/Definitions-edit-harvest-templates.jsp
        Step: Deactivate default_obeyrobots template
        Step: Show inactive templates
        Step: Reactivate default_obeyrobots
        Step: Replace 'default_orderxml' 
          Stimuli: Loading HarvestDefinition/Definitions-edit-harvest-templates.jsp
        Step: Click the upload button.
      Test success: updateTemplateTest
    Starting testcase DomainsPageTest
      Test starting: domainCreationTest
        Description: Tests that domains can be created correctly.
        Step: Click the 'Create domain' link in the left menu under the 'Definitions' section
        Step: Add a domain to the list of domains to be created and click create.
        Step: Goto the 'Find domain' page and search for the newly added domain
          Stimuli: Loading HarvestDefinition/Definitions-find-domains.jsp
      Test success: domainCreationTest
      Test starting: usedConfigurationFilteringTest
        Description: Tests configurations are filtered correctly when using the 'Show/Hide unused configuration' filter.
        Step: Create a new domain
          Stimuli: Creating domains[DomainsPageTest-usedConfigurationFilteringTest-000837-1.dk]
          Stimuli: Loading HarvestDefinition/Definitions-create-domain.jsp
        Step: Create a new configuration
          Stimuli: Creating configurationDomainsPageTest-usedConfigurationFilteringTest-000837-configuration-2.dk
          Stimuli: Loading HarvestDefinition/Definitions-edit-domain.jsp?name=DomainsPageTest-usedConfigurationFilteringTest-000837-1.dk
        Step: Click the 'Show unused configurations' link
          Stimuli: Clicking 'Show unused configurations' link.
        Step: Click the 'Hide unused configurations' link
          Stimuli: Clicking 'Hide unused configurations' link.
        Step: Click the 'Show unused configurations' link again, set the second configuration as default configuration and click save. 
          Stimuli: Clicking 'Show unused configurations' link.
        Step: Click the 'Show unused configurations' link again.
          Stimuli: Clicking 'Show unused configurations' link.
        Step: Create a new active selective harvest for the test domain and select the 'Hide unused configurations' list on the test domain.
      Test success: usedConfigurationFilteringTest
      Test starting: usedSeedListsFilteringTest
        Description: Tests seed lists are filtered correctly when using the 'Show/Hide unused seed list' filter.
        Step: Create a new domain
          Stimuli: Creating domains[DomainsPageTest-usedSeedListsFilteringTest-000842-1.dk]
          Stimuli: Loading HarvestDefinition/Definitions-create-domain.jsp
        Step: Create a new seed list
          Stimuli: Creating configurationDomainsPageTest-usedSeedListsFilteringTest-000842-seedlist-2.dk([Ljava.lang.String;@5ef5c734)
          Stimuli: Loading HarvestDefinition/Definitions-edit-domain.jsp?name=DomainsPageTest-usedSeedListsFilteringTest-000842-1.dk
        Step: Click the 'Show unused seed list' link
          Stimuli: Clicking 'Show unused seed lists' link.
        Step: Click the 'Hide unused seed lists' link
          Stimuli: Clicking 'Hide unused seed lists' link.
        Step: Add the new seed list to the default config (which is a used config)
        Step: Remove the default seed list from the default configuration
      Test success: usedSeedListsFilteringTest
    Starting testcase ExtendedFieldTest
      Test starting: extendedDomainStringFieldTest
        Description: Tests that String type extended fields works correctly on domains.
        Step: Create a new String type field (name:extendedDomainStringFieldTest-000847) for domains
          Stimuli: Loading HarvestDefinition/Definitions-list-extendedfields.jsp
        Step: Edit the default domain (pligtaflevering.dk)
          Stimuli: Loading HarvestDefinition/Definitions-edit-domain.jsp?name=pligtaflevering.dk
        Step: Fill out the new extended field with a value and save the updated domain
        Step: Reopen the domain
      Test success: extendedDomainStringFieldTest
    Starting testcase SelectiveHarvestTest
      Test starting: jobSplittingTest
          Stimuli: Creating domains[d0-lXGcvK.dk]
          Stimuli: Loading HarvestDefinition/Definitions-create-domain.jsp
          Stimuli: Creating configurationnewconf_nZSoEu
          Stimuli: Loading HarvestDefinition/Definitions-edit-domain.jsp?name=d0-lXGcvK.dk
          Stimuli: Updating configuration newconf_nZSoEu
          Stimuli: Loading HarvestDefinition/Definitions-edit-domain.jsp?name=d0-lXGcvK.dk
          Stimuli: Creating domains[d1-lXGcvK.dk]
          Stimuli: Loading HarvestDefinition/Definitions-create-domain.jsp
          Stimuli: Creating configurationnewconf_nZSoEu
          Stimuli: Loading HarvestDefinition/Definitions-edit-domain.jsp?name=d1-lXGcvK.dk
          Stimuli: Updating configuration newconf_nZSoEu
          Stimuli: Loading HarvestDefinition/Definitions-edit-domain.jsp?name=d1-lXGcvK.dk
          Stimuli: Creating domains[d2-lXGcvK.dk]
          Stimuli: Loading HarvestDefinition/Definitions-create-domain.jsp
          Stimuli: Creating configurationnewconf_nZSoEu
          Stimuli: Loading HarvestDefinition/Definitions-edit-domain.jsp?name=d2-lXGcvK.dk
          Stimuli: Updating configuration newconf_nZSoEu
          Stimuli: Loading HarvestDefinition/Definitions-edit-domain.jsp?name=d2-lXGcvK.dk
          Stimuli: Creating domains[d3-lXGcvK.dk]
          Stimuli: Loading HarvestDefinition/Definitions-create-domain.jsp
          Stimuli: Creating configurationnewconf_nZSoEu
          Stimuli: Loading HarvestDefinition/Definitions-edit-domain.jsp?name=d3-lXGcvK.dk
          Stimuli: Updating configuration newconf_nZSoEu
          Stimuli: Loading HarvestDefinition/Definitions-edit-domain.jsp?name=d3-lXGcvK.dk
          Stimuli: Creating domains[d4-lXGcvK.dk]
          Stimuli: Loading HarvestDefinition/Definitions-create-domain.jsp
          Stimuli: Creating configurationnewconf_nZSoEu
          Stimuli: Loading HarvestDefinition/Definitions-edit-domain.jsp?name=d4-lXGcvK.dk
          Stimuli: Updating configuration newconf_nZSoEu
          Stimuli: Loading HarvestDefinition/Definitions-edit-domain.jsp?name=d4-lXGcvK.dk
          Stimuli: Creating domains[d5-lXGcvK.dk]
          Stimuli: Loading HarvestDefinition/Definitions-create-domain.jsp
          Stimuli: Creating configurationnewconf_nZSoEu
          Stimuli: Loading HarvestDefinition/Definitions-edit-domain.jsp?name=d5-lXGcvK.dk
          Stimuli: Updating configuration newconf_nZSoEu
          Stimuli: Loading HarvestDefinition/Definitions-edit-domain.jsp?name=d5-lXGcvK.dk
          Stimuli: Creating domains[d6-lXGcvK.dk]
          Stimuli: Loading HarvestDefinition/Definitions-create-domain.jsp
          Stimuli: Creating configurationnewconf_nZSoEu
          Stimuli: Loading HarvestDefinition/Definitions-edit-domain.jsp?name=d6-lXGcvK.dk
          Stimuli: Updating configuration newconf_nZSoEu
          Stimuli: Loading HarvestDefinition/Definitions-edit-domain.jsp?name=d6-lXGcvK.dk
          Stimuli: Creating domains[d7-lXGcvK.dk]
          Stimuli: Loading HarvestDefinition/Definitions-create-domain.jsp
          Stimuli: Creating configurationnewconf_nZSoEu
          Stimuli: Loading HarvestDefinition/Definitions-edit-domain.jsp?name=d7-lXGcvK.dk
          Stimuli: Updating configuration newconf_nZSoEu
          Stimuli: Loading HarvestDefinition/Definitions-edit-domain.jsp?name=d7-lXGcvK.dk
          Stimuli: Creating domains[d8-lXGcvK.dk]
          Stimuli: Loading HarvestDefinition/Definitions-create-domain.jsp
          Stimuli: Creating configurationnewconf_nZSoEu
          Stimuli: Loading HarvestDefinition/Definitions-edit-domain.jsp?name=d8-lXGcvK.dk
          Stimuli: Updating configuration newconf_nZSoEu
          Stimuli: Loading HarvestDefinition/Definitions-edit-domain.jsp?name=d8-lXGcvK.dk
          Stimuli: Creating domains[d9-lXGcvK.dk]
          Stimuli: Loading HarvestDefinition/Definitions-create-domain.jsp
          Stimuli: Creating configurationnewconf_nZSoEu
          Stimuli: Loading HarvestDefinition/Definitions-edit-domain.jsp?name=d9-lXGcvK.dk
          Stimuli: Updating configuration newconf_nZSoEu
          Stimuli: Loading HarvestDefinition/Definitions-edit-domain.jsp?name=d9-lXGcvK.dk
          Stimuli: Creating domains[d10-lXGcvK.dk]
          Stimuli: Loading HarvestDefinition/Definitions-create-domain.jsp
          Stimuli: Creating configurationnewconf_nZSoEu
          Stimuli: Loading HarvestDefinition/Definitions-edit-domain.jsp?name=d10-lXGcvK.dk
          Stimuli: Updating configuration newconf_nZSoEu
          Stimuli: Loading HarvestDefinition/Definitions-edit-domain.jsp?name=d10-lXGcvK.dk
          Stimuli: Creating harvest splitharvest_jBm2Ja
          Stimuli: Loading HarvestDefinition/Definitions-selective-harvests.jsp
          Stimuli: Activating harvest splitharvest_jBm2Ja
          Stimuli: Loading HarvestDefinition/Definitions-selective-harvests.jsp
          Stimuli: Activating harvest splitharvest_jBm2Ja
          Stimuli: Loading HarvestDefinition/Definitions-selective-harvests.jsp
.      Test success: jobSplittingTest
      Test starting: selectiveHarvestListingTest
        Description: Verify the functionality of the harvest listings.
        Reference: http://netarchive.dk/suite/TEST1
        Step: Create a selective harvest
          Stimuli: Creating harvest SelectiveHarvestTest-selectiveHarvestListingTest-001027-1
          Stimuli: Loading HarvestDefinition/Definitions-selective-harvests.jsp
        Step: Create a second harvest and active it
          Stimuli: Creating harvest SelectiveHarvestTest-selectiveHarvestListingTest-001027-2
          Stimuli: Loading HarvestDefinition/Definitions-selective-harvests.jsp
          Stimuli: Activating harvest SelectiveHarvestTest-selectiveHarvestListingTest-001027-2
          Stimuli: Loading HarvestDefinition/Definitions-selective-harvests.jsp
        Step: Hide inactive harvests
        Step: Show inactive harvests
      Test success: selectiveHarvestListingTest
      Test starting: snapshotTest
          Stimuli: Loading HarvestDefinition/Definitions-find-domains.jsp
          Stimuli: Loading HarvestDefinition/Definitions-snapshot-harvests.jsp
.      Test success: snapshotTest
    Starting testcase SystemOverviewTest
      Test starting: generalTest
        Description: Test specification: http://netarchive.dk/suite/It23JMXMailCheck
        Step: Goto the Systemstate page and wait for the extected number of applications to appear.
        Step: Click the 'Instance id' link (We need to do this to differentiate between instances of the same application running on the same machine)
      Test failed: java.lang.AssertionError: Sets not equal, Expected sets contained the following 1 elements  not found in the result set:
[Application [machine=KB-TEST-BAR-015, application=BitarchiveApplication, instance_Id=null, channel=null, replica=KBN]]
and the following 0 elements in the result set where not found in the expected set
[]
[main] INFO dk.netarkivet.systemtest.functional.SystemOverviewTest - Test failure, dumping screenshot as target/failurescreendumps/SystemOverviewTest.generalTest()[pri:0, instance:dk.netarkivet.systemtest.functional.SystemOverviewTest@573f2bb1].png
    Starting testcase HarvestHistoryForDomainPageTest
[main] INFO dk.netarkivet.systemtest.environment.TestEnvironmentController - Running JSch command (on kb-test-adm-001.kb.dk): RemoteCommand sshTunneling=ssh kb-test-adm-001.kb.dk 
	source /etc/bashrc;source /etc/profile;source ~/.bash_profile;true;export PORT=8071;export MAILRECEIVERS=csr@statsbiblioteket.dk;export TESTX=SystemTest;true;export H3ZIP=/home/devel/nas_versions/bundler/NetarchiveSuite-heritrix3-bundler-systemtest.zip;
	cd SystemTest;if [ -f conf/settings_GUIApplication.xml.original ]; then echo conf/settings_GUIApplication.xml.original exist, moving back.; conf/kill_GUIApplication.sh; sleep 20;cp conf/settings_GUIApplication.xml.original conf/settings_GUIApplication.xml;  conf/start_GUIApplication.sh; fi
[main] INFO dk.netarkivet.systemtest.environment.TestEnvironmentController - Command finished in 1 seconds. Exit code was 0
          Stimuli: Waiting for GUI to start.

      Test starting: historySortedTablePagingTest
        Description: Tests that sorting is maintained when paging through the harvest history
        Step: Ensure that at least harvests have finished for the default domain
          Stimuli: Loading History/Harveststatus-perdomain.jsp?domainName=pligtaflevering.dk
          Stimuli: Creating harvest EnsureNumberOfHarvests-15073280413150
          Stimuli: Loading HarvestDefinition/Definitions-selective-harvests.jsp
          Stimuli: Activating harvest EnsureNumberOfHarvests-15073280413150
          Stimuli: Loading HarvestDefinition/Definitions-selective-harvests.jsp
          Stimuli: Creating harvest EnsureNumberOfHarvests-15073280413151
          Stimuli: Loading HarvestDefinition/Definitions-selective-harvests.jsp
          Stimuli: Activating harvest EnsureNumberOfHarvests-15073280413151
          Stimuli: Loading HarvestDefinition/Definitions-selective-harvests.jsp
          Stimuli: Creating harvest EnsureNumberOfHarvests-15073280413152
          Stimuli: Loading HarvestDefinition/Definitions-selective-harvests.jsp
          Stimuli: Activating harvest EnsureNumberOfHarvests-15073280413152
          Stimuli: Loading HarvestDefinition/Definitions-selective-harvests.jsp
          Result: Waiting for the following harvests to finish: [EnsureNumberOfHarvests-15073280413150, EnsureNumberOfHarvests-15073280413151, EnsureNumberOfHarvests-15073280413152]
Initiating 3 new harvests, so 3 finished harvests are available. Will timeout after 180 minutes.
..................................................................
EnsureNumberOfHarvests-15073280413150 finished
.
EnsureNumberOfHarvests-15073280413151 finished
.....
EnsureNumberOfHarvests-15073280413152 finished
All harvests finished in 4335 seconds
        Step: Click the 'End time' header link twice
          Stimuli: Loading History/Harveststatus-perdomain.jsp?domainName=pligtaflevering.dk
          Stimuli: Clicking 'End time' link.
          Stimuli: Clicking 'End time' link.
[main] INFO dk.netarkivet.systemtest.environment.TestEnvironmentController - Running JSch command (on kb-test-adm-001.kb.dk): RemoteCommand sshTunneling=ssh kb-test-adm-001.kb.dk 
	source /etc/bashrc;source /etc/profile;source ~/.bash_profile;true;export PORT=8071;export MAILRECEIVERS=csr@statsbiblioteket.dk;export TESTX=SystemTest;true;export H3ZIP=/home/devel/nas_versions/bundler/NetarchiveSuite-heritrix3-bundler-systemtest.zip;
	cd SystemTest;if [ ! -f conf/settings_GUIApplication.xml.original ]; then  cp conf/settings_GUIApplication.xml conf/settings_GUIApplication.xml.original;fi
[main] INFO dk.netarkivet.systemtest.environment.TestEnvironmentController - Command finished in 1 seconds. Exit code was 0
[main] INFO dk.netarkivet.systemtest.environment.TestEnvironmentController - Running JSch command (on kb-test-adm-001.kb.dk): RemoteCommand sshTunneling=ssh kb-test-adm-001.kb.dk 
	source /etc/bashrc;source /etc/profile;source ~/.bash_profile;true;export PORT=8071;export MAILRECEIVERS=csr@statsbiblioteket.dk;export TESTX=SystemTest;true;export H3ZIP=/home/devel/nas_versions/bundler/NetarchiveSuite-heritrix3-bundler-systemtest.zip;
	cd SystemTest; cp conf/settings_GUIApplication.xml conf/settings_GUIApplication.xml.2
[main] INFO dk.netarkivet.systemtest.environment.TestEnvironmentController - Command finished in 1 seconds. Exit code was 0
[main] INFO dk.netarkivet.systemtest.environment.TestEnvironmentController - Running JSch command (on kb-test-adm-001.kb.dk): RemoteCommand sshTunneling=ssh kb-test-adm-001.kb.dk 
	source /etc/bashrc;source /etc/profile;source ~/.bash_profile;true;export PORT=8071;export MAILRECEIVERS=csr@statsbiblioteket.dk;export TESTX=SystemTest;true;export H3ZIP=/home/devel/nas_versions/bundler/NetarchiveSuite-heritrix3-bundler-systemtest.zip;
	cd SystemTest;sed -i.original 's,</indexClient>,</indexClient><webinterface><harvestStatus><defaultPageSize>2</defaultPageSize></harvestStatus></webinterface>,g' conf/settings_GUIApplication.xml.2
[main] INFO dk.netarkivet.systemtest.environment.TestEnvironmentController - Command finished in 1 seconds. Exit code was 0
[main] INFO dk.netarkivet.systemtest.environment.TestEnvironmentController - Running JSch command (on kb-test-adm-001.kb.dk): RemoteCommand sshTunneling=ssh kb-test-adm-001.kb.dk 
	source /etc/bashrc;source /etc/profile;source ~/.bash_profile;true;export PORT=8071;export MAILRECEIVERS=csr@statsbiblioteket.dk;export TESTX=SystemTest;true;export H3ZIP=/home/devel/nas_versions/bundler/NetarchiveSuite-heritrix3-bundler-systemtest.zip;
	cd SystemTest; cp conf/settings_GUIApplication.xml.2 conf/settings_GUIApplication.xml
[main] INFO dk.netarkivet.systemtest.environment.TestEnvironmentController - Command finished in 1 seconds. Exit code was 0
[main] INFO dk.netarkivet.systemtest.environment.TestGUIController - Restarting GUI
[main] INFO dk.netarkivet.systemtest.environment.TestEnvironmentController - Running JSch command (on kb-test-adm-001.kb.dk): RemoteCommand sshTunneling=ssh kb-test-adm-001.kb.dk 
	source /etc/bashrc;source /etc/profile;source ~/.bash_profile;true;export PORT=8071;export MAILRECEIVERS=csr@statsbiblioteket.dk;export TESTX=SystemTest;true;export H3ZIP=/home/devel/nas_versions/bundler/NetarchiveSuite-heritrix3-bundler-systemtest.zip;
	cd SystemTest;./conf/kill_GUIApplication.sh; sleep 10
[main] INFO dk.netarkivet.systemtest.environment.TestEnvironmentController - Command finished in 12 seconds. Exit code was 0
[main] INFO dk.netarkivet.systemtest.environment.TestEnvironmentController - Running JSch command (on kb-test-adm-001.kb.dk): RemoteCommand sshTunneling=ssh kb-test-adm-001.kb.dk 
	source /etc/bashrc;source /etc/profile;source ~/.bash_profile;true;export PORT=8071;export MAILRECEIVERS=csr@statsbiblioteket.dk;export TESTX=SystemTest;true;export H3ZIP=/home/devel/nas_versions/bundler/NetarchiveSuite-heritrix3-bundler-systemtest.zip;
	cd SystemTest;./conf/start_GUIApplication.sh
[main] INFO dk.netarkivet.systemtest.environment.TestEnvironmentController - Command finished in 1 seconds. Exit code was 0
          Stimuli: Waiting for GUI to start.
.....
        Step: Set the page size to 2
        Step: Goto the harvest history for the default domain
          Stimuli: Loading History/Harveststatus-perdomain.jsp?domainName=pligtaflevering.dk
        Step: Click the 'End time' header link twice
          Stimuli: Loading History/Harveststatus-perdomain.jsp?domainName=pligtaflevering.dk
          Stimuli: Clicking 'End time' link.
          Stimuli: Clicking 'End time' link.
        Step: Click the next link until the next link disappears
        Step: Click the previous link until the previous link disappears.
      Test success: historySortedTablePagingTest
[main] INFO dk.netarkivet.systemtest.environment.TestEnvironmentController - Running JSch command (on kb-test-adm-001.kb.dk): RemoteCommand sshTunneling=ssh kb-test-adm-001.kb.dk 
	source /etc/bashrc;source /etc/profile;source ~/.bash_profile;true;export PORT=8071;export MAILRECEIVERS=csr@statsbiblioteket.dk;export TESTX=SystemTest;true;export H3ZIP=/home/devel/nas_versions/bundler/NetarchiveSuite-heritrix3-bundler-systemtest.zip;
	cd SystemTest;if [ -f conf/settings_GUIApplication.xml.original ]; then echo conf/settings_GUIApplication.xml.original exist, moving back.; conf/kill_GUIApplication.sh; sleep 20;cp conf/settings_GUIApplication.xml.original conf/settings_GUIApplication.xml;  conf/start_GUIApplication.sh; fi
[main] INFO dk.netarkivet.systemtest.environment.TestEnvironmentController - Command finished in 22 seconds. Exit code was 0
          Stimuli: Waiting for GUI to start.
..
[main] INFO dk.netarkivet.systemtest.environment.TestEnvironmentController - Running JSch command (on kb-test-adm-001.kb.dk): RemoteCommand sshTunneling=ssh kb-test-adm-001.kb.dk 
	source /etc/bashrc;source /etc/profile;source ~/.bash_profile;true;export PORT=8071;export MAILRECEIVERS=csr@statsbiblioteket.dk;export TESTX=SystemTest;true;export H3ZIP=/home/devel/nas_versions/bundler/NetarchiveSuite-heritrix3-bundler-systemtest.zip;
	cd SystemTest;if [ -f conf/settings_GUIApplication.xml.original ]; then echo conf/settings_GUIApplication.xml.original exist, moving back.; conf/kill_GUIApplication.sh; sleep 20;cp conf/settings_GUIApplication.xml.original conf/settings_GUIApplication.xml;  conf/start_GUIApplication.sh; fi
[main] INFO dk.netarkivet.systemtest.environment.TestEnvironmentController - Command finished in 22 seconds. Exit code was 0
          Stimuli: Waiting for GUI to start.
..
      Test starting: historyTablePagingTest
        Description: Testes that the paging functionality works correctly for the harvest history
        Step: Ensure that at least harvests have finished for the default domain
          Stimuli: Loading History/Harveststatus-perdomain.jsp?domainName=pligtaflevering.dk
[main] INFO dk.netarkivet.systemtest.environment.TestEnvironmentController - Running JSch command (on kb-test-adm-001.kb.dk): RemoteCommand sshTunneling=ssh kb-test-adm-001.kb.dk 
	source /etc/bashrc;source /etc/profile;source ~/.bash_profile;true;export PORT=8071;export MAILRECEIVERS=csr@statsbiblioteket.dk;export TESTX=SystemTest;true;export H3ZIP=/home/devel/nas_versions/bundler/NetarchiveSuite-heritrix3-bundler-systemtest.zip;
	cd SystemTest;if [ ! -f conf/settings_GUIApplication.xml.original ]; then  cp conf/settings_GUIApplication.xml conf/settings_GUIApplication.xml.original;fi
[main] INFO dk.netarkivet.systemtest.environment.TestEnvironmentController - Command finished in 1 seconds. Exit code was 0
[main] INFO dk.netarkivet.systemtest.environment.TestEnvironmentController - Running JSch command (on kb-test-adm-001.kb.dk): RemoteCommand sshTunneling=ssh kb-test-adm-001.kb.dk 
	source /etc/bashrc;source /etc/profile;source ~/.bash_profile;true;export PORT=8071;export MAILRECEIVERS=csr@statsbiblioteket.dk;export TESTX=SystemTest;true;export H3ZIP=/home/devel/nas_versions/bundler/NetarchiveSuite-heritrix3-bundler-systemtest.zip;
	cd SystemTest; cp conf/settings_GUIApplication.xml conf/settings_GUIApplication.xml.2
[main] INFO dk.netarkivet.systemtest.environment.TestEnvironmentController - Command finished in 1 seconds. Exit code was 0
[main] INFO dk.netarkivet.systemtest.environment.TestEnvironmentController - Running JSch command (on kb-test-adm-001.kb.dk): RemoteCommand sshTunneling=ssh kb-test-adm-001.kb.dk 
	source /etc/bashrc;source /etc/profile;source ~/.bash_profile;true;export PORT=8071;export MAILRECEIVERS=csr@statsbiblioteket.dk;export TESTX=SystemTest;true;export H3ZIP=/home/devel/nas_versions/bundler/NetarchiveSuite-heritrix3-bundler-systemtest.zip;
	cd SystemTest;sed -i.original 's,</indexClient>,</indexClient><webinterface><harvestStatus><defaultPageSize>2</defaultPageSize></harvestStatus></webinterface>,g' conf/settings_GUIApplication.xml.2
[main] INFO dk.netarkivet.systemtest.environment.TestEnvironmentController - Command finished in 1 seconds. Exit code was 0
[main] INFO dk.netarkivet.systemtest.environment.TestEnvironmentController - Running JSch command (on kb-test-adm-001.kb.dk): RemoteCommand sshTunneling=ssh kb-test-adm-001.kb.dk 
	source /etc/bashrc;source /etc/profile;source ~/.bash_profile;true;export PORT=8071;export MAILRECEIVERS=csr@statsbiblioteket.dk;export TESTX=SystemTest;true;export H3ZIP=/home/devel/nas_versions/bundler/NetarchiveSuite-heritrix3-bundler-systemtest.zip;
	cd SystemTest; cp conf/settings_GUIApplication.xml.2 conf/settings_GUIApplication.xml
[main] INFO dk.netarkivet.systemtest.environment.TestEnvironmentController - Command finished in 1 seconds. Exit code was 0
[main] INFO dk.netarkivet.systemtest.environment.TestGUIController - Restarting GUI
[main] INFO dk.netarkivet.systemtest.environment.TestEnvironmentController - Running JSch command (on kb-test-adm-001.kb.dk): RemoteCommand sshTunneling=ssh kb-test-adm-001.kb.dk 
	source /etc/bashrc;source /etc/profile;source ~/.bash_profile;true;export PORT=8071;export MAILRECEIVERS=csr@statsbiblioteket.dk;export TESTX=SystemTest;true;export H3ZIP=/home/devel/nas_versions/bundler/NetarchiveSuite-heritrix3-bundler-systemtest.zip;
	cd SystemTest;./conf/kill_GUIApplication.sh; sleep 10
[main] INFO dk.netarkivet.systemtest.environment.TestEnvironmentController - Command finished in 12 seconds. Exit code was 0
[main] INFO dk.netarkivet.systemtest.environment.TestEnvironmentController - Running JSch command (on kb-test-adm-001.kb.dk): RemoteCommand sshTunneling=ssh kb-test-adm-001.kb.dk 
	source /etc/bashrc;source /etc/profile;source ~/.bash_profile;true;export PORT=8071;export MAILRECEIVERS=csr@statsbiblioteket.dk;export TESTX=SystemTest;true;export H3ZIP=/home/devel/nas_versions/bundler/NetarchiveSuite-heritrix3-bundler-systemtest.zip;
	cd SystemTest;./conf/start_GUIApplication.sh
[main] INFO dk.netarkivet.systemtest.environment.TestEnvironmentController - Command finished in 1 seconds. Exit code was 0
          Stimuli: Waiting for GUI to start.
..
        Step: Set the page size to 2
        Step: Goto the harvest history for the default domain
          Stimuli: Loading History/Harveststatus-perdomain.jsp?domainName=pligtaflevering.dk
        Step: Click the next link until the next link disappears
        Step: Click the previous link until the previous link disappears.
      Test success: historyTablePagingTest
[main] INFO dk.netarkivet.systemtest.environment.TestEnvironmentController - Running JSch command (on kb-test-adm-001.kb.dk): RemoteCommand sshTunneling=ssh kb-test-adm-001.kb.dk 
	source /etc/bashrc;source /etc/profile;source ~/.bash_profile;true;export PORT=8071;export MAILRECEIVERS=csr@statsbiblioteket.dk;export TESTX=SystemTest;true;export H3ZIP=/home/devel/nas_versions/bundler/NetarchiveSuite-heritrix3-bundler-systemtest.zip;
	cd SystemTest;if [ -f conf/settings_GUIApplication.xml.original ]; then echo conf/settings_GUIApplication.xml.original exist, moving back.; conf/kill_GUIApplication.sh; sleep 20;cp conf/settings_GUIApplication.xml.original conf/settings_GUIApplication.xml;  conf/start_GUIApplication.sh; fi
[main] INFO dk.netarkivet.systemtest.environment.TestEnvironmentController - Command finished in 22 seconds. Exit code was 0
          Stimuli: Waiting for GUI to start.
..
[main] INFO dk.netarkivet.systemtest.environment.TestEnvironmentController - Running JSch command (on kb-test-adm-001.kb.dk): RemoteCommand sshTunneling=ssh kb-test-adm-001.kb.dk 
	source /etc/bashrc;source /etc/profile;source ~/.bash_profile;true;export PORT=8071;export MAILRECEIVERS=csr@statsbiblioteket.dk;export TESTX=SystemTest;true;export H3ZIP=/home/devel/nas_versions/bundler/NetarchiveSuite-heritrix3-bundler-systemtest.zip;
	cd SystemTest;if [ -f conf/settings_GUIApplication.xml.original ]; then echo conf/settings_GUIApplication.xml.original exist, moving back.; conf/kill_GUIApplication.sh; sleep 20;cp conf/settings_GUIApplication.xml.original conf/settings_GUIApplication.xml;  conf/start_GUIApplication.sh; fi
[main] INFO dk.netarkivet.systemtest.environment.TestEnvironmentController - Command finished in 22 seconds. Exit code was 0
          Stimuli: Waiting for GUI to start.
..
      Test starting: sortableHistoryTableTest
        Description: Tests that the jobs listed on the 'Harvest History' page for a domain aresortable by clicking on the .
        Step: Ensure that the at least two jobs have run for the default domain
          Stimuli: Loading History/Harveststatus-perdomain.jsp?domainName=pligtaflevering.dk
        Step: Click the 'Harvest name' header link
          Stimuli: Loading History/Harveststatus-perdomain.jsp?domainName=pligtaflevering.dk
          Stimuli: Clicking 'Harvest name' link.
          Stimuli: Clicking 'Harvest name' link.
        Step: Click the 'Run number' header link
          Stimuli: Loading History/Harveststatus-perdomain.jsp?domainName=pligtaflevering.dk
          Stimuli: Clicking 'Run number' link.
          Stimuli: Clicking 'Run number' link.
        Step: Click the 'Run ID' header link
          Stimuli: Loading History/Harveststatus-perdomain.jsp?domainName=pligtaflevering.dk
          Stimuli: Clicking 'Job ID' link.
          Stimuli: Clicking 'Job ID' link.
        Step: Click the 'Configuration' header link
          Stimuli: Loading History/Harveststatus-perdomain.jsp?domainName=pligtaflevering.dk
          Stimuli: Clicking 'Configuration' link.
          Stimuli: Clicking 'Configuration' link.
        Step: Click the 'Start time' header link
          Stimuli: Loading History/Harveststatus-perdomain.jsp?domainName=pligtaflevering.dk
          Stimuli: Clicking 'Start time' link.
          Stimuli: Clicking 'Start time' link.
        Step: Click the 'End time' header link
          Stimuli: Loading History/Harveststatus-perdomain.jsp?domainName=pligtaflevering.dk
          Stimuli: Clicking 'End time' link.
          Stimuli: Clicking 'End time' link.
        Step: Click the 'Bytes Harvested' header link
          Stimuli: Loading History/Harveststatus-perdomain.jsp?domainName=pligtaflevering.dk
          Stimuli: Clicking 'Bytes Harvested' link.
          Stimuli: Clicking 'Bytes Harvested' link.
        Step: Click the 'Documents Harvested' header link
          Stimuli: Loading History/Harveststatus-perdomain.jsp?domainName=pligtaflevering.dk
          Stimuli: Clicking 'Documents Harvested' link.
          Stimuli: Clicking 'Documents Harvested' link.
        Step: Click the 'Stopped due to' header link
          Stimuli: Loading History/Harveststatus-perdomain.jsp?domainName=pligtaflevering.dk
          Stimuli: Clicking 'Stopped due to' link.
          Stimuli: Clicking 'Stopped due to' link.
      Test success: sortableHistoryTableTest
[main] INFO dk.netarkivet.systemtest.environment.TestEnvironmentController - Running JSch command (on kb-test-adm-001.kb.dk): RemoteCommand sshTunneling=ssh kb-test-adm-001.kb.dk 
	source /etc/bashrc;source /etc/profile;source ~/.bash_profile;true;export PORT=8071;export MAILRECEIVERS=csr@statsbiblioteket.dk;export TESTX=SystemTest;true;export H3ZIP=/home/devel/nas_versions/bundler/NetarchiveSuite-heritrix3-bundler-systemtest.zip;
	cd SystemTest;if [ -f conf/settings_GUIApplication.xml.original ]; then echo conf/settings_GUIApplication.xml.original exist, moving back.; conf/kill_GUIApplication.sh; sleep 20;cp conf/settings_GUIApplication.xml.original conf/settings_GUIApplication.xml;  conf/start_GUIApplication.sh; fi
[main] INFO dk.netarkivet.systemtest.environment.TestEnvironmentController - Command finished in 22 seconds. Exit code was 0
          Stimuli: Waiting for GUI to start.
..
      Finished testcase
          Stimuli: Deactivating all harvests
          Stimuli: Loading HarvestDefinition/Definitions-selective-harvests.jsp
          Stimuli: Deactivating harvest: EnsureNumberOfHarvests-15073280413150
          Stimuli: Deactivating harvest: EnsureNumberOfHarvests-15073280413151
          Stimuli: Deactivating harvest: EnsureNumberOfHarvests-15073280413152
          Stimuli: Deactivating harvest: SelectiveHarvestTest-selectiveHarvestListingTest-001027-2
          Stimuli: Deactivating harvest: splitharvest_jBm2Ja
  Finished suite
Finished project
Tests run: 12, Failures: 1, Errors: 0, Skipped: 0, Time elapsed: 5,135.518 sec <<< FAILURE! - in TestSuite
generalTest(dk.netarkivet.systemtest.functional.SystemOverviewTest)  Time elapsed: 147.389 sec  <<< FAILURE!
java.lang.AssertionError: Sets not equal, Expected sets contained the following 1 elements  not found in the result set:
[Application [machine=KB-TEST-BAR-015, application=BitarchiveApplication, instance_Id=null, channel=null, replica=KBN]]
and the following 0 elements in the result set where not found in the expected set
[]
	at org.testng.Assert.fail(Assert.java:94)
	at dk.netarkivet.systemtest.NASAssert.assertEquals(NASAssert.java:48)
	at dk.netarkivet.systemtest.functional.SystemOverviewTest.generalTest(SystemOverviewTest.java:94)


Results :

Failed tests: 
  SystemOverviewTest.generalTest:94 Sets not equal, Expected sets contained the following 1 elements  not found in the result set:
[Application [machine=KB-TEST-BAR-015, application=BitarchiveApplication, instance_Id=null, channel=null, replica=KBN]]
and the following 0 elements in the result set where not found in the expected set
[]

Tests run: 12, Failures: 1, Errors: 0, Skipped: 0

[JENKINS] Recording test results
log4j:WARN No appenders could be found for logger (org.apache.commons.beanutils.converters.BooleanConverter).
log4j:WARN Please initialize the log4j system properly.
[JENKINS] Archiving disabled
[INFO] ------------------------------------------------------------------------
[JENKINS] Archiving disabled[INFO] BUILD FAILURE
[INFO] ------------------------------------------------------------------------
[INFO] Total time: 01:26 h
[INFO] Finished at: 2017-10-07T01:30:16+02:00

[INFO] Final Memory: 33M/80M
[INFO] ------------------------------------------------------------------------
[ERROR] Failed to execute goal org.apache.maven.plugins:maven-surefire-plugin:2.17:test (surefire-it) on project system-test: There are test failures.
[ERROR] 
[ERROR] Please refer to /home/cibuild02/workspace/NetarchiveSuite-system-test/integration-test/system-test/target/surefire-reports for the individual test results.
[ERROR] -> [Help 1]
[ERROR] 
[ERROR] To see the full stack trace of the errors, re-run Maven with the -e switch.
[ERROR] Re-run Maven using the -X switch to enable full debug logging.
[ERROR] 
[ERROR] For more information about the errors and possible solutions, please read the following articles:
[ERROR] [Help 1] http://cwiki.apache.org/confluence/display/MAVEN/MojoFailureException
channel stopped
Sending e-mails to: csr@statsbiblioteket.dk
Warning: you have no plugins providing access control for builds, so falling back to legacy behavior of permitting any downstream builds to be triggered
Finished: FAILURE