FailedConsole Output

[INFO]                                                                         
[INFO] ------------------------------------------------------------------------
[INFO] Building NetarchiveSuite System test 5.6-SNAPSHOT
[INFO] ------------------------------------------------------------------------
[INFO] 
[INFO] --- maven-clean-plugin:2.5:clean (default-clean) @ system-test ---
[INFO] Deleting /home/cibuild02/workspace/NetarchiveSuite-SystemTest-JMSUpload/integration-test/system-test/target
[INFO] 
[INFO] --- jacoco-maven-plugin:0.7.5.201505241946:prepare-agent (default) @ system-test ---
[INFO] argLine set to -javaagent:/home/cibuild02/.m2/repository/org/jacoco/org.jacoco.agent/0.7.5.201505241946/org.jacoco.agent-0.7.5.201505241946-runtime.jar=destfile=/home/cibuild02/workspace/NetarchiveSuite-SystemTest-JMSUpload/integration-test/system-test/target/jacoco.exec
[INFO] 
[INFO] --- maven-resources-plugin:2.6:resources (default-resources) @ system-test ---
[INFO] Using 'UTF-8' encoding to copy filtered resources.
[INFO] skip non existing resourceDirectory /home/cibuild02/workspace/NetarchiveSuite-SystemTest-JMSUpload/integration-test/system-test/src/main/resources
[INFO] 
[INFO] --- maven-compiler-plugin:3.1:compile (default-compile) @ system-test ---
[INFO] No sources to compile
[INFO] 
[INFO] --- maven-resources-plugin:2.6:testResources (default-testResources) @ system-test ---
[INFO] Using 'UTF-8' encoding to copy filtered resources.
[INFO] Copying 22 resources
[INFO] 
[INFO] --- maven-compiler-plugin:3.1:testCompile (default-testCompile) @ system-test ---
[INFO] Changes detected - recompiling the module!
[INFO] Compiling 34 source files to /home/cibuild02/workspace/NetarchiveSuite-SystemTest-JMSUpload/integration-test/system-test/target/test-classes
[WARNING] /home/cibuild02/workspace/NetarchiveSuite-SystemTest-JMSUpload/integration-test/system-test/src/test/java/dk/netarkivet/systemtest/SeleniumSession.java: /home/cibuild02/workspace/NetarchiveSuite-SystemTest-JMSUpload/integration-test/system-test/src/test/java/dk/netarkivet/systemtest/SeleniumSession.java uses unchecked or unsafe operations.
[WARNING] /home/cibuild02/workspace/NetarchiveSuite-SystemTest-JMSUpload/integration-test/system-test/src/test/java/dk/netarkivet/systemtest/SeleniumSession.java: Recompile with -Xlint:unchecked for details.
[INFO] 
[INFO] --- maven-surefire-plugin:2.17:test (default-test) @ system-test ---
[INFO] Tests are skipped.
[INFO] 
[INFO] --- jacoco-maven-plugin:0.7.5.201505241946:report (report) @ system-test ---
[INFO] Skipping JaCoCo execution due to missing execution data file:/home/cibuild02/workspace/NetarchiveSuite-SystemTest-JMSUpload/integration-test/system-test/target/jacoco.exec
[INFO] 
[INFO] --- maven-jgit-buildnumber-plugin:1.2.9:extract-buildnumber (git-buildnumber) @ system-test ---
[INFO] Cannot extract Git info, maybe custom build with 'pl' argument is running
[INFO] 
[INFO] --- maven-jar-plugin:2.4:jar (default-jar) @ system-test ---
[WARNING] JAR will be empty - no content was marked for inclusion!
[INFO] Building jar: /home/cibuild02/workspace/NetarchiveSuite-SystemTest-JMSUpload/integration-test/system-test/target/system-test-5.6-SNAPSHOT.jar
[INFO] 
[INFO] --- maven-dependency-plugin:2.8:copy (copy-distribution-zip) @ system-test ---
[INFO] Configured Artifact: org.netarchivesuite:distribution:5.6-SNAPSHOT:zip
[INFO] Copying distribution-5.6-SNAPSHOT.zip to /home/cibuild02/workspace/NetarchiveSuite-SystemTest-JMSUpload/integration-test/system-test/target/NetarchiveSuite-SystemTest.zip
[INFO] 
[INFO] --- maven-antrun-plugin:1.8:run (default) @ system-test ---
[INFO] Executing tasks

main:

deploy2test:
      [scp] Connecting to kb-prod-udv-001.kb.dk:22
      [scp] done.
[INFO] Executed tasks
[INFO] 
[INFO] --- maven-surefire-plugin:2.17:test (surefire-it) @ system-test ---
[INFO] Surefire report directory: /home/cibuild02/workspace/NetarchiveSuite-SystemTest-JMSUpload/integration-test/system-test/target/surefire-reports

-------------------------------------------------------
 T E S T S
-------------------------------------------------------
Running TestSuite
[main] INFO org.jaccept.TestEventManager - Loading properties from file:/home/cibuild02/workspace/NetarchiveSuite-SystemTest-JMSUpload/integration-test/system-test/target/test-classes/jaccept.properties
[main] INFO org.jaccept.TestEventManager - Adding clients: org.jaccept.StdOutLogger
[main] INFO org.jaccept.TestEventManager - Adding JAccept client org.jaccept.StdOutLogger
Starting test project NetarchiveSuite System test
  Suite: Full Functional Acceptance Test
[main] INFO dk.netarkivet.systemtest.environment.TestEnvironmentController - Running JSch command (on null): RemoteCommand 
	source /etc/bashrc;source /etc/profile;source ~/.bash_profile;export VERSION=featurebranch;export PORT=8072;export MAILRECEIVERS=null;export TESTX=featurebranch;true;true;export H3ZIP=/home/devel/nas_versions/bundler/NetarchiveSuite-heritrix3-bundler-featurebranch.zip;
	all_test.sh 2>&1 | tee system_test_logs/all_test_out_2019-06-14T13:53:06.241+02:00.txt
[main] INFO dk.netarkivet.systemtest.environment.TestEnvironmentController - Command finished in 277 seconds. Exit code was 0
          Stimuli: Waiting for GUI to start.
java.lang.instrument.IllegalClassFormatException: Error while instrumenting class com/gargoylesoftware/css/parser/javacc/CSS3ParserTokenManager.
	at org.jacoco.agent.rt.internal_b0d6a23.CoverageTransformer.transform(CoverageTransformer.java:95)
	at sun.instrument.TransformerManager.transform(TransformerManager.java:188)
	at sun.instrument.InstrumentationImpl.transform(InstrumentationImpl.java:428)
	at java.lang.ClassLoader.defineClass1(Native Method)
	at java.lang.ClassLoader.defineClass(ClassLoader.java:763)
	at java.security.SecureClassLoader.defineClass(SecureClassLoader.java:142)
	at java.net.URLClassLoader.defineClass(URLClassLoader.java:467)
	at java.net.URLClassLoader.access$100(URLClassLoader.java:73)
	at java.net.URLClassLoader$1.run(URLClassLoader.java:368)
	at java.net.URLClassLoader$1.run(URLClassLoader.java:362)
	at java.security.AccessController.doPrivileged(Native Method)
	at java.net.URLClassLoader.findClass(URLClassLoader.java:361)
	at java.lang.ClassLoader.loadClass(ClassLoader.java:424)
	at sun.misc.Launcher$AppClassLoader.loadClass(Launcher.java:331)
	at java.lang.ClassLoader.loadClass(ClassLoader.java:357)
	at com.gargoylesoftware.css.parser.javacc.CSS3Parser.<init>(CSS3Parser.java:3148)
	at com.gargoylesoftware.css.parser.javacc.CSS3Parser.<init>(CSS3Parser.java:52)
	at com.gargoylesoftware.htmlunit.javascript.host.css.CSSStyleSheet.parseCSS(CSSStyleSheet.java:864)
	at com.gargoylesoftware.htmlunit.javascript.host.css.CSSStyleSheet.<init>(CSSStyleSheet.java:204)
	at com.gargoylesoftware.htmlunit.javascript.host.css.CSSStyleSheet.loadStylesheet(CSSStyleSheet.java:320)
	at com.gargoylesoftware.htmlunit.html.HtmlLink$1.execute(HtmlLink.java:288)
	at com.gargoylesoftware.htmlunit.html.HtmlLink.onAllChildrenAddedToPage(HtmlLink.java:298)
	at com.gargoylesoftware.htmlunit.html.HTMLParser$HtmlUnitDOMBuilder.endElement(HTMLParser.java:802)
	at org.apache.xerces.parsers.AbstractSAXParser.endElement(Unknown Source)
	at com.gargoylesoftware.htmlunit.html.HTMLParser$HtmlUnitDOMBuilder.endElement(HTMLParser.java:758)
	at org.apache.xerces.parsers.AbstractXMLDocumentParser.emptyElement(Unknown Source)
	at net.sourceforge.htmlunit.cyberneko.HTMLTagBalancer.startElement(HTMLTagBalancer.java:781)
	at net.sourceforge.htmlunit.cyberneko.HTMLTagBalancer.emptyElement(HTMLTagBalancer.java:829)
	at net.sourceforge.htmlunit.cyberneko.filters.DefaultFilter.emptyElement(DefaultFilter.java:151)
	at net.sourceforge.htmlunit.cyberneko.filters.NamespaceBinder.emptyElement(NamespaceBinder.java:295)
	at net.sourceforge.htmlunit.cyberneko.HTMLScanner$ContentScanner.scanStartElement(HTMLScanner.java:2811)
	at net.sourceforge.htmlunit.cyberneko.HTMLScanner$ContentScanner.scan(HTMLScanner.java:2149)
	at net.sourceforge.htmlunit.cyberneko.HTMLScanner.scanDocument(HTMLScanner.java:939)
	at net.sourceforge.htmlunit.cyberneko.HTMLConfiguration.parse(HTMLConfiguration.java:452)
	at net.sourceforge.htmlunit.cyberneko.HTMLConfiguration.parse(HTMLConfiguration.java:403)
	at org.apache.xerces.parsers.XMLParser.parse(Unknown Source)
	at com.gargoylesoftware.htmlunit.html.HTMLParser$HtmlUnitDOMBuilder.parse(HTMLParser.java:1001)
	at com.gargoylesoftware.htmlunit.html.HTMLParser.parse(HTMLParser.java:250)
	at com.gargoylesoftware.htmlunit.html.HTMLParser.parseHtml(HTMLParser.java:196)
	at com.gargoylesoftware.htmlunit.DefaultPageCreator.createHtmlPage(DefaultPageCreator.java:267)
	at com.gargoylesoftware.htmlunit.DefaultPageCreator.createPage(DefaultPageCreator.java:158)
	at com.gargoylesoftware.htmlunit.WebClient.loadWebResponseInto(WebClient.java:531)
	at com.gargoylesoftware.htmlunit.WebClient.getPage(WebClient.java:398)
	at com.gargoylesoftware.htmlunit.WebClient.getPage(WebClient.java:315)
	at org.openqa.selenium.htmlunit.HtmlUnitDriver.get(HtmlUnitDriver.java:703)
	at org.openqa.selenium.htmlunit.HtmlUnitDriver.lambda$get$8(HtmlUnitDriver.java:686)
	at org.openqa.selenium.htmlunit.HtmlUnitDriver.lambda$runAsync$0(HtmlUnitDriver.java:428)
	at java.util.concurrent.ThreadPoolExecutor.runWorker(ThreadPoolExecutor.java:1142)
	at java.util.concurrent.ThreadPoolExecutor$Worker.run(ThreadPoolExecutor.java:617)
	at java.lang.Thread.run(Thread.java:745)
Caused by: java.io.IOException: Error while instrumenting class com/gargoylesoftware/css/parser/javacc/CSS3ParserTokenManager.
	at org.jacoco.agent.rt.internal_b0d6a23.core.instr.Instrumenter.instrumentError(Instrumenter.java:152)
	at org.jacoco.agent.rt.internal_b0d6a23.core.instr.Instrumenter.instrument(Instrumenter.java:103)
	at org.jacoco.agent.rt.internal_b0d6a23.CoverageTransformer.transform(CoverageTransformer.java:93)
	... 49 more
Caused by: java.lang.RuntimeException: Method code too large!
	at org.jacoco.agent.rt.internal_b0d6a23.asm.MethodWriter.getSize(MethodWriter.java:2036)
	at org.jacoco.agent.rt.internal_b0d6a23.asm.ClassWriter.toByteArray(ClassWriter.java:827)
	at org.jacoco.agent.rt.internal_b0d6a23.core.instr.Instrumenter.instrument(Instrumenter.java:84)
	at org.jacoco.agent.rt.internal_b0d6a23.core.instr.Instrumenter.instrument(Instrumenter.java:101)
	... 50 more

        Added fixture: Selecting English as language
          Stimuli: Updating configuration defaultconfig
          Stimuli: Loading HarvestDefinition/Definitions-edit-domain.jsp?name=pligtaflevering.dk
    Starting testcase TemplatePageTest
      Test starting: updateTemplateTest
        Description: Tests that harvest tempplates can be updated.
        Step: Goto the template page
          Stimuli: Loading HarvestDefinition/Definitions-edit-harvest-templates.jsp
        Step: Deactivate default_obeyrobots template
        Step: Show inactive templates
        Step: Reactivate default_obeyrobots
        Step: Replace 'default_orderxml' 
          Stimuli: Loading HarvestDefinition/Definitions-edit-harvest-templates.jsp
        Step: Click the upload button.
      Test success: updateTemplateTest
    Starting testcase DomainsPageTest
      Test starting: domainCreationTest
        Description: Tests that domains can be created correctly.
        Step: Click the 'Create domain' link in the left menu under the 'Definitions' section
        Step: Add a domain to the list of domains to be created and click create.
        Step: Goto the 'Find domain' page and search for the newly added domain
          Stimuli: Loading HarvestDefinition/Definitions-find-domains.jsp
      Test success: domainCreationTest
      Test starting: usedConfigurationFilteringTest
        Description: Tests configurations are filtered correctly when using the 'Show/Hide unused configuration' filter.
        Step: Create a new domain
          Stimuli: Creating domains[DomainsPageTest-usedConfigurationFilteringTest-135757-1.dk]
          Stimuli: Loading HarvestDefinition/Definitions-create-domain.jsp
        Step: Create a new configuration
          Stimuli: Creating configurationDomainsPageTest-usedConfigurationFilteringTest-135757-configuration-2.dk
          Stimuli: Loading HarvestDefinition/Definitions-edit-domain.jsp?name=DomainsPageTest-usedConfigurationFilteringTest-135757-1.dk
        Step: Click the 'Show unused configurations' link
          Stimuli: Clicking 'Show unused configurations' link.
        Step: Click the 'Hide unused configurations' link
          Stimuli: Clicking 'Hide unused configurations' link.
        Step: Click the 'Show unused configurations' link again, set the second configuration as default configuration and click save. 
          Stimuli: Clicking 'Show unused configurations' link.
        Step: Click the 'Show unused configurations' link again.
          Stimuli: Clicking 'Show unused configurations' link.
        Step: Create a new active selective harvest for the test domain and select the 'Hide unused configurations' list on the test domain.
      Test success: usedConfigurationFilteringTest
      Test starting: usedSeedListsFilteringTest
        Description: Tests seed lists are filtered correctly when using the 'Show/Hide unused seed list' filter.
        Step: Create a new domain
          Stimuli: Creating domains[DomainsPageTest-usedSeedListsFilteringTest-135758-1.dk]
          Stimuli: Loading HarvestDefinition/Definitions-create-domain.jsp
        Step: Create a new seed list
          Stimuli: Creating configurationDomainsPageTest-usedSeedListsFilteringTest-135758-seedlist-2.dk([Ljava.lang.String;@6c85dbe8)
          Stimuli: Loading HarvestDefinition/Definitions-edit-domain.jsp?name=DomainsPageTest-usedSeedListsFilteringTest-135758-1.dk
        Step: Click the 'Show unused seed list' link
          Stimuli: Clicking 'Show unused seed lists' link.
        Step: Click the 'Hide unused seed lists' link
          Stimuli: Clicking 'Hide unused seed lists' link.
        Step: Add the new seed list to the default config (which is a used config)
        Step: Remove the default seed list from the default configuration
      Test success: usedSeedListsFilteringTest
    Starting testcase ExtendedFieldTest
      Test starting: extendedDomainStringFieldTest
        Description: Tests that String type extended fields works correctly on domains.
        Step: Create a new String type field (name:extendedDomainStringFieldTest-135800) for domains
          Stimuli: Loading HarvestDefinition/Definitions-list-extendedfields.jsp
        Step: Edit the default domain (pligtaflevering.dk)
          Stimuli: Loading HarvestDefinition/Definitions-edit-domain.jsp?name=pligtaflevering.dk
        Step: Fill out the new extended field with a value and save the updated domain
        Step: Reopen the domain
      Test success: extendedDomainStringFieldTest
    Starting testcase SelectiveHarvestTest
      Test starting: jobSplittingTest
          Stimuli: Creating domains[d0-fFwhVh.dk]
          Stimuli: Loading HarvestDefinition/Definitions-create-domain.jsp
          Stimuli: Creating configurationnewconf_YvrxfH
          Stimuli: Loading HarvestDefinition/Definitions-edit-domain.jsp?name=d0-fFwhVh.dk
          Stimuli: Updating configuration newconf_YvrxfH
          Stimuli: Loading HarvestDefinition/Definitions-edit-domain.jsp?name=d0-fFwhVh.dk
          Stimuli: Creating domains[d1-fFwhVh.dk]
          Stimuli: Loading HarvestDefinition/Definitions-create-domain.jsp
          Stimuli: Creating configurationnewconf_YvrxfH
          Stimuli: Loading HarvestDefinition/Definitions-edit-domain.jsp?name=d1-fFwhVh.dk
          Stimuli: Updating configuration newconf_YvrxfH
          Stimuli: Loading HarvestDefinition/Definitions-edit-domain.jsp?name=d1-fFwhVh.dk
          Stimuli: Creating domains[d2-fFwhVh.dk]
          Stimuli: Loading HarvestDefinition/Definitions-create-domain.jsp
          Stimuli: Creating configurationnewconf_YvrxfH
          Stimuli: Loading HarvestDefinition/Definitions-edit-domain.jsp?name=d2-fFwhVh.dk
          Stimuli: Updating configuration newconf_YvrxfH
          Stimuli: Loading HarvestDefinition/Definitions-edit-domain.jsp?name=d2-fFwhVh.dk
          Stimuli: Creating domains[d3-fFwhVh.dk]
          Stimuli: Loading HarvestDefinition/Definitions-create-domain.jsp
          Stimuli: Creating configurationnewconf_YvrxfH
          Stimuli: Loading HarvestDefinition/Definitions-edit-domain.jsp?name=d3-fFwhVh.dk
          Stimuli: Updating configuration newconf_YvrxfH
          Stimuli: Loading HarvestDefinition/Definitions-edit-domain.jsp?name=d3-fFwhVh.dk
          Stimuli: Creating domains[d4-fFwhVh.dk]
          Stimuli: Loading HarvestDefinition/Definitions-create-domain.jsp
          Stimuli: Creating configurationnewconf_YvrxfH
          Stimuli: Loading HarvestDefinition/Definitions-edit-domain.jsp?name=d4-fFwhVh.dk
          Stimuli: Updating configuration newconf_YvrxfH
          Stimuli: Loading HarvestDefinition/Definitions-edit-domain.jsp?name=d4-fFwhVh.dk
          Stimuli: Creating domains[d5-fFwhVh.dk]
          Stimuli: Loading HarvestDefinition/Definitions-create-domain.jsp
          Stimuli: Creating configurationnewconf_YvrxfH
          Stimuli: Loading HarvestDefinition/Definitions-edit-domain.jsp?name=d5-fFwhVh.dk
          Stimuli: Updating configuration newconf_YvrxfH
          Stimuli: Loading HarvestDefinition/Definitions-edit-domain.jsp?name=d5-fFwhVh.dk
          Stimuli: Creating domains[d6-fFwhVh.dk]
          Stimuli: Loading HarvestDefinition/Definitions-create-domain.jsp
          Stimuli: Creating configurationnewconf_YvrxfH
          Stimuli: Loading HarvestDefinition/Definitions-edit-domain.jsp?name=d6-fFwhVh.dk
          Stimuli: Updating configuration newconf_YvrxfH
          Stimuli: Loading HarvestDefinition/Definitions-edit-domain.jsp?name=d6-fFwhVh.dk
          Stimuli: Creating domains[d7-fFwhVh.dk]
          Stimuli: Loading HarvestDefinition/Definitions-create-domain.jsp
          Stimuli: Creating configurationnewconf_YvrxfH
          Stimuli: Loading HarvestDefinition/Definitions-edit-domain.jsp?name=d7-fFwhVh.dk
          Stimuli: Updating configuration newconf_YvrxfH
          Stimuli: Loading HarvestDefinition/Definitions-edit-domain.jsp?name=d7-fFwhVh.dk
          Stimuli: Creating domains[d8-fFwhVh.dk]
          Stimuli: Loading HarvestDefinition/Definitions-create-domain.jsp
          Stimuli: Creating configurationnewconf_YvrxfH
          Stimuli: Loading HarvestDefinition/Definitions-edit-domain.jsp?name=d8-fFwhVh.dk
          Stimuli: Updating configuration newconf_YvrxfH
          Stimuli: Loading HarvestDefinition/Definitions-edit-domain.jsp?name=d8-fFwhVh.dk
          Stimuli: Creating domains[d9-fFwhVh.dk]
          Stimuli: Loading HarvestDefinition/Definitions-create-domain.jsp
          Stimuli: Creating configurationnewconf_YvrxfH
          Stimuli: Loading HarvestDefinition/Definitions-edit-domain.jsp?name=d9-fFwhVh.dk
          Stimuli: Updating configuration newconf_YvrxfH
          Stimuli: Loading HarvestDefinition/Definitions-edit-domain.jsp?name=d9-fFwhVh.dk
          Stimuli: Creating domains[d10-fFwhVh.dk]
          Stimuli: Loading HarvestDefinition/Definitions-create-domain.jsp
          Stimuli: Creating configurationnewconf_YvrxfH
          Stimuli: Loading HarvestDefinition/Definitions-edit-domain.jsp?name=d10-fFwhVh.dk
          Stimuli: Updating configuration newconf_YvrxfH
          Stimuli: Loading HarvestDefinition/Definitions-edit-domain.jsp?name=d10-fFwhVh.dk
          Stimuli: Creating harvest splitharvest_IXbobP
          Stimuli: Loading HarvestDefinition/Definitions-selective-harvests.jsp
          Stimuli: Activating harvest splitharvest_IXbobP
          Stimuli: Loading HarvestDefinition/Definitions-selective-harvests.jsp
          Stimuli: Activating harvest splitharvest_IXbobP
          Stimuli: Loading HarvestDefinition/Definitions-selective-harvests.jsp
.      Test failed: java.lang.AssertionError: Expected to generate one job per distinct configuration for splitharvest_IXbobP. expected [8] but found [6]
      Test starting: selectiveHarvestListingTest
        Description: Verify the functionality of the harvest listings.
        Reference: http://netarchive.dk/suite/TEST1
        Step: Create a selective harvest
          Stimuli: Creating harvest SelectiveHarvestTest-selectiveHarvestListingTest-135905-1
          Stimuli: Loading HarvestDefinition/Definitions-selective-harvests.jsp
        Step: Create a second harvest and active it
          Stimuli: Creating harvest SelectiveHarvestTest-selectiveHarvestListingTest-135905-2
          Stimuli: Loading HarvestDefinition/Definitions-selective-harvests.jsp
          Stimuli: Activating harvest SelectiveHarvestTest-selectiveHarvestListingTest-135905-2
          Stimuli: Loading HarvestDefinition/Definitions-selective-harvests.jsp
        Step: Hide inactive harvests
        Step: Show inactive harvests
      Test success: selectiveHarvestListingTest
      Test starting: snapshotTest
          Stimuli: Loading HarvestDefinition/Definitions-find-domains.jsp
          Stimuli: Loading HarvestDefinition/Definitions-snapshot-harvests.jsp
.[main] INFO dk.netarkivet.systemtest.environment.TestEnvironmentController - Running JSch command (on kb-test-adm-001.kb.dk): RemoteCommand sshTunneling=ssh kb-test-adm-001.kb.dk 
	source /etc/bashrc;source /etc/profile;source ~/.bash_profile;export VERSION=featurebranch;export PORT=8072;export MAILRECEIVERS=null;export TESTX=featurebranch;true;true;export H3ZIP=/home/devel/nas_versions/bundler/NetarchiveSuite-heritrix3-bundler-featurebranch.zip;
	grep 'Created' ${HOME}/featurebranch/log/HarvestJobManager*
[main] INFO dk.netarkivet.systemtest.environment.TestEnvironmentController - Command finished in 1 seconds. Exit code was 0
.[main] INFO dk.netarkivet.systemtest.environment.TestEnvironmentController - Running JSch command (on kb-test-adm-001.kb.dk): RemoteCommand sshTunneling=ssh kb-test-adm-001.kb.dk 
	source /etc/bashrc;source /etc/profile;source ~/.bash_profile;export VERSION=featurebranch;export PORT=8072;export MAILRECEIVERS=null;export TESTX=featurebranch;true;true;export H3ZIP=/home/devel/nas_versions/bundler/NetarchiveSuite-heritrix3-bundler-featurebranch.zip;
	grep 'Created' ${HOME}/featurebranch/log/HarvestJobManager*
[main] INFO dk.netarkivet.systemtest.environment.TestEnvironmentController - Command finished in 1 seconds. Exit code was 0
          Stimuli: Loading History/Harveststatus-alljobs.jsp
      Test success: snapshotTest
    Starting testcase SystemOverviewTest
      Test starting: generalTest
        Description: Test specification: http://netarchive.dk/suite/It23JMXMailCheck
        Step: Goto the Systemstate page and wait for the extected number of applications to appear.
        Step: Click the 'Instance id' link (We need to do this to differentiate between instances of the same application running on the same machine)
      Test success: generalTest
      Finished testcase
          Stimuli: Deactivating all harvests
          Stimuli: Loading HarvestDefinition/Definitions-selective-harvests.jsp
          Stimuli: Deactivating harvest: SelectiveHarvestTest-selectiveHarvestListingTest-135905-2
          Stimuli: Deactivating harvest: splitharvest_IXbobP
  Finished suite
Finished project
Tests run: 9, Failures: 1, Errors: 0, Skipped: 0, Time elapsed: 404.968 sec <<< FAILURE! - in TestSuite
jobSplittingTest(dk.netarkivet.systemtest.functional.SelectiveHarvestTest)  Time elapsed: 64.815 sec  <<< FAILURE!
java.lang.AssertionError: Expected to generate one job per distinct configuration for splitharvest_IXbobP. expected [8] but found [6]
	at org.testng.Assert.fail(Assert.java:94)
	at org.testng.Assert.failNotEquals(Assert.java:494)
	at org.testng.Assert.assertEquals(Assert.java:123)
	at org.testng.Assert.assertEquals(Assert.java:370)
	at dk.netarkivet.systemtest.functional.SelectiveHarvestTest.jobSplittingTest(SelectiveHarvestTest.java:160)


Results :

Failed tests: 
  SelectiveHarvestTest.jobSplittingTest:160 Expected to generate one job per distinct configuration for splitharvest_IXbobP. expected [8] but found [6]

Tests run: 9, Failures: 1, Errors: 0, Skipped: 0

[JENKINS] Recording test results
log4j:WARN No appenders could be found for logger (org.apache.commons.beanutils.converters.BooleanConverter).
log4j:WARN Please initialize the log4j system properly.
[JENKINS] Archiving disabled