SuccessConsole Output

[INFO]                                                                         
[INFO] ------------------------------------------------------------------------
[INFO] Building NetarchiveSuite - wayback resourceStore 5.4.3-SNAPSHOT
[INFO] ------------------------------------------------------------------------
[INFO] 
[INFO] --- maven-clean-plugin:2.5:clean (default-clean) @ wayback-resourcestore ---
[INFO] 
[INFO] --- jacoco-maven-plugin:0.7.9:prepare-agent (agent) @ wayback-resourcestore ---
[INFO] argLine set to -javaagent:/home/cibuild02/.m2/repository/org/jacoco/org.jacoco.agent/0.7.9/org.jacoco.agent-0.7.9-runtime.jar=destfile=/home/cibuild02/workspace/NetarchiveSuite-Full-Test-staging/wayback/wayback-resourcestore/../target/jacoco.exec,append=true
[INFO] 
[INFO] --- maven-resources-plugin:2.6:resources (default-resources) @ wayback-resourcestore ---
[INFO] Using 'UTF-8' encoding to copy filtered resources.
[INFO] skip non existing resourceDirectory /home/cibuild02/workspace/NetarchiveSuite-Full-Test-staging/wayback/wayback-resourcestore/src/main/resources
[INFO] 
[INFO] --- maven-compiler-plugin:3.1:compile (default-compile) @ wayback-resourcestore ---
[INFO] Changes detected - recompiling the module!
[INFO] Compiling 7 source files to /home/cibuild02/workspace/NetarchiveSuite-Full-Test-staging/wayback/wayback-resourcestore/target/classes
[INFO] 
[INFO] --- maven-resources-plugin:2.6:testResources (default-testResources) @ wayback-resourcestore ---
[INFO] Using 'UTF-8' encoding to copy filtered resources.
[INFO] skip non existing resourceDirectory /home/cibuild02/workspace/NetarchiveSuite-Full-Test-staging/wayback/wayback-resourcestore/src/test/resources
[INFO] 
[INFO] --- maven-compiler-plugin:3.1:testCompile (default-testCompile) @ wayback-resourcestore ---
[INFO] Changes detected - recompiling the module!
[INFO] Compiling 4 source files to /home/cibuild02/workspace/NetarchiveSuite-Full-Test-staging/wayback/wayback-resourcestore/target/test-classes
[INFO] 
[INFO] --- maven-surefire-plugin:2.17:test (default-test) @ wayback-resourcestore ---
[INFO] Surefire report directory: /home/cibuild02/workspace/NetarchiveSuite-Full-Test-staging/wayback/wayback-resourcestore/target/surefire-reports

-------------------------------------------------------
 T E S T S
-------------------------------------------------------
Running dk.netarkivet.wayback.NetarchiveResourceStoreWarcTester
Tests run: 1, Failures: 0, Errors: 0, Skipped: 1, Time elapsed: 0.07 sec - in dk.netarkivet.wayback.NetarchiveResourceStoreWarcTester
Running dk.netarkivet.wayback.NetarchiveResourceStoreTester
10:48:09.784 [main] DEBUG dk.netarkivet.common.utils.Settings - Value found in loaded data: test/testdata/archive
10:48:09.823 [main] INFO dk.netarkivet.common.distribute.arcrepository.LocalArcRepositoryClient - directory '/home/cibuild02/workspace/NetarchiveSuite-Full-Test-staging/wayback/wayback-resourcestore/test/testdata/archive' is part of this local archive repository
10:48:09.870 [main] DEBUG dk.netarkivet.common.utils.Settings - Value found in loaded data: test/testdata/archive
10:48:09.872 [main] INFO dk.netarkivet.common.distribute.arcrepository.LocalArcRepositoryClient - directory '/home/cibuild02/workspace/NetarchiveSuite-Full-Test-staging/wayback/wayback-resourcestore/test/testdata/archive' is part of this local archive repository
10:48:09.886 [main] ERROR dk.netarkivet.wayback.NetarchiveResourceStore - Error looking for non existing resource
java.lang.NumberFormatException: null
	at java.lang.Long.parseLong(Long.java:552)
	at java.lang.Long.parseLong(Long.java:631)
	at org.archive.wayback.core.CaptureSearchResult.getOffset(CaptureSearchResult.java:252)
	at dk.netarkivet.wayback.NetarchiveResourceStore.retrieveResource(NetarchiveResourceStore.java:80)
	at dk.netarkivet.wayback.NetarchiveResourceStoreTester.testResourceNotAvailable(NetarchiveResourceStoreTester.java:130)
	at sun.reflect.NativeMethodAccessorImpl.invoke0(Native Method)
	at sun.reflect.NativeMethodAccessorImpl.invoke(NativeMethodAccessorImpl.java:62)
	at sun.reflect.DelegatingMethodAccessorImpl.invoke(DelegatingMethodAccessorImpl.java:43)
	at java.lang.reflect.Method.invoke(Method.java:498)
	at org.junit.runners.model.FrameworkMethod$1.runReflectiveCall(FrameworkMethod.java:47)
	at org.junit.internal.runners.model.ReflectiveCallable.run(ReflectiveCallable.java:12)
	at org.junit.runners.model.FrameworkMethod.invokeExplosively(FrameworkMethod.java:44)
	at org.junit.internal.runners.statements.InvokeMethod.evaluate(InvokeMethod.java:17)
	at org.junit.internal.runners.statements.ExpectException.evaluate(ExpectException.java:19)
	at org.junit.internal.runners.statements.RunBefores.evaluate(RunBefores.java:26)
	at org.junit.internal.runners.statements.RunAfters.evaluate(RunAfters.java:27)
	at org.junit.rules.TestWatcher$1.evaluate(TestWatcher.java:55)
	at org.junit.rules.RunRules.evaluate(RunRules.java:20)
	at org.junit.runners.ParentRunner.runLeaf(ParentRunner.java:271)
	at org.junit.runners.BlockJUnit4ClassRunner.runChild(BlockJUnit4ClassRunner.java:70)
	at org.junit.runners.BlockJUnit4ClassRunner.runChild(BlockJUnit4ClassRunner.java:50)
	at org.junit.runners.ParentRunner$3.run(ParentRunner.java:238)
	at org.junit.runners.ParentRunner$1.schedule(ParentRunner.java:63)
	at org.junit.runners.ParentRunner.runChildren(ParentRunner.java:236)
	at org.junit.runners.ParentRunner.access$000(ParentRunner.java:53)
	at org.junit.runners.ParentRunner$2.evaluate(ParentRunner.java:229)
	at org.junit.runners.ParentRunner.run(ParentRunner.java:309)
	at org.apache.maven.surefire.junit4.JUnit4Provider.execute(JUnit4Provider.java:264)
	at org.apache.maven.surefire.junit4.JUnit4Provider.executeTestSet(JUnit4Provider.java:153)
	at org.apache.maven.surefire.junit4.JUnit4Provider.invoke(JUnit4Provider.java:124)
	at org.apache.maven.surefire.booter.ForkedBooter.invokeProviderInSameClassLoader(ForkedBooter.java:200)
	at org.apache.maven.surefire.booter.ForkedBooter.runSuitesInProcess(ForkedBooter.java:153)
	at org.apache.maven.surefire.booter.ForkedBooter.main(ForkedBooter.java:103)
10:48:09.903 [main] DEBUG dk.netarkivet.common.utils.Settings - Value found in loaded data: test/testdata/archive
10:48:09.909 [main] INFO dk.netarkivet.common.distribute.arcrepository.LocalArcRepositoryClient - directory '/home/cibuild02/workspace/NetarchiveSuite-Full-Test-staging/wayback/wayback-resourcestore/test/testdata/archive' is part of this local archive repository
10:48:09.911 [main] DEBUG dk.netarkivet.common.utils.Settings - Value found in loaded data: test/testdata/archive
10:48:09.916 [main] INFO dk.netarkivet.common.distribute.arcrepository.LocalArcRepositoryClient - directory '/home/cibuild02/workspace/NetarchiveSuite-Full-Test-staging/wayback/wayback-resourcestore/test/testdata/archive' is part of this local archive repository
10:48:09.916 [main] INFO dk.netarkivet.wayback.NetarchiveResourceStore - Received request for resource from file '2-metadata-1.arc' at offset '0'
10:48:09.917 [main] WARN dk.netarkivet.common.distribute.arcrepository.LocalArcRepositoryClient - File '2-metadata-1.arc' does not exist. Null BitarchiveRecord returned
10:48:09.929 [main] DEBUG dk.netarkivet.common.utils.Settings - Value found in loaded data: test/testdata/archive
10:48:09.930 [main] INFO dk.netarkivet.common.distribute.arcrepository.LocalArcRepositoryClient - directory '/home/cibuild02/workspace/NetarchiveSuite-Full-Test-staging/wayback/wayback-resourcestore/test/testdata/archive' is part of this local archive repository
10:48:09.932 [main] DEBUG dk.netarkivet.common.utils.Settings - Value found in loaded data: test/testdata/archive
10:48:09.933 [main] INFO dk.netarkivet.common.distribute.arcrepository.LocalArcRepositoryClient - directory '/home/cibuild02/workspace/NetarchiveSuite-Full-Test-staging/wayback/wayback-resourcestore/test/testdata/archive' is part of this local archive repository
10:48:09.942 [main] DEBUG dk.netarkivet.common.utils.Settings - Value found in loaded data: test/testdata/archive
10:48:09.945 [main] INFO dk.netarkivet.common.distribute.arcrepository.LocalArcRepositoryClient - directory '/home/cibuild02/workspace/NetarchiveSuite-Full-Test-staging/wayback/wayback-resourcestore/test/testdata/archive' is part of this local archive repository
10:48:09.950 [main] DEBUG dk.netarkivet.common.utils.Settings - Value found in loaded data: test/testdata/archive
10:48:09.951 [main] INFO dk.netarkivet.common.distribute.arcrepository.LocalArcRepositoryClient - directory '/home/cibuild02/workspace/NetarchiveSuite-Full-Test-staging/wayback/wayback-resourcestore/test/testdata/archive' is part of this local archive repository
10:48:09.955 [main] DEBUG dk.netarkivet.common.utils.Settings - Value found in loaded data: test/testdata/archive
10:48:09.956 [main] INFO dk.netarkivet.common.distribute.arcrepository.LocalArcRepositoryClient - directory '/home/cibuild02/workspace/NetarchiveSuite-Full-Test-staging/wayback/wayback-resourcestore/test/testdata/archive' is part of this local archive repository
10:48:09.980 [main] INFO dk.netarkivet.wayback.NetarchiveResourceStore - Received request for resource from file 'arcfile_withredirects.arc' at offset '3311'
10:48:10.135 [main] DEBUG dk.netarkivet.common.distribute.arcrepository.BitarchiveRecord - Bytes stored in objectBuffer: 241
10:48:10.140 [main] INFO dk.netarkivet.wayback.NetarchiveResourceStore - Retrieved resource from file 'arcfile_withredirects.arc' at offset '3311'
10:48:10.141 [main] DEBUG dk.netarkivet.common.distribute.arcrepository.BitarchiveRecord - Reading 241 bytes from objectBuffer
10:48:10.265 [main] DEBUG dk.netarkivet.wayback.NetarchiveResourceStore - ARCRecord created with code '302'
10:48:10.273 [main] DEBUG dk.netarkivet.wayback.NetarchiveResourceStore - Headers: null
10:48:10.278 [main] INFO dk.netarkivet.wayback.NetarchiveResourceStore - Returning resource 'org.archive.wayback.resourcestore.resourcefile.ArcResource@3cd26422'
10:48:10.295 [main] DEBUG dk.netarkivet.common.utils.Settings - Value found in loaded data: test/testdata/archive
10:48:10.296 [main] INFO dk.netarkivet.common.distribute.arcrepository.LocalArcRepositoryClient - directory '/home/cibuild02/workspace/NetarchiveSuite-Full-Test-staging/wayback/wayback-resourcestore/test/testdata/archive' is part of this local archive repository
10:48:10.299 [main] DEBUG dk.netarkivet.common.utils.Settings - Value found in loaded data: test/testdata/archive
10:48:10.300 [main] INFO dk.netarkivet.common.distribute.arcrepository.LocalArcRepositoryClient - directory '/home/cibuild02/workspace/NetarchiveSuite-Full-Test-staging/wayback/wayback-resourcestore/test/testdata/archive' is part of this local archive repository
10:48:10.308 [main] DEBUG dk.netarkivet.common.utils.Settings - Value found in loaded data: test/testdata/archive
10:48:10.312 [main] INFO dk.netarkivet.common.distribute.arcrepository.LocalArcRepositoryClient - directory '/home/cibuild02/workspace/NetarchiveSuite-Full-Test-staging/wayback/wayback-resourcestore/test/testdata/archive' is part of this local archive repository
10:48:10.314 [main] DEBUG dk.netarkivet.common.utils.Settings - Value found in loaded data: test/testdata/archive
10:48:10.315 [main] INFO dk.netarkivet.common.distribute.arcrepository.LocalArcRepositoryClient - directory '/home/cibuild02/workspace/NetarchiveSuite-Full-Test-staging/wayback/wayback-resourcestore/test/testdata/archive' is part of this local archive repository
10:48:10.318 [main] DEBUG dk.netarkivet.common.utils.Settings - Value found in loaded data: test/testdata/archive
10:48:10.319 [main] INFO dk.netarkivet.common.distribute.arcrepository.LocalArcRepositoryClient - directory '/home/cibuild02/workspace/NetarchiveSuite-Full-Test-staging/wayback/wayback-resourcestore/test/testdata/archive' is part of this local archive repository
10:48:10.319 [main] INFO dk.netarkivet.wayback.NetarchiveResourceStore - Received request for resource from file 'arcfile_withredirects.arc' at offset '3619'
10:48:10.333 [main] DEBUG dk.netarkivet.common.distribute.arcrepository.BitarchiveRecord - Bytes stored in objectBuffer: 67439
10:48:10.334 [main] INFO dk.netarkivet.wayback.NetarchiveResourceStore - Retrieved resource from file 'arcfile_withredirects.arc' at offset '3619'
10:48:10.334 [main] DEBUG dk.netarkivet.common.distribute.arcrepository.BitarchiveRecord - Reading 67439 bytes from objectBuffer
10:48:10.341 [main] DEBUG dk.netarkivet.wayback.NetarchiveResourceStore - ARCRecord created with code '200'
10:48:10.341 [main] DEBUG dk.netarkivet.wayback.NetarchiveResourceStore - Headers: null
10:48:10.341 [main] INFO dk.netarkivet.wayback.NetarchiveResourceStore - Returning resource 'org.archive.wayback.resourcestore.resourcefile.ArcResource@2eda072'
Tests run: 6, Failures: 0, Errors: 0, Skipped: 0, Time elapsed: 1.833 sec - in dk.netarkivet.wayback.NetarchiveResourceStoreTester
Running dk.netarkivet.wayback.LRUCacheTester
Tests run: 1, Failures: 0, Errors: 0, Skipped: 1, Time elapsed: 0.003 sec - in dk.netarkivet.wayback.LRUCacheTester

Results :

Tests run: 8, Failures: 0, Errors: 0, Skipped: 2

[JENKINS] Recording test results
[INFO] 
[INFO] --- maven-jgit-buildnumber-plugin:1.2.9:extract-buildnumber (git-buildnumber) @ wayback-resourcestore ---
[INFO] 
[INFO] --- maven-jar-plugin:2.4:jar (default-jar) @ wayback-resourcestore ---
[INFO] Building jar: /home/cibuild02/workspace/NetarchiveSuite-Full-Test-staging/wayback/wayback-resourcestore/target/wayback-resourcestore-5.4.3-SNAPSHOT.jar
[INFO] 
[INFO] >>> maven-source-plugin:2.2.1:jar (attach-sources) > generate-sources @ wayback-resourcestore >>>
[INFO] 
[INFO] --- jacoco-maven-plugin:0.7.9:prepare-agent (agent) @ wayback-resourcestore ---
[INFO] argLine set to -javaagent:/home/cibuild02/.m2/repository/org/jacoco/org.jacoco.agent/0.7.9/org.jacoco.agent-0.7.9-runtime.jar=destfile=/home/cibuild02/workspace/NetarchiveSuite-Full-Test-staging/wayback/wayback-resourcestore/../target/jacoco.exec,append=true
[WARNING] Failed to getClass for org.apache.maven.plugin.source.SourceJarMojo
[INFO] 
[INFO] <<< maven-source-plugin:2.2.1:jar (attach-sources) < generate-sources @ wayback-resourcestore <<<
[INFO] 
[INFO] --- maven-source-plugin:2.2.1:jar (attach-sources) @ wayback-resourcestore ---
[INFO] Building jar: /home/cibuild02/workspace/NetarchiveSuite-Full-Test-staging/wayback/wayback-resourcestore/target/wayback-resourcestore-5.4.3-SNAPSHOT-sources.jar
[INFO] 
[INFO] --- maven-javadoc-plugin:2.10.3:jar (attach-javadocs) @ wayback-resourcestore ---
[ERROR] Error fetching link: /home/cibuild02/workspace/NetarchiveSuite-Full-Test-staging/common/common-core/target/apidocs/package-list. Ignored it.
[ERROR] Error fetching link: /home/cibuild02/workspace/NetarchiveSuite-Full-Test-staging/common/common-test/target/apidocs/package-list. Ignored it.
[ERROR] Error fetching link: /home/cibuild02/workspace/NetarchiveSuite-Full-Test-staging/archive/archive-core/target/apidocs/package-list. Ignored it.
[INFO] Building jar: /home/cibuild02/workspace/NetarchiveSuite-Full-Test-staging/wayback/wayback-resourcestore/target/wayback-resourcestore-5.4.3-SNAPSHOT-javadoc.jar
[INFO] 
[INFO] --- maven-install-plugin:2.4:install (default-install) @ wayback-resourcestore ---
[INFO] Installing /home/cibuild02/workspace/NetarchiveSuite-Full-Test-staging/wayback/wayback-resourcestore/target/wayback-resourcestore-5.4.3-SNAPSHOT.jar to /home/cibuild02/.m2/repository/org/netarchivesuite/wayback-resourcestore/5.4.3-SNAPSHOT/wayback-resourcestore-5.4.3-SNAPSHOT.jar
[INFO] Installing /home/cibuild02/workspace/NetarchiveSuite-Full-Test-staging/wayback/wayback-resourcestore/pom.xml to /home/cibuild02/.m2/repository/org/netarchivesuite/wayback-resourcestore/5.4.3-SNAPSHOT/wayback-resourcestore-5.4.3-SNAPSHOT.pom
[INFO] Installing /home/cibuild02/workspace/NetarchiveSuite-Full-Test-staging/wayback/wayback-resourcestore/target/wayback-resourcestore-5.4.3-SNAPSHOT-sources.jar to /home/cibuild02/.m2/repository/org/netarchivesuite/wayback-resourcestore/5.4.3-SNAPSHOT/wayback-resourcestore-5.4.3-SNAPSHOT-sources.jar
[INFO] Installing /home/cibuild02/workspace/NetarchiveSuite-Full-Test-staging/wayback/wayback-resourcestore/target/wayback-resourcestore-5.4.3-SNAPSHOT-javadoc.jar to /home/cibuild02/.m2/repository/org/netarchivesuite/wayback-resourcestore/5.4.3-SNAPSHOT/wayback-resourcestore-5.4.3-SNAPSHOT-javadoc.jar
[INFO] 
[INFO] --- maven-clean-plugin:2.5:clean (default-clean) @ wayback-resourcestore ---
[INFO] Deleting /home/cibuild02/workspace/NetarchiveSuite-Full-Test-staging/wayback/wayback-resourcestore/target
[JENKINS] Archiving disabled