SuccessConsole Output

[INFO]                                                                         
[INFO] ------------------------------------------------------------------------
[INFO] Building NetarchiveSuite - heritrix3 monitor 5.4.3-SNAPSHOT
[INFO] ------------------------------------------------------------------------
[INFO] 
[INFO] --- maven-clean-plugin:2.5:clean (default-clean) @ heritrix3-monitor ---
[INFO] Deleting /home/cibuild02/workspace/NetarchiveSuite-Full-Test-staging/harvester/heritrix3/heritrix3-monitor/target
[INFO] 
[INFO] --- maven-resources-plugin:2.6:resources (default-resources) @ heritrix3-monitor ---
[INFO] Using 'UTF-8' encoding to copy filtered resources.
[INFO] Copying 1 resource
[INFO] 
[INFO] --- maven-compiler-plugin:3.1:compile (default-compile) @ heritrix3-monitor ---
[INFO] Changes detected - recompiling the module!
[INFO] Compiling 27 source files to /home/cibuild02/workspace/NetarchiveSuite-Full-Test-staging/harvester/heritrix3/heritrix3-monitor/target/classes
[INFO] 
[INFO] --- maven-resources-plugin:2.6:testResources (default-testResources) @ heritrix3-monitor ---
[INFO] Using 'UTF-8' encoding to copy filtered resources.
[INFO] skip non existing resourceDirectory /home/cibuild02/workspace/NetarchiveSuite-Full-Test-staging/harvester/heritrix3/heritrix3-monitor/src/test/resources
[INFO] 
[INFO] --- maven-compiler-plugin:3.1:testCompile (default-testCompile) @ heritrix3-monitor ---
[INFO] Changes detected - recompiling the module!
[INFO] Compiling 1 source file to /home/cibuild02/workspace/NetarchiveSuite-Full-Test-staging/harvester/heritrix3/heritrix3-monitor/target/test-classes
[INFO] 
[INFO] --- maven-surefire-plugin:2.17:test (default-test) @ heritrix3-monitor ---
[INFO] Surefire report directory: /home/cibuild02/workspace/NetarchiveSuite-Full-Test-staging/harvester/heritrix3/heritrix3-monitor/target/surefire-reports

-------------------------------------------------------
 T E S T S
-------------------------------------------------------
Running dk.netarkivet.heritrix3.monitor.TestAcceptLanguageHeader
Tests run: 1, Failures: 0, Errors: 0, Skipped: 0, Time elapsed: 0.743 sec - in dk.netarkivet.heritrix3.monitor.TestAcceptLanguageHeader

Results :

Tests run: 1, Failures: 0, Errors: 0, Skipped: 0

[JENKINS] Recording test results
[INFO] 
[INFO] --- maven-jgit-buildnumber-plugin:1.2.9:extract-buildnumber (git-buildnumber) @ heritrix3-monitor ---
[INFO] 
[INFO] --- maven-jar-plugin:2.4:jar (default-jar) @ heritrix3-monitor ---
[INFO] Building jar: /home/cibuild02/workspace/NetarchiveSuite-Full-Test-staging/harvester/heritrix3/heritrix3-monitor/target/heritrix3-monitor-5.4.3-SNAPSHOT.jar
[INFO] 
[INFO] --- maven-assembly-plugin:2.4.1:single (distro-assembly) @ heritrix3-monitor ---
[INFO] Reading assembly descriptor: src/main/assembly/assembly.xml
[WARNING] The following patterns were never triggered in this artifact exclusion filter:
o  'org.eclipse.jetty:*:jar'
o  'org.eclipse.jetty.websocket:*:jar'
o  'org.eclipse.jetty.orbit:*:jar'
o  'org.glassfish:*:jar'
o  'org.glassfish.web:*:jar'
o  'javax.servlet:*:jar'
o  'javax.servlet.jsp:*:jar'
o  'org.ow2.asm:*:jar'
o  'commons-configuration:commons-configuration:jar:1.6'
o  'org.apache.httpcomponents:httpclient:jar:4.2.5'
o  'org.apache.httpcomponents:httpcore:jar:4.2.4'

[INFO] Building tar: /home/cibuild02/workspace/NetarchiveSuite-Full-Test-staging/harvester/heritrix3/heritrix3-monitor/target/NetarchiveSuite-heritrix3-monitor-5.4.3-SNAPSHOT.tar.gz
[WARNING] The following patterns were never triggered in this artifact exclusion filter:
o  'org.eclipse.jetty:*:jar'
o  'org.eclipse.jetty.websocket:*:jar'
o  'org.eclipse.jetty.orbit:*:jar'
o  'org.glassfish:*:jar'
o  'org.glassfish.web:*:jar'
o  'javax.servlet:*:jar'
o  'javax.servlet.jsp:*:jar'
o  'org.ow2.asm:*:jar'
o  'commons-configuration:commons-configuration:jar:1.6'
o  'org.apache.httpcomponents:httpclient:jar:4.2.5'
o  'org.apache.httpcomponents:httpcore:jar:4.2.4'

[INFO] Building zip: /home/cibuild02/workspace/NetarchiveSuite-Full-Test-staging/harvester/heritrix3/heritrix3-monitor/target/NetarchiveSuite-heritrix3-monitor-5.4.3-SNAPSHOT.zip
[INFO] 
[INFO] >>> maven-source-plugin:2.2.1:jar (attach-sources) > generate-sources @ heritrix3-monitor >>>
[WARNING] Failed to getClass for org.apache.maven.plugin.source.SourceJarMojo
[INFO] 
[INFO] <<< maven-source-plugin:2.2.1:jar (attach-sources) < generate-sources @ heritrix3-monitor <<<
[INFO] 
[INFO] --- maven-source-plugin:2.2.1:jar (attach-sources) @ heritrix3-monitor ---
[INFO] Building jar: /home/cibuild02/workspace/NetarchiveSuite-Full-Test-staging/harvester/heritrix3/heritrix3-monitor/target/heritrix3-monitor-5.4.3-SNAPSHOT-sources.jar
[INFO] 
[INFO] --- maven-javadoc-plugin:2.10.3:jar (attach-javadocs) @ heritrix3-monitor ---
[ERROR] Error fetching link: /home/cibuild02/workspace/NetarchiveSuite-Full-Test-staging/common/common-core/target/apidocs/package-list. Ignored it.
[ERROR] Error fetching link: /home/cibuild02/workspace/NetarchiveSuite-Full-Test-staging/archive/archive-core/target/apidocs/package-list. Ignored it.
[ERROR] Error fetching link: /home/cibuild02/workspace/NetarchiveSuite-Full-Test-staging/harvester/harvester-core/target/apidocs/package-list. Ignored it.
[ERROR] Error fetching link: /home/cibuild02/workspace/NetarchiveSuite-Full-Test-staging/monitor/monitor-core/target/apidocs/package-list. Ignored it.
[INFO] 
1 warning
[WARNING] Javadoc Warnings
[WARNING] /home/cibuild02/workspace/NetarchiveSuite-Full-Test-staging/harvester/heritrix3/heritrix3-monitor/src/main/java/dk/netarkivet/heritrix3/monitor/AcceptLanguageParser.java:88: warning - @param argument "acceptLanguageStr" is not a parameter name.
[INFO] Building jar: /home/cibuild02/workspace/NetarchiveSuite-Full-Test-staging/harvester/heritrix3/heritrix3-monitor/target/heritrix3-monitor-5.4.3-SNAPSHOT-javadoc.jar
[INFO] 
[INFO] --- maven-install-plugin:2.4:install (default-install) @ heritrix3-monitor ---
[INFO] Installing /home/cibuild02/workspace/NetarchiveSuite-Full-Test-staging/harvester/heritrix3/heritrix3-monitor/target/heritrix3-monitor-5.4.3-SNAPSHOT.jar to /home/cibuild02/.m2/repository/org/netarchivesuite/heritrix3-monitor/5.4.3-SNAPSHOT/heritrix3-monitor-5.4.3-SNAPSHOT.jar
[INFO] Installing /home/cibuild02/workspace/NetarchiveSuite-Full-Test-staging/harvester/heritrix3/heritrix3-monitor/pom.xml to /home/cibuild02/.m2/repository/org/netarchivesuite/heritrix3-monitor/5.4.3-SNAPSHOT/heritrix3-monitor-5.4.3-SNAPSHOT.pom
[INFO] Installing /home/cibuild02/workspace/NetarchiveSuite-Full-Test-staging/harvester/heritrix3/heritrix3-monitor/target/NetarchiveSuite-heritrix3-monitor-5.4.3-SNAPSHOT.tar.gz to /home/cibuild02/.m2/repository/org/netarchivesuite/heritrix3-monitor/5.4.3-SNAPSHOT/heritrix3-monitor-5.4.3-SNAPSHOT.tar.gz
[INFO] Installing /home/cibuild02/workspace/NetarchiveSuite-Full-Test-staging/harvester/heritrix3/heritrix3-monitor/target/NetarchiveSuite-heritrix3-monitor-5.4.3-SNAPSHOT.zip to /home/cibuild02/.m2/repository/org/netarchivesuite/heritrix3-monitor/5.4.3-SNAPSHOT/heritrix3-monitor-5.4.3-SNAPSHOT.zip
[INFO] Installing /home/cibuild02/workspace/NetarchiveSuite-Full-Test-staging/harvester/heritrix3/heritrix3-monitor/target/heritrix3-monitor-5.4.3-SNAPSHOT-sources.jar to /home/cibuild02/.m2/repository/org/netarchivesuite/heritrix3-monitor/5.4.3-SNAPSHOT/heritrix3-monitor-5.4.3-SNAPSHOT-sources.jar
[INFO] Installing /home/cibuild02/workspace/NetarchiveSuite-Full-Test-staging/harvester/heritrix3/heritrix3-monitor/target/heritrix3-monitor-5.4.3-SNAPSHOT-javadoc.jar to /home/cibuild02/.m2/repository/org/netarchivesuite/heritrix3-monitor/5.4.3-SNAPSHOT/heritrix3-monitor-5.4.3-SNAPSHOT-javadoc.jar
[INFO] 
[INFO] --- maven-clean-plugin:2.5:clean (default-clean) @ heritrix3-monitor ---
[INFO] Deleting /home/cibuild02/workspace/NetarchiveSuite-Full-Test-staging/harvester/heritrix3/heritrix3-monitor/target
[JENKINS] Archiving disabled
[JENKINS] Archiving disabled
[JENKINS] Archiving disabled
[JENKINS] Archiving disabled
[JENKINS] Archiving disabled
[JENKINS] Archiving disabled
[JENKINS] Archiving disabled
[JENKINS] Archiving disabled
[JENKINS] Archiving disabled
[JENKINS] Archiving disabled
[JENKINS] Archiving disabled
[JENKINS] Archiving disabled
[JENKINS] Archiving disabled
[JENKINS] Archiving disabled
[JENKINS] Archiving disabled
[JENKINS] Archiving disabled
[JENKINS] Archiving disabled
[JENKINS] Archiving disabled
[JENKINS] Archiving disabled
[JENKINS] Archiving disabled
[JENKINS] Archiving disabled
[JENKINS] Archiving disabled
[JENKINS] Archiving disabled
[JENKINS] Archiving disabled
[JENKINS] Archiving disabled
[JENKINS] Archiving disabled
[JENKINS] Archiving disabled
[JENKINS] Archiving disabled
[JENKINS] Archiving disabled
[JENKINS] Archiving disabled
[JENKINS] Archiving disabled
[JENKINS] Archiving disabled
[JENKINS] Archiving disabled
[JENKINS] Archiving disabled
[JENKINS] Archiving disabled
[JENKINS] Archiving disabled
[JENKINS] Archiving disabled
[JENKINS] Archiving disabled
[INFO] ------------------------------------------------------------------------
[INFO] Reactor Summary:
[INFO] 
[INFO] NetarchiveSuite .................................... SUCCESS [  4.173 s]
[INFO] NetarchiveSuite - build-tools ...................... SUCCESS [  2.154 s]
[INFO] NetarchiveSuite - common ........................... SUCCESS [  0.367 s]
[INFO] NetarchiveSuite - test utils ....................... SUCCESS [  4.575 s]
[INFO] NetarchiveSuite - common - core .................... SUCCESS [ 39.794 s]
[INFO] NetarchiveSuite - common - test .................... SUCCESS [ 50.597 s]
[INFO] NetarchiveSuite - archive .......................... SUCCESS [  0.343 s]
[INFO] NetarchiveSuite - archive - core ................... SUCCESS [02:52 min]
[INFO] NetarchiveSuite - harvester ........................ SUCCESS [  0.385 s]
[INFO] NetarchiveSuite - harvester - core ................. SUCCESS [01:04 min]
[INFO] NetarchiveSuite - archive - test ................... SUCCESS [ 23.732 s]
[INFO] NetarchiveSuite - bitpreservation - webapp ......... SUCCESS [  2.000 s]
[INFO] NetarchiveSuite - Harvest Scheduler ................ SUCCESS [ 34.690 s]
[INFO] NetarchiveSuite - monitor .......................... SUCCESS [  0.394 s]
[INFO] NetarchiveSuite - monitor - core ................... SUCCESS [  9.854 s]
[INFO] NetarchiveSuite - wayback .......................... SUCCESS [  0.789 s]
[INFO] NetarchiveSuite - wayback - indexer ................ SUCCESS [ 17.634 s]
[INFO] NetarchiveSuite - deploy ........................... SUCCESS [  0.360 s]
[INFO] NetarchiveSuite - deploy - core .................... SUCCESS [ 57.896 s]
[INFO] NetarchiveSuite - harvester - heritrix3 ............ SUCCESS [  0.362 s]
[INFO] Netarchivesuite - Heritrix3 Extensions ............. SUCCESS [ 12.008 s]
[INFO] NetarchiveSuite - heritrix3 controller ............. SUCCESS [ 22.371 s]
[INFO] NetarchiveSuite - Status - Webapp .................. SUCCESS [  1.079 s]
[INFO] NetarchiveSuite - qa - webapp ...................... SUCCESS [  0.818 s]
[INFO] NetarchiveSuite - history - webapp ................. SUCCESS [  1.406 s]
[INFO] NetarchiveSuite - harvestDefinition - webapp ....... SUCCESS [  1.771 s]
[INFO] NetarchiveSuite - harvestChannel - webapp .......... SUCCESS [  0.738 s]
[INFO] NetarchiveSuite - heritrix3 monitor ................ SUCCESS [ 17.426 s]
[INFO] NetarchiveSuite - deploy - distribution ............ SUCCESS [ 15.212 s]
[INFO] NetarchiveSuite - deploy - test .................... SUCCESS [ 19.627 s]
[INFO] Netarchivesuite - Heritrix3 Bundler ................ SUCCESS [ 25.038 s]
[INFO] NetarchiveSuite - harvester - test ................. SUCCESS [14:42 min]
[INFO] NetarchiveSuite - monitor - test ................... SUCCESS [  2.966 s]
[INFO] NetarchiveSuite - wayback resourceStore ............ SUCCESS [  7.526 s]
[INFO] NetarchiveSuite - wayback - test ................... SUCCESS [ 20.386 s]
[INFO] NetarchiveSuite - integration tests ................ SUCCESS [  0.345 s]
[INFO] NetarchiveSuite System test ........................ SUCCESS [  1.530 s]
[INFO] ------------------------------------------------------------------------
[INFO] BUILD SUCCESS
[INFO] ------------------------------------------------------------------------
[INFO] Total time: 25:29 min
[INFO] Finished at: 2018-09-11T15:23:43+02:00
[INFO] Final Memory: 80M/193M
[INFO] ------------------------------------------------------------------------