SuccessConsole Output

[INFO]                                                                         
[INFO] ------------------------------------------------------------------------
[INFO] Building NetarchiveSuite - heritrix3 controller 5.4.3-SNAPSHOT
[INFO] ------------------------------------------------------------------------
[INFO] 
[INFO] --- maven-clean-plugin:2.5:clean (default-clean) @ heritrix3-controller ---
[INFO] 
[INFO] --- maven-resources-plugin:2.6:resources (default-resources) @ heritrix3-controller ---
[INFO] Using 'UTF-8' encoding to copy filtered resources.
[INFO] Copying 1 resource
[INFO] 
[INFO] --- maven-compiler-plugin:3.1:compile (default-compile) @ heritrix3-controller ---
[INFO] Changes detected - recompiling the module!
[INFO] Compiling 22 source files to /home/cibuild02/workspace/NetarchiveSuite-Full-Test-staging/harvester/heritrix3/heritrix3-controller/target/classes
[INFO] 
[INFO] --- maven-resources-plugin:2.6:testResources (default-testResources) @ heritrix3-controller ---
[INFO] Using 'UTF-8' encoding to copy filtered resources.
[INFO] Copying 3 resources
[INFO] 
[INFO] --- maven-compiler-plugin:3.1:testCompile (default-testCompile) @ heritrix3-controller ---
[INFO] Changes detected - recompiling the module!
[INFO] Compiling 3 source files to /home/cibuild02/workspace/NetarchiveSuite-Full-Test-staging/harvester/heritrix3/heritrix3-controller/target/test-classes
[INFO] 
[INFO] --- maven-surefire-plugin:2.17:test (default-test) @ heritrix3-controller ---
[INFO] Surefire report directory: /home/cibuild02/workspace/NetarchiveSuite-Full-Test-staging/harvester/heritrix3/heritrix3-controller/target/surefire-reports

-------------------------------------------------------
 T E S T S
-------------------------------------------------------
Running dk.netarkivet.harvester.harvesting.report.HarvestReportGeneratorTest
SLF4J: Class path contains multiple SLF4J bindings.
SLF4J: Found binding in [jar:file:/home/cibuild02/.m2/repository/ch/qos/logback/logback-classic/1.2.3/logback-classic-1.2.3.jar!/org/slf4j/impl/StaticLoggerBinder.class]
SLF4J: Found binding in [jar:file:/home/cibuild02/.m2/repository/org/slf4j/slf4j-log4j12/1.7.5/slf4j-log4j12-1.7.5.jar!/org/slf4j/impl/StaticLoggerBinder.class]
SLF4J: See http://www.slf4j.org/codes.html#multiple_bindings for an explanation.
SLF4J: Actual binding is of type [ch.qos.logback.classic.util.ContextSelectorStaticBinder]
14:29:09.891 [main] INFO dk.netarkivet.harvester.heritrix3.report.HarvestReportGenerator - Starting pre-processing of harvest report for job 42
14:29:09.905 [main] INFO dk.netarkivet.harvester.heritrix3.report.HarvestReportGenerator - DISREGARD_SEEDURL_INFORMATION_IN_CRAWLLOG: false
14:29:09.968 [main] INFO dk.netarkivet.common.utils.TLD - Did not found external public suffix list at '/home/cibuild02/workspace/NetarchiveSuite-Full-Test-staging/harvester/heritrix3/heritrix3-controller/conf/public_suffix_list.dat'! Reading instead the public suffixes list from embedded file 'dk/netarkivet/common/utils/public_suffix_list.dat' in common-core.jar-VERSION.jar.
14:29:10.352 [main] INFO dk.netarkivet.common.utils.TLD - Read 0 TLDs from public suffix file
14:29:10.363 [main] DEBUG dk.netarkivet.common.utils.TLD - No tlds found in settingsfiles 
14:29:10.488 [main] INFO dk.netarkivet.harvester.heritrix3.report.HarvestReportGenerator - Finished pre-processing of harvest report for job 42, operation took 00d 00:09:47
Tests run: 1, Failures: 0, Errors: 0, Skipped: 0, Time elapsed: 1.351 sec - in dk.netarkivet.harvester.harvesting.report.HarvestReportGeneratorTest

Results :

Tests run: 1, Failures: 0, Errors: 0, Skipped: 0

[JENKINS] Recording test results
[INFO] 
[INFO] --- maven-jgit-buildnumber-plugin:1.2.9:extract-buildnumber (git-buildnumber) @ heritrix3-controller ---
[INFO] 
[INFO] --- maven-jar-plugin:2.4:jar (default-jar) @ heritrix3-controller ---
[INFO] Building jar: /home/cibuild02/workspace/NetarchiveSuite-Full-Test-staging/harvester/heritrix3/heritrix3-controller/target/heritrix3-controller-5.4.3-SNAPSHOT.jar
[INFO] 
[INFO] >>> maven-source-plugin:2.2.1:jar (attach-sources) > generate-sources @ heritrix3-controller >>>
[WARNING] Failed to getClass for org.apache.maven.plugin.source.SourceJarMojo
[INFO] 
[INFO] <<< maven-source-plugin:2.2.1:jar (attach-sources) < generate-sources @ heritrix3-controller <<<
[INFO] 
[INFO] --- maven-source-plugin:2.2.1:jar (attach-sources) @ heritrix3-controller ---
[INFO] Building jar: /home/cibuild02/workspace/NetarchiveSuite-Full-Test-staging/harvester/heritrix3/heritrix3-controller/target/heritrix3-controller-5.4.3-SNAPSHOT-sources.jar
[INFO] 
[INFO] --- maven-javadoc-plugin:2.10.3:jar (attach-javadocs) @ heritrix3-controller ---
[INFO] The goal 'org.apache.maven.plugins:maven-javadoc-plugin:2.10.3:javadoc' has not been previously called for the module: 'org.netarchivesuite:heritrix3-extensions:jar:5.4.3-SNAPSHOT'. Trying to invoke it...
[WARNING] Creating fake javadoc directory to prevent repeated invocations: /home/cibuild02/workspace/NetarchiveSuite-Full-Test-staging/harvester/heritrix3/heritrix3-extensions/target/apidocs
[ERROR] Error fetching link: /home/cibuild02/workspace/NetarchiveSuite-Full-Test-staging/common/common-core/target/apidocs/package-list. Ignored it.
[ERROR] Error fetching link: /home/cibuild02/workspace/NetarchiveSuite-Full-Test-staging/common/common-test/target/apidocs/package-list. Ignored it.
[ERROR] Error fetching link: /home/cibuild02/workspace/NetarchiveSuite-Full-Test-staging/archive/archive-core/target/apidocs/package-list. Ignored it.
[ERROR] Error fetching link: /home/cibuild02/workspace/NetarchiveSuite-Full-Test-staging/harvester/harvester-core/target/apidocs/package-list. Ignored it.
[ERROR] Error fetching link: /home/cibuild02/workspace/NetarchiveSuite-Full-Test-staging/harvester/heritrix3/heritrix3-extensions/target/apidocs/package-list. Ignored it.
[INFO] 
5 warnings
[WARNING] Javadoc Warnings
[WARNING] /home/cibuild02/workspace/NetarchiveSuite-Full-Test-staging/harvester/heritrix3/heritrix3-controller/src/main/java/dk/netarkivet/harvester/heritrix3/Heritrix3Settings.java:194: warning - Tag @see: can't find documentHarvest(dk.netarkivet.harvester.harvesting.IngestableFiles) in dk.netarkivet.harvester.heritrix3.HarvestDocumentation
[WARNING] /home/cibuild02/workspace/NetarchiveSuite-Full-Test-staging/harvester/heritrix3/heritrix3-controller/src/main/java/dk/netarkivet/harvester/heritrix3/Heritrix3Settings.java:185: warning - Tag @see: can't find documentHarvest(dk.netarkivet.harvester.harvesting.IngestableFiles) in dk.netarkivet.harvester.heritrix3.HarvestDocumentation
[WARNING] /home/cibuild02/workspace/NetarchiveSuite-Full-Test-staging/harvester/heritrix3/heritrix3-controller/src/main/java/dk/netarkivet/harvester/heritrix3/Heritrix3Settings.java:176: warning - Tag @see: can't find documentHarvest(dk.netarkivet.harvester.harvesting.IngestableFiles) in dk.netarkivet.harvester.heritrix3.HarvestDocumentation
[WARNING] /home/cibuild02/workspace/NetarchiveSuite-Full-Test-staging/harvester/heritrix3/heritrix3-controller/src/main/java/dk/netarkivet/harvester/heritrix3/controller/IHeritrixController.java:98: warning - Tag @see: reference not found: org.archive.crawler.framework.StatisticsTracking#currentProcessedKBPerSec()
[WARNING] /home/cibuild02/workspace/NetarchiveSuite-Full-Test-staging/harvester/heritrix3/heritrix3-controller/src/main/java/dk/netarkivet/harvester/heritrix3/controller/IHeritrixController.java:98: warning - Tag @see: reference not found: org.archive.crawler.framework.StatisticsTracking#currentProcessedKBPerSec()
[INFO] Building jar: /home/cibuild02/workspace/NetarchiveSuite-Full-Test-staging/harvester/heritrix3/heritrix3-controller/target/heritrix3-controller-5.4.3-SNAPSHOT-javadoc.jar
[INFO] 
[INFO] --- maven-install-plugin:2.4:install (default-install) @ heritrix3-controller ---
[INFO] Installing /home/cibuild02/workspace/NetarchiveSuite-Full-Test-staging/harvester/heritrix3/heritrix3-controller/target/heritrix3-controller-5.4.3-SNAPSHOT.jar to /home/cibuild02/.m2/repository/org/netarchivesuite/heritrix3-controller/5.4.3-SNAPSHOT/heritrix3-controller-5.4.3-SNAPSHOT.jar
[INFO] Installing /home/cibuild02/workspace/NetarchiveSuite-Full-Test-staging/harvester/heritrix3/heritrix3-controller/pom.xml to /home/cibuild02/.m2/repository/org/netarchivesuite/heritrix3-controller/5.4.3-SNAPSHOT/heritrix3-controller-5.4.3-SNAPSHOT.pom
[INFO] Installing /home/cibuild02/workspace/NetarchiveSuite-Full-Test-staging/harvester/heritrix3/heritrix3-controller/target/heritrix3-controller-5.4.3-SNAPSHOT-sources.jar to /home/cibuild02/.m2/repository/org/netarchivesuite/heritrix3-controller/5.4.3-SNAPSHOT/heritrix3-controller-5.4.3-SNAPSHOT-sources.jar
[INFO] Installing /home/cibuild02/workspace/NetarchiveSuite-Full-Test-staging/harvester/heritrix3/heritrix3-controller/target/heritrix3-controller-5.4.3-SNAPSHOT-javadoc.jar to /home/cibuild02/.m2/repository/org/netarchivesuite/heritrix3-controller/5.4.3-SNAPSHOT/heritrix3-controller-5.4.3-SNAPSHOT-javadoc.jar
[INFO] 
[INFO] --- maven-clean-plugin:2.5:clean (default-clean) @ heritrix3-controller ---
[INFO] Deleting /home/cibuild02/workspace/NetarchiveSuite-Full-Test-staging/harvester/heritrix3/heritrix3-controller/target
[JENKINS] Archiving disabled