SuccessConsole Output

[INFO]                                                                         
[INFO] ------------------------------------------------------------------------
[INFO] Building NetarchiveSuite - Harvest Scheduler 5.4.3-SNAPSHOT
[INFO] ------------------------------------------------------------------------
[INFO] 
[INFO] --- maven-clean-plugin:2.5:clean (default-clean) @ harvest-scheduler ---
[INFO] Deleting /home/cibuild02/workspace/NetarchiveSuite-Full-Test-staging/harvester/harvest-scheduler/target
[INFO] 
[INFO] --- jacoco-maven-plugin:0.7.9:prepare-agent (agent) @ harvest-scheduler ---
[INFO] argLine set to -javaagent:/home/cibuild02/.m2/repository/org/jacoco/org.jacoco.agent/0.7.9/org.jacoco.agent-0.7.9-runtime.jar=destfile=/home/cibuild02/workspace/NetarchiveSuite-Full-Test-staging/harvester/harvest-scheduler/../target/jacoco.exec,append=true
[INFO] 
[INFO] --- maven-resources-plugin:2.6:resources (default-resources) @ harvest-scheduler ---
[INFO] Using 'UTF-8' encoding to copy filtered resources.
[INFO] skip non existing resourceDirectory /home/cibuild02/workspace/NetarchiveSuite-Full-Test-staging/harvester/harvest-scheduler/src/main/resources
[INFO] 
[INFO] --- maven-compiler-plugin:3.1:compile (default-compile) @ harvest-scheduler ---
[INFO] Changes detected - recompiling the module!
[INFO] Compiling 14 source files to /home/cibuild02/workspace/NetarchiveSuite-Full-Test-staging/harvester/harvest-scheduler/target/classes
[INFO] 
[INFO] --- maven-resources-plugin:2.6:testResources (default-testResources) @ harvest-scheduler ---
[INFO] Using 'UTF-8' encoding to copy filtered resources.
[INFO] skip non existing resourceDirectory /home/cibuild02/workspace/NetarchiveSuite-Full-Test-staging/harvester/harvest-scheduler/src/test/resources
[INFO] 
[INFO] --- maven-compiler-plugin:3.1:testCompile (default-testCompile) @ harvest-scheduler ---
[INFO] Changes detected - recompiling the module!
[INFO] Compiling 5 source files to /home/cibuild02/workspace/NetarchiveSuite-Full-Test-staging/harvester/harvest-scheduler/target/test-classes
[INFO] 
[INFO] --- maven-surefire-plugin:2.17:test (default-test) @ harvest-scheduler ---
[INFO] Surefire report directory: /home/cibuild02/workspace/NetarchiveSuite-Full-Test-staging/harvester/harvest-scheduler/target/surefire-reports

-------------------------------------------------------
 T E S T S
-------------------------------------------------------
Running dk.netarkivet.harvester.scheduler.JobDispatcherTest
09:26:49.338 [main] INFO dk.netarkivet.harvester.scheduler.JobDispatcher - Creating JobDispatcher
09:26:49.985 [main] DEBUG dk.netarkivet.harvester.scheduler.JobDispatcher - Submitting new FOCUSED job 1
09:26:50.040 [main] INFO dk.netarkivet.harvester.scheduler.JobDispatcher - Added duplicateReductionMetadataEntry metadataEntry for job 1 
09:26:50.075 [main] INFO dk.netarkivet.harvester.scheduler.JobDispatcher - As we're using WARC as archiveFormat WarcInfoMetadata is now added to the template
The list of loaded data settings is empty. Is this OK?09:26:50.164 [main] DEBUG dk.netarkivet.common.utils.Settings - Value found in classpath data: ONE,TWO,THREE
09:26:50.203 [main] DEBUG dk.netarkivet.harvester.scheduler.JobDispatcher - Send crawl request: NO ID: To DEV_COMMON_JOB_PARTIAL_FOCUSED ReplyTo DEV_COMMON_ERROR OK Job: Mock for Job, hashCode: 808297264, metadata: [URL= metadata://netarkivet.dk/crawl/setup/duplicatereductionjobs?majorversion=1&minorversion=0&harvestid=9&harvestnum=0&jobid=1 ; mimetype= text/plain ; data= 1]
09:26:50.206 [main] INFO dk.netarkivet.harvester.scheduler.JobDispatcher - Job #1 submitted
09:26:50.238 [main] INFO dk.netarkivet.harvester.scheduler.JobDispatcher - Creating JobDispatcher
09:26:50.309 [main] DEBUG dk.netarkivet.harvester.scheduler.JobDispatcher - Submitting new FOCUSED job 1
09:26:50.318 [main] INFO dk.netarkivet.harvester.scheduler.JobDispatcher - As we're using WARC as archiveFormat WarcInfoMetadata is now added to the template
09:26:50.330 [main] DEBUG dk.netarkivet.harvester.scheduler.JobDispatcher - Send crawl request: NO ID: To DEV_COMMON_JOB_PARTIAL_FOCUSED ReplyTo DEV_COMMON_ERROR OK Job: Mock for Job, hashCode: 533053618, metadata: []
09:26:50.335 [main] INFO dk.netarkivet.harvester.scheduler.JobDispatcher - Job #1 submitted
09:26:50.386 [main] DEBUG dk.netarkivet.harvester.scheduler.JobDispatcher - Submitting new SNAPSHOT job 2
09:26:50.394 [main] INFO dk.netarkivet.harvester.scheduler.JobDispatcher - As we're using WARC as archiveFormat WarcInfoMetadata is now added to the template
09:26:50.407 [main] DEBUG dk.netarkivet.harvester.scheduler.JobDispatcher - Send crawl request: NO ID: To DEV_COMMON_JOB_SNAPSHOT_SNAPSHOT ReplyTo DEV_COMMON_ERROR OK Job: Mock for Job, hashCode: 1455066764, metadata: []
09:26:50.413 [main] INFO dk.netarkivet.harvester.scheduler.JobDispatcher - Job #2 submitted
09:26:50.421 [main] INFO dk.netarkivet.harvester.scheduler.JobDispatcher - Creating JobDispatcher
09:26:50.452 [main] DEBUG dk.netarkivet.harvester.scheduler.JobDispatcher - Submitting new FOCUSED job 1
09:26:50.456 [main] INFO dk.netarkivet.harvester.scheduler.JobDispatcher - As we're using WARC as archiveFormat WarcInfoMetadata is now added to the template
09:26:50.475 [main] DEBUG dk.netarkivet.harvester.scheduler.JobDispatcher - Send crawl request: NO ID: To DEV_COMMON_JOB_PARTIAL_FOCUSED ReplyTo DEV_COMMON_ERROR OK Job: Mock for Job, hashCode: 342862272, metadata: []
09:26:50.478 [main] INFO dk.netarkivet.harvester.scheduler.JobDispatcher - Job #1 submitted
09:26:50.492 [main] INFO dk.netarkivet.harvester.scheduler.JobDispatcher - Creating JobDispatcher
09:26:50.523 [main] DEBUG dk.netarkivet.harvester.scheduler.JobDispatcher - Submitting new FOCUSED job 1
09:26:50.531 [main] INFO dk.netarkivet.harvester.scheduler.JobDispatcher - Added alias metadataEntry for job 1 
09:26:50.541 [main] INFO dk.netarkivet.harvester.scheduler.JobDispatcher - As we're using WARC as archiveFormat WarcInfoMetadata is now added to the template
09:26:50.549 [main] DEBUG dk.netarkivet.harvester.scheduler.JobDispatcher - Send crawl request: NO ID: To DEV_COMMON_JOB_PARTIAL_FOCUSED ReplyTo DEV_COMMON_ERROR OK Job: Mock for Job, hashCode: 620095976, metadata: [URL= metadata://netarkivet.dk/crawl/setup/aliases?majorversion=1&minorversion=0&harvestid=9&harvestnum=0&jobid=1 ; mimetype= text/plain ; data= netatarkivalias.dk is an alias for netarkiv.dk
]
09:26:50.554 [main] INFO dk.netarkivet.harvester.scheduler.JobDispatcher - Job #1 submitted
09:26:50.561 [main] INFO dk.netarkivet.harvester.scheduler.JobDispatcher - Creating JobDispatcher
Tests run: 5, Failures: 0, Errors: 0, Skipped: 0, Time elapsed: 3.438 sec - in dk.netarkivet.harvester.scheduler.JobDispatcherTest
Running dk.netarkivet.harvester.scheduler.HarvesterStatusReceiverTest
09:26:50.652 [main] INFO dk.netarkivet.harvester.scheduler.HarvesterStatusReceiver - Reregistering the harvester 'Test' to channel 'FOCUSED'
09:26:50.659 [main] INFO dk.netarkivet.harvester.scheduler.HarvestChannelRegistry - Harvester Test registered on channel FOCUSED
09:26:50.660 [main] INFO dk.netarkivet.harvester.scheduler.HarvestChannelRegistry - HarvestChannelRegistry status:
	- FOCUSED { Test }
09:26:50.695 [main] WARN dk.netarkivet.harvester.distribute.HarvesterMessageHandler - Error processing message 'TestObjectMessage: NO ID: To DEV_COMMON_HARVESTMON ReplyTo DEV_COMMON_ERROR OK'
dk.netarkivet.common.exceptions.PermissionDenied: 'dk.netarkivet.harvester.scheduler.HarvesterStatusReceiver@632dc41' provides no handling for NO ID: To DEV_COMMON_HARVESTMON ReplyTo DEV_COMMON_ERROR OK of type dk.netarkivet.harvester.harvesting.distribute.CrawlProgressMessage and should not be invoked!
	at dk.netarkivet.harvester.distribute.HarvesterMessageHandler.deny(HarvesterMessageHandler.java:83)
	at dk.netarkivet.harvester.distribute.HarvesterMessageHandler.visit(HarvesterMessageHandler.java:119)
	at dk.netarkivet.harvester.harvesting.distribute.CrawlProgressMessage.accept(CrawlProgressMessage.java:338)
	at dk.netarkivet.harvester.distribute.HarvesterMessageHandler.onMessage(HarvesterMessageHandler.java:69)
	at dk.netarkivet.harvester.scheduler.HarvesterStatusReceiverTest.testInvalidMessageType(HarvesterStatusReceiverTest.java:66)
	at sun.reflect.NativeMethodAccessorImpl.invoke0(Native Method)
	at sun.reflect.NativeMethodAccessorImpl.invoke(NativeMethodAccessorImpl.java:62)
	at sun.reflect.DelegatingMethodAccessorImpl.invoke(DelegatingMethodAccessorImpl.java:43)
	at java.lang.reflect.Method.invoke(Method.java:498)
	at org.junit.runners.model.FrameworkMethod$1.runReflectiveCall(FrameworkMethod.java:47)
	at org.junit.internal.runners.model.ReflectiveCallable.run(ReflectiveCallable.java:12)
	at org.junit.runners.model.FrameworkMethod.invokeExplosively(FrameworkMethod.java:44)
	at org.junit.internal.runners.statements.InvokeMethod.evaluate(InvokeMethod.java:17)
	at org.junit.internal.runners.statements.RunBefores.evaluate(RunBefores.java:26)
	at org.junit.runners.ParentRunner.runLeaf(ParentRunner.java:271)
	at org.junit.runners.BlockJUnit4ClassRunner.runChild(BlockJUnit4ClassRunner.java:70)
	at org.junit.runners.BlockJUnit4ClassRunner.runChild(BlockJUnit4ClassRunner.java:50)
	at org.junit.runners.ParentRunner$3.run(ParentRunner.java:238)
	at org.junit.runners.ParentRunner$1.schedule(ParentRunner.java:63)
	at org.junit.runners.ParentRunner.runChildren(ParentRunner.java:236)
	at org.junit.runners.ParentRunner.access$000(ParentRunner.java:53)
	at org.junit.runners.ParentRunner$2.evaluate(ParentRunner.java:229)
	at org.junit.runners.ParentRunner.run(ParentRunner.java:309)
	at org.apache.maven.surefire.junit4.JUnit4Provider.execute(JUnit4Provider.java:264)
	at org.apache.maven.surefire.junit4.JUnit4Provider.executeTestSet(JUnit4Provider.java:153)
	at org.apache.maven.surefire.junit4.JUnit4Provider.invoke(JUnit4Provider.java:124)
	at org.apache.maven.surefire.booter.ForkedBooter.invokeProviderInSameClassLoader(ForkedBooter.java:200)
	at org.apache.maven.surefire.booter.ForkedBooter.runSuitesInProcess(ForkedBooter.java:153)
	at org.apache.maven.surefire.booter.ForkedBooter.main(ForkedBooter.java:103)
Tests run: 2, Failures: 0, Errors: 0, Skipped: 0, Time elapsed: 0.138 sec - in dk.netarkivet.harvester.scheduler.HarvesterStatusReceiverTest
Running dk.netarkivet.harvester.scheduler.JobSupervisorTest
09:26:50.727 [main] INFO dk.netarkivet.harvester.scheduler.JobSupervisor - 0 jobs has been resubmitted.
09:26:50.732 [main] WARN dk.netarkivet.harvester.scheduler.JobSupervisor -  Job 1 has exceeded its timeout of 0 minutes. Changing status to FAILED.
09:26:50.734 [main] WARN dk.netarkivet.harvester.scheduler.JobSupervisor - Changed 1 jobs from STARTED to FAILED
09:26:50.744 [main] INFO dk.netarkivet.harvester.scheduler.JobSupervisor - Resubmitting old job 1 as 0
09:26:50.744 [main] INFO dk.netarkivet.harvester.scheduler.JobSupervisor - Resubmitting old job 3 as 0
09:26:50.744 [main] INFO dk.netarkivet.harvester.scheduler.JobSupervisor - 2 jobs has been resubmitted.
Tests run: 4, Failures: 0, Errors: 0, Skipped: 0, Time elapsed: 0.042 sec - in dk.netarkivet.harvester.scheduler.JobSupervisorTest
Running dk.netarkivet.harvester.scheduler.HarvestSchedulerMonitorServerTest
09:26:50.833 [main] WARN dk.netarkivet.harvester.scheduler.HarvestSchedulerMonitorServer - Received unexpected CrawlStatusMessage for job 1 with new status FAILED, current state is SUBMITTED
09:26:50.834 [main] WARN dk.netarkivet.harvester.scheduler.HarvestSchedulerMonitorServer - Job 1 failed: HarvestErrors = Some harvesterrors
HarvestErrorDetails = Some harvestErrorDetails
UploadErrors = Some uploadErrors
UploadErrorDetails = Some uploadErrorDetails
09:26:50.856 [main] WARN dk.netarkivet.harvester.scheduler.HarvestSchedulerMonitorServer - Received unexpected CrawlStatusMessage for job 1 with new status FAILED, current state is RESUBMITTED
09:26:50.858 [main] WARN dk.netarkivet.harvester.scheduler.HarvestSchedulerMonitorServer - Job 1 failed: HarvestErrors = Some harvesterrors
HarvestErrorDetails = Some harvestErrorDetails
UploadErrors = Some uploadErrors
UploadErrorDetails = Some uploadErrorDetails
09:26:50.864 [main] WARN dk.netarkivet.harvester.scheduler.HarvestSchedulerMonitorServer - Job 1 failed: HarvestErrors = Some harvesterrors
HarvestErrorDetails = Some harvestErrorDetails
UploadErrors = Some uploadErrors
UploadErrorDetails = Some uploadErrorDetails
09:26:50.873 [main] WARN dk.netarkivet.harvester.scheduler.HarvestSchedulerMonitorServer - Received unexpected CrawlStatusMessage for job 1 with new status FAILED, current state is DONE. Marking job as DONE. Reported harvestErrors on job: Some harvesterrors
09:26:50.889 [main] INFO dk.netarkivet.harvester.scheduler.HarvestSchedulerMonitorServer - Job #1 succesfully completed
09:26:50.901 [main] INFO dk.netarkivet.harvester.scheduler.HarvestSchedulerMonitorServer - Job #1 succesfully completed
09:26:50.910 [main] INFO dk.netarkivet.harvester.scheduler.HarvestSchedulerMonitorServer - Job #1 has been started by the harvester.
09:26:50.933 [main] INFO dk.netarkivet.harvester.scheduler.HarvestSchedulerMonitorServer - Job #1 succesfully completed
09:26:50.935 [main] WARN dk.netarkivet.harvester.scheduler.HarvestSchedulerMonitorServer - Job 1 failed: HarvestErrors = null
HarvestErrorDetails = null
UploadErrors = null
UploadErrorDetails = null
09:26:50.942 [main] WARN dk.netarkivet.harvester.scheduler.HarvestSchedulerMonitorServer - Received new status 'Started' for job 1 with current status DONE, ignoring.
09:26:50.952 [main] WARN dk.netarkivet.harvester.scheduler.HarvestSchedulerMonitorServer - Received unexpected CrawlStatusMessage for job 1 with new status DONE, current state is NEW
09:26:50.954 [main] INFO dk.netarkivet.harvester.scheduler.HarvestSchedulerMonitorServer - Job #1 succesfully completed
09:26:50.962 [main] WARN dk.netarkivet.harvester.scheduler.HarvestSchedulerMonitorServer - Received new status 'Started' for job 1 with current status STARTED, ignoring.
09:26:50.971 [main] WARN dk.netarkivet.harvester.scheduler.HarvestSchedulerMonitorServer - Received new status 'Started' for job 1 with current status FAILED, ignoring.
09:26:50.976 [main] WARN dk.netarkivet.harvester.scheduler.HarvestSchedulerMonitorServer - Received new status 'Started' for unsubmitted job 1
09:26:50.979 [main] INFO dk.netarkivet.harvester.scheduler.HarvestSchedulerMonitorServer - Job #1 has been started by the harvester.
09:26:50.985 [main] WARN dk.netarkivet.harvester.scheduler.HarvestSchedulerMonitorServer - Received unexpected CrawlStatusMessage for job 1 with new status DONE, current state is SUBMITTED
09:26:50.988 [main] INFO dk.netarkivet.harvester.scheduler.HarvestSchedulerMonitorServer - Job #1 succesfully completed
09:26:50.994 [main] WARN dk.netarkivet.harvester.scheduler.HarvestSchedulerMonitorServer - Received unexpected CrawlStatusMessage for job 1 with new status DONE, current state is SUBMITTED
09:26:50.996 [main] INFO dk.netarkivet.harvester.scheduler.HarvestSchedulerMonitorServer - Job #1 succesfully completed
09:26:51.004 [main] WARN dk.netarkivet.harvester.scheduler.HarvestSchedulerMonitorServer - Received unexpected CrawlStatusMessage for job 1 with new status DONE, current state is RESUBMITTED
09:26:51.005 [main] INFO dk.netarkivet.harvester.scheduler.HarvestSchedulerMonitorServer - Job #1 succesfully completed
09:26:51.010 [main] WARN dk.netarkivet.harvester.scheduler.HarvestSchedulerMonitorServer - Received unexpected CrawlStatusMessage for job 1 with new status FAILED, current state is NEW
09:26:51.015 [main] WARN dk.netarkivet.harvester.scheduler.HarvestSchedulerMonitorServer - Job 1 failed: HarvestErrors = Some harvesterrors
HarvestErrorDetails = Some harvestErrorDetails
UploadErrors = Some uploadErrors
UploadErrorDetails = Some uploadErrorDetails
Tests run: 18, Failures: 0, Errors: 0, Skipped: 0, Time elapsed: 0.27 sec - in dk.netarkivet.harvester.scheduler.HarvestSchedulerMonitorServerTest

Results :

Tests run: 29, Failures: 0, Errors: 0, Skipped: 0

[JENKINS] Recording test results
[INFO] 
[INFO] --- maven-jgit-buildnumber-plugin:1.2.9:extract-buildnumber (git-buildnumber) @ harvest-scheduler ---
[INFO] 
[INFO] --- maven-jar-plugin:2.4:jar (default-jar) @ harvest-scheduler ---
[INFO] Building jar: /home/cibuild02/workspace/NetarchiveSuite-Full-Test-staging/harvester/harvest-scheduler/target/harvest-scheduler-5.4.3-SNAPSHOT.jar
[INFO] 
[INFO] >>> maven-source-plugin:2.2.1:jar (attach-sources) > generate-sources @ harvest-scheduler >>>
[INFO] 
[INFO] --- jacoco-maven-plugin:0.7.9:prepare-agent (agent) @ harvest-scheduler ---
[INFO] argLine set to -javaagent:/home/cibuild02/.m2/repository/org/jacoco/org.jacoco.agent/0.7.9/org.jacoco.agent-0.7.9-runtime.jar=destfile=/home/cibuild02/workspace/NetarchiveSuite-Full-Test-staging/harvester/harvest-scheduler/../target/jacoco.exec,append=true
[WARNING] Failed to getClass for org.apache.maven.plugin.source.SourceJarMojo
[INFO] 
[INFO] <<< maven-source-plugin:2.2.1:jar (attach-sources) < generate-sources @ harvest-scheduler <<<
[INFO] 
[INFO] --- maven-source-plugin:2.2.1:jar (attach-sources) @ harvest-scheduler ---
[INFO] Building jar: /home/cibuild02/workspace/NetarchiveSuite-Full-Test-staging/harvester/harvest-scheduler/target/harvest-scheduler-5.4.3-SNAPSHOT-sources.jar
[INFO] 
[INFO] --- maven-javadoc-plugin:2.10.3:jar (attach-javadocs) @ harvest-scheduler ---
[INFO] The goal 'org.apache.maven.plugins:maven-javadoc-plugin:2.10.3:javadoc' has not been previously called for the module: 'org.netarchivesuite:harvester-core:jar:5.4.3-SNAPSHOT'. Trying to invoke it...
[WARNING] Creating fake javadoc directory to prevent repeated invocations: /home/cibuild02/workspace/NetarchiveSuite-Full-Test-staging/harvester/harvester-core/target/apidocs
[ERROR] Error fetching link: /home/cibuild02/workspace/NetarchiveSuite-Full-Test-staging/common/common-core/target/apidocs/package-list. Ignored it.
[ERROR] Error fetching link: /home/cibuild02/workspace/NetarchiveSuite-Full-Test-staging/common/common-test/target/apidocs/package-list. Ignored it.
[ERROR] Error fetching link: /home/cibuild02/workspace/NetarchiveSuite-Full-Test-staging/harvester/harvester-core/target/apidocs/package-list. Ignored it.
[INFO] Building jar: /home/cibuild02/workspace/NetarchiveSuite-Full-Test-staging/harvester/harvest-scheduler/target/harvest-scheduler-5.4.3-SNAPSHOT-javadoc.jar
[INFO] 
[INFO] --- maven-install-plugin:2.4:install (default-install) @ harvest-scheduler ---
[INFO] Installing /home/cibuild02/workspace/NetarchiveSuite-Full-Test-staging/harvester/harvest-scheduler/target/harvest-scheduler-5.4.3-SNAPSHOT.jar to /home/cibuild02/.m2/repository/org/netarchivesuite/harvest-scheduler/5.4.3-SNAPSHOT/harvest-scheduler-5.4.3-SNAPSHOT.jar
[INFO] Installing /home/cibuild02/workspace/NetarchiveSuite-Full-Test-staging/harvester/harvest-scheduler/pom.xml to /home/cibuild02/.m2/repository/org/netarchivesuite/harvest-scheduler/5.4.3-SNAPSHOT/harvest-scheduler-5.4.3-SNAPSHOT.pom
[INFO] Installing /home/cibuild02/workspace/NetarchiveSuite-Full-Test-staging/harvester/harvest-scheduler/target/harvest-scheduler-5.4.3-SNAPSHOT-sources.jar to /home/cibuild02/.m2/repository/org/netarchivesuite/harvest-scheduler/5.4.3-SNAPSHOT/harvest-scheduler-5.4.3-SNAPSHOT-sources.jar
[INFO] Installing /home/cibuild02/workspace/NetarchiveSuite-Full-Test-staging/harvester/harvest-scheduler/target/harvest-scheduler-5.4.3-SNAPSHOT-javadoc.jar to /home/cibuild02/.m2/repository/org/netarchivesuite/harvest-scheduler/5.4.3-SNAPSHOT/harvest-scheduler-5.4.3-SNAPSHOT-javadoc.jar
[INFO] 
[INFO] --- maven-clean-plugin:2.5:clean (default-clean) @ harvest-scheduler ---
[INFO] Deleting /home/cibuild02/workspace/NetarchiveSuite-Full-Test-staging/harvester/harvest-scheduler/target
[JENKINS] Archiving disabled