UnstableConsole Output

Skipping 1,576 KB.. Full Log
ources) @ heritrix3-controller ---
[INFO] Using 'UTF-8' encoding to copy filtered resources.
[INFO] Copying 1 resource
[INFO] 
[INFO] --- maven-compiler-plugin:3.1:compile (default-compile) @ heritrix3-controller ---
[INFO] Changes detected - recompiling the module!
[INFO] Compiling 22 source files to /home/cibuild02/workspace/NetarchiveSuite-Full-Test-staging/harvester/heritrix3/heritrix3-controller/target/classes
[INFO] 
[INFO] --- maven-resources-plugin:2.6:testResources (default-testResources) @ heritrix3-controller ---
[INFO] Using 'UTF-8' encoding to copy filtered resources.
[INFO] Copying 3 resources
[INFO] 
[INFO] --- maven-compiler-plugin:3.1:testCompile (default-testCompile) @ heritrix3-controller ---
[INFO] Changes detected - recompiling the module!
[INFO] Compiling 3 source files to /home/cibuild02/workspace/NetarchiveSuite-Full-Test-staging/harvester/heritrix3/heritrix3-controller/target/test-classes
[INFO] 
[INFO] --- maven-surefire-plugin:2.17:test (default-test) @ heritrix3-controller ---
[INFO] Surefire report directory: /home/cibuild02/workspace/NetarchiveSuite-Full-Test-staging/harvester/heritrix3/heritrix3-controller/target/surefire-reports

-------------------------------------------------------
 T E S T S
-------------------------------------------------------
Running dk.netarkivet.harvester.harvesting.report.HarvestReportGeneratorTest
SLF4J: Class path contains multiple SLF4J bindings.
SLF4J: Found binding in [jar:file:/home/cibuild02/.m2/repository/ch/qos/logback/logback-classic/1.2.3/logback-classic-1.2.3.jar!/org/slf4j/impl/StaticLoggerBinder.class]
SLF4J: Found binding in [jar:file:/home/cibuild02/.m2/repository/org/slf4j/slf4j-log4j12/1.7.5/slf4j-log4j12-1.7.5.jar!/org/slf4j/impl/StaticLoggerBinder.class]
SLF4J: See http://www.slf4j.org/codes.html#multiple_bindings for an explanation.
SLF4J: Actual binding is of type [ch.qos.logback.classic.util.ContextSelectorStaticBinder]
13:42:43.409 [main] INFO dk.netarkivet.harvester.heritrix3.report.HarvestReportGenerator - Starting pre-processing of harvest report for job 42
13:42:43.457 [main] INFO dk.netarkivet.harvester.heritrix3.report.HarvestReportGenerator - DISREGARD_SEEDURL_INFORMATION_IN_CRAWLLOG: false
13:42:43.621 [main] INFO dk.netarkivet.common.utils.TLD - Did not found external public suffix list at '/home/cibuild02/workspace/NetarchiveSuite-Full-Test-staging/harvester/heritrix3/heritrix3-controller/conf/public_suffix_list.dat'! Reading instead the public suffixes list from embedded file 'dk/netarkivet/common/utils/public_suffix_list.dat' in common-core.jar-VERSION.jar.
13:42:44.431 [main] INFO dk.netarkivet.common.utils.TLD - Read 0 TLDs from public suffix file
13:42:44.458 [main] DEBUG dk.netarkivet.common.utils.TLD - No tlds found in settingsfiles 
13:42:44.840 [main] INFO dk.netarkivet.harvester.heritrix3.report.HarvestReportGenerator - Finished pre-processing of harvest report for job 42, operation took 00d 00:23:14
Tests run: 1, Failures: 0, Errors: 0, Skipped: 0, Time elapsed: 3.812 sec - in dk.netarkivet.harvester.harvesting.report.HarvestReportGeneratorTest

Results :

Tests run: 1, Failures: 0, Errors: 0, Skipped: 0

[JENKINS] Recording test results
[INFO] 
[INFO] --- maven-jgit-buildnumber-plugin:1.2.9:extract-buildnumber (git-buildnumber) @ heritrix3-controller ---
[INFO] 
[INFO] --- maven-jar-plugin:2.4:jar (default-jar) @ heritrix3-controller ---
[INFO] Building jar: /home/cibuild02/workspace/NetarchiveSuite-Full-Test-staging/harvester/heritrix3/heritrix3-controller/target/heritrix3-controller-5.4-SNAPSHOT.jar
[INFO] 
[INFO] >>> maven-source-plugin:2.2.1:jar (attach-sources) > generate-sources @ heritrix3-controller >>>
[WARNING] Failed to getClass for org.apache.maven.plugin.source.SourceJarMojo
[INFO] 
[INFO] <<< maven-source-plugin:2.2.1:jar (attach-sources) < generate-sources @ heritrix3-controller <<<
[INFO] 
[INFO] --- maven-source-plugin:2.2.1:jar (attach-sources) @ heritrix3-controller ---
[INFO] Building jar: /home/cibuild02/workspace/NetarchiveSuite-Full-Test-staging/harvester/heritrix3/heritrix3-controller/target/heritrix3-controller-5.4-SNAPSHOT-sources.jar
[INFO] 
[INFO] --- maven-javadoc-plugin:2.10.3:jar (attach-javadocs) @ heritrix3-controller ---
[INFO] 
3 warnings
[WARNING] Javadoc Warnings
[WARNING] /home/cibuild02/workspace/NetarchiveSuite-Full-Test-staging/harvester/heritrix3/heritrix3-controller/src/main/java/dk/netarkivet/harvester/heritrix3/Heritrix3Settings.java:174: warning - Tag @see: can't find documentHarvest(dk.netarkivet.harvester.harvesting.IngestableFiles) in dk.netarkivet.harvester.heritrix3.HarvestDocumentation
[WARNING] /home/cibuild02/workspace/NetarchiveSuite-Full-Test-staging/harvester/heritrix3/heritrix3-controller/src/main/java/dk/netarkivet/harvester/heritrix3/Heritrix3Settings.java:165: warning - Tag @see: can't find documentHarvest(dk.netarkivet.harvester.harvesting.IngestableFiles) in dk.netarkivet.harvester.heritrix3.HarvestDocumentation
[WARNING] /home/cibuild02/workspace/NetarchiveSuite-Full-Test-staging/harvester/heritrix3/heritrix3-controller/src/main/java/dk/netarkivet/harvester/heritrix3/Heritrix3Settings.java:156: warning - Tag @see: can't find documentHarvest(dk.netarkivet.harvester.harvesting.IngestableFiles) in dk.netarkivet.harvester.heritrix3.HarvestDocumentation
[INFO] Building jar: /home/cibuild02/workspace/NetarchiveSuite-Full-Test-staging/harvester/heritrix3/heritrix3-controller/target/heritrix3-controller-5.4-SNAPSHOT-javadoc.jar
[INFO] 
[INFO] --- maven-install-plugin:2.4:install (default-install) @ heritrix3-controller ---
[INFO] Installing /home/cibuild02/workspace/NetarchiveSuite-Full-Test-staging/harvester/heritrix3/heritrix3-controller/target/heritrix3-controller-5.4-SNAPSHOT.jar to /home/cibuild02/.m2/repository/org/netarchivesuite/heritrix3-controller/5.4-SNAPSHOT/heritrix3-controller-5.4-SNAPSHOT.jar
[INFO] Installing /home/cibuild02/workspace/NetarchiveSuite-Full-Test-staging/harvester/heritrix3/heritrix3-controller/pom.xml to /home/cibuild02/.m2/repository/org/netarchivesuite/heritrix3-controller/5.4-SNAPSHOT/heritrix3-controller-5.4-SNAPSHOT.pom
[INFO] Installing /home/cibuild02/workspace/NetarchiveSuite-Full-Test-staging/harvester/heritrix3/heritrix3-controller/target/heritrix3-controller-5.4-SNAPSHOT-sources.jar to /home/cibuild02/.m2/repository/org/netarchivesuite/heritrix3-controller/5.4-SNAPSHOT/heritrix3-controller-5.4-SNAPSHOT-sources.jar
[INFO] Installing /home/cibuild02/workspace/NetarchiveSuite-Full-Test-staging/harvester/heritrix3/heritrix3-controller/target/heritrix3-controller-5.4-SNAPSHOT-javadoc.jar to /home/cibuild02/.m2/repository/org/netarchivesuite/heritrix3-controller/5.4-SNAPSHOT/heritrix3-controller-5.4-SNAPSHOT-javadoc.jar
[JENKINS] Archiving disabled
[INFO]                                                                         
[INFO] ------------------------------------------------------------------------
[INFO] Building NetarchiveSuite - Status - Webapp 5.4-SNAPSHOT
[INFO] ------------------------------------------------------------------------
[INFO] 
[INFO] --- maven-clean-plugin:2.5:clean (default-clean) @ status-gui ---
[INFO] Deleting /home/cibuild02/workspace/NetarchiveSuite-Full-Test-staging/monitor/status-gui/target
[INFO] 
[INFO] --- maven-resources-plugin:2.6:resources (default-resources) @ status-gui ---
[INFO] Using 'UTF-8' encoding to copy filtered resources.
[INFO] skip non existing resourceDirectory /home/cibuild02/workspace/NetarchiveSuite-Full-Test-staging/monitor/status-gui/src/main/resources
[INFO] 
[INFO] --- maven-compiler-plugin:3.1:compile (default-compile) @ status-gui ---
[INFO] No sources to compile
[INFO] 
[INFO] --- maven-resources-plugin:2.6:testResources (default-testResources) @ status-gui ---
[INFO] Using 'UTF-8' encoding to copy filtered resources.
[INFO] skip non existing resourceDirectory /home/cibuild02/workspace/NetarchiveSuite-Full-Test-staging/monitor/status-gui/src/test/resources
[INFO] 
[INFO] --- maven-compiler-plugin:3.1:testCompile (default-testCompile) @ status-gui ---
[INFO] No sources to compile
[INFO] 
[INFO] --- maven-surefire-plugin:2.17:test (default-test) @ status-gui ---
[INFO] No tests to run.
[INFO] 
[INFO] --- maven-jgit-buildnumber-plugin:1.2.9:extract-buildnumber (git-buildnumber) @ status-gui ---
[JENKINS] Recording test results
[INFO] 
[INFO] --- maven-war-plugin:2.2:war (default-war) @ status-gui ---
[INFO] Packaging webapp
[INFO] Assembling webapp [status-gui] in [/home/cibuild02/workspace/NetarchiveSuite-Full-Test-staging/monitor/status-gui/target/Status]
[INFO] Processing war project
[INFO] Copying webapp resources [/home/cibuild02/workspace/NetarchiveSuite-Full-Test-staging/monitor/status-gui/src/main/webapp]
[INFO] Webapp assembled in [140 msecs]
[INFO] Building war: /home/cibuild02/workspace/NetarchiveSuite-Full-Test-staging/monitor/status-gui/target/Status.war
[INFO] WEB-INF/web.xml already added, skipping
[INFO] 
[INFO] >>> maven-source-plugin:2.2.1:jar (attach-sources) > generate-sources @ status-gui >>>
[WARNING] Failed to getClass for org.apache.maven.plugin.source.SourceJarMojo
[INFO] 
[INFO] <<< maven-source-plugin:2.2.1:jar (attach-sources) < generate-sources @ status-gui <<<
[INFO] 
[INFO] --- maven-source-plugin:2.2.1:jar (attach-sources) @ status-gui ---
[INFO] No sources in project. Archive not created.
[INFO] 
[INFO] --- maven-javadoc-plugin:2.10.3:jar (attach-javadocs) @ status-gui ---
[INFO] 
[INFO] --- maven-install-plugin:2.4:install (default-install) @ status-gui ---
[INFO] Installing /home/cibuild02/workspace/NetarchiveSuite-Full-Test-staging/monitor/status-gui/target/Status.war to /home/cibuild02/.m2/repository/org/netarchivesuite/status-gui/5.4-SNAPSHOT/status-gui-5.4-SNAPSHOT.war
[INFO] Installing /home/cibuild02/workspace/NetarchiveSuite-Full-Test-staging/monitor/status-gui/pom.xml to /home/cibuild02/.m2/repository/org/netarchivesuite/status-gui/5.4-SNAPSHOT/status-gui-5.4-SNAPSHOT.pom
[JENKINS] Archiving disabled
[INFO]                                                                         
[INFO] ------------------------------------------------------------------------
[INFO] Building NetarchiveSuite - qa - webapp 5.4-SNAPSHOT
[INFO] ------------------------------------------------------------------------
[INFO] 
[INFO] --- maven-clean-plugin:2.5:clean (default-clean) @ qa-gui ---
[INFO] Deleting /home/cibuild02/workspace/NetarchiveSuite-Full-Test-staging/harvester/qa-gui/target
[INFO] 
[INFO] --- maven-resources-plugin:2.6:resources (default-resources) @ qa-gui ---
[INFO] Using 'UTF-8' encoding to copy filtered resources.
[INFO] skip non existing resourceDirectory /home/cibuild02/workspace/NetarchiveSuite-Full-Test-staging/harvester/qa-gui/src/main/resources
[INFO] 
[INFO] --- maven-compiler-plugin:3.1:compile (default-compile) @ qa-gui ---
[INFO] No sources to compile
[INFO] 
[INFO] --- maven-resources-plugin:2.6:testResources (default-testResources) @ qa-gui ---
[INFO] Using 'UTF-8' encoding to copy filtered resources.
[INFO] skip non existing resourceDirectory /home/cibuild02/workspace/NetarchiveSuite-Full-Test-staging/harvester/qa-gui/src/test/resources
[INFO] 
[INFO] --- maven-compiler-plugin:3.1:testCompile (default-testCompile) @ qa-gui ---
[INFO] No sources to compile
[INFO] 
[INFO] --- maven-surefire-plugin:2.17:test (default-test) @ qa-gui ---
[INFO] No tests to run.
[INFO] 
[JENKINS] Recording test results[INFO] --- maven-jgit-buildnumber-plugin:1.2.9:extract-buildnumber (git-buildnumber) @ qa-gui ---

[INFO] 
[INFO] --- maven-war-plugin:2.2:war (default-war) @ qa-gui ---
[INFO] Packaging webapp
[INFO] Assembling webapp [qa-gui] in [/home/cibuild02/workspace/NetarchiveSuite-Full-Test-staging/harvester/qa-gui/target/QA]
[INFO] Processing war project
[INFO] Copying webapp resources [/home/cibuild02/workspace/NetarchiveSuite-Full-Test-staging/harvester/qa-gui/src/main/webapp]
[INFO] Webapp assembled in [66 msecs]
[INFO] Building war: /home/cibuild02/workspace/NetarchiveSuite-Full-Test-staging/harvester/qa-gui/target/QA.war
[INFO] WEB-INF/web.xml already added, skipping
[INFO] 
[INFO] >>> maven-source-plugin:2.2.1:jar (attach-sources) > generate-sources @ qa-gui >>>
[WARNING] Failed to getClass for org.apache.maven.plugin.source.SourceJarMojo
[INFO] 
[INFO] <<< maven-source-plugin:2.2.1:jar (attach-sources) < generate-sources @ qa-gui <<<
[INFO] 
[INFO] --- maven-source-plugin:2.2.1:jar (attach-sources) @ qa-gui ---
[INFO] No sources in project. Archive not created.
[INFO] 
[INFO] --- maven-javadoc-plugin:2.10.3:jar (attach-javadocs) @ qa-gui ---
[INFO] 
[INFO] --- maven-install-plugin:2.4:install (default-install) @ qa-gui ---
[INFO] Installing /home/cibuild02/workspace/NetarchiveSuite-Full-Test-staging/harvester/qa-gui/target/QA.war to /home/cibuild02/.m2/repository/org/netarchivesuite/qa-gui/5.4-SNAPSHOT/qa-gui-5.4-SNAPSHOT.war
[INFO] Installing /home/cibuild02/workspace/NetarchiveSuite-Full-Test-staging/harvester/qa-gui/pom.xml to /home/cibuild02/.m2/repository/org/netarchivesuite/qa-gui/5.4-SNAPSHOT/qa-gui-5.4-SNAPSHOT.pom
[JENKINS] Archiving disabled
[INFO]                                                                         
[INFO] ------------------------------------------------------------------------
[INFO] Building NetarchiveSuite - history - webapp 5.4-SNAPSHOT
[INFO] ------------------------------------------------------------------------
[INFO] 
[INFO] --- maven-clean-plugin:2.5:clean (default-clean) @ history-gui ---
[INFO] Deleting /home/cibuild02/workspace/NetarchiveSuite-Full-Test-staging/harvester/history-gui/target
[INFO] 
[INFO] --- maven-resources-plugin:2.6:resources (default-resources) @ history-gui ---
[INFO] Using 'UTF-8' encoding to copy filtered resources.
[INFO] skip non existing resourceDirectory /home/cibuild02/workspace/NetarchiveSuite-Full-Test-staging/harvester/history-gui/src/main/resources
[INFO] 
[INFO] --- maven-compiler-plugin:3.1:compile (default-compile) @ history-gui ---
[INFO] No sources to compile
[INFO] 
[INFO] --- maven-resources-plugin:2.6:testResources (default-testResources) @ history-gui ---
[INFO] Using 'UTF-8' encoding to copy filtered resources.
[INFO] skip non existing resourceDirectory /home/cibuild02/workspace/NetarchiveSuite-Full-Test-staging/harvester/history-gui/src/test/resources
[INFO] 
[INFO] --- maven-compiler-plugin:3.1:testCompile (default-testCompile) @ history-gui ---
[INFO] No sources to compile
[INFO] 
[INFO] --- maven-surefire-plugin:2.17:test (default-test) @ history-gui ---
[INFO] No tests to run.
[INFO] 
[INFO] --- maven-jgit-buildnumber-plugin:1.2.9:extract-buildnumber (git-buildnumber) @ history-gui ---
[JENKINS] Recording test results
[INFO] 
[INFO] --- maven-war-plugin:2.2:war (default-war) @ history-gui ---
[INFO] Packaging webapp
[INFO] Assembling webapp [history-gui] in [/home/cibuild02/workspace/NetarchiveSuite-Full-Test-staging/harvester/history-gui/target/History]
[INFO] Processing war project
[INFO] Copying webapp resources [/home/cibuild02/workspace/NetarchiveSuite-Full-Test-staging/harvester/history-gui/src/main/webapp]
[INFO] Webapp assembled in [275 msecs]
[INFO] Building war: /home/cibuild02/workspace/NetarchiveSuite-Full-Test-staging/harvester/history-gui/target/History.war
[INFO] WEB-INF/web.xml already added, skipping
[INFO] 
[INFO] >>> maven-source-plugin:2.2.1:jar (attach-sources) > generate-sources @ history-gui >>>
[WARNING] Failed to getClass for org.apache.maven.plugin.source.SourceJarMojo
[INFO] 
[INFO] <<< maven-source-plugin:2.2.1:jar (attach-sources) < generate-sources @ history-gui <<<
[INFO] 
[INFO] --- maven-source-plugin:2.2.1:jar (attach-sources) @ history-gui ---
[INFO] No sources in project. Archive not created.
[INFO] 
[INFO] --- maven-javadoc-plugin:2.10.3:jar (attach-javadocs) @ history-gui ---
[INFO] 
[INFO] --- maven-install-plugin:2.4:install (default-install) @ history-gui ---
[INFO] Installing /home/cibuild02/workspace/NetarchiveSuite-Full-Test-staging/harvester/history-gui/target/History.war to /home/cibuild02/.m2/repository/org/netarchivesuite/history-gui/5.4-SNAPSHOT/history-gui-5.4-SNAPSHOT.war
[INFO] Installing /home/cibuild02/workspace/NetarchiveSuite-Full-Test-staging/harvester/history-gui/pom.xml to /home/cibuild02/.m2/repository/org/netarchivesuite/history-gui/5.4-SNAPSHOT/history-gui-5.4-SNAPSHOT.pom
[JENKINS] Archiving disabled
[INFO]                                                                         
[INFO] ------------------------------------------------------------------------
[INFO] Building NetarchiveSuite - harvestDefinition - webapp 5.4-SNAPSHOT
[INFO] ------------------------------------------------------------------------
[INFO] 
[INFO] --- maven-clean-plugin:2.5:clean (default-clean) @ harvestdefinition-gui ---
[INFO] Deleting /home/cibuild02/workspace/NetarchiveSuite-Full-Test-staging/harvester/harvestdefinition-gui/target
[INFO] 
[INFO] --- maven-resources-plugin:2.6:resources (default-resources) @ harvestdefinition-gui ---
[INFO] Using 'UTF-8' encoding to copy filtered resources.
[INFO] skip non existing resourceDirectory /home/cibuild02/workspace/NetarchiveSuite-Full-Test-staging/harvester/harvestdefinition-gui/src/main/resources
[INFO] 
[INFO] --- maven-compiler-plugin:3.1:compile (default-compile) @ harvestdefinition-gui ---
[INFO] No sources to compile
[INFO] 
[INFO] --- maven-resources-plugin:2.6:testResources (default-testResources) @ harvestdefinition-gui ---
[INFO] Using 'UTF-8' encoding to copy filtered resources.
[INFO] skip non existing resourceDirectory /home/cibuild02/workspace/NetarchiveSuite-Full-Test-staging/harvester/harvestdefinition-gui/src/test/resources
[INFO] 
[INFO] --- maven-compiler-plugin:3.1:testCompile (default-testCompile) @ harvestdefinition-gui ---
[INFO] No sources to compile
[INFO] 
[INFO] --- maven-surefire-plugin:2.17:test (default-test) @ harvestdefinition-gui ---
[INFO] No tests to run.
[JENKINS] Recording test results[INFO] 
[INFO] --- maven-jgit-buildnumber-plugin:1.2.9:extract-buildnumber (git-buildnumber) @ harvestdefinition-gui ---

[INFO] 
[INFO] --- maven-war-plugin:2.2:war (default-war) @ harvestdefinition-gui ---
[INFO] Packaging webapp
[INFO] Assembling webapp [harvestdefinition-gui] in [/home/cibuild02/workspace/NetarchiveSuite-Full-Test-staging/harvester/harvestdefinition-gui/target/HarvestDefinition]
[INFO] Processing war project
[INFO] Copying webapp resources [/home/cibuild02/workspace/NetarchiveSuite-Full-Test-staging/harvester/harvestdefinition-gui/src/main/webapp]
[INFO] Webapp assembled in [227 msecs]
[INFO] Building war: /home/cibuild02/workspace/NetarchiveSuite-Full-Test-staging/harvester/harvestdefinition-gui/target/HarvestDefinition.war
[INFO] WEB-INF/web.xml already added, skipping
[INFO] 
[INFO] >>> maven-source-plugin:2.2.1:jar (attach-sources) > generate-sources @ harvestdefinition-gui >>>
[WARNING] Failed to getClass for org.apache.maven.plugin.source.SourceJarMojo
[INFO] 
[INFO] <<< maven-source-plugin:2.2.1:jar (attach-sources) < generate-sources @ harvestdefinition-gui <<<
[INFO] 
[INFO] --- maven-source-plugin:2.2.1:jar (attach-sources) @ harvestdefinition-gui ---
[INFO] No sources in project. Archive not created.
[INFO] 
[INFO] --- maven-javadoc-plugin:2.10.3:jar (attach-javadocs) @ harvestdefinition-gui ---
[INFO] 
[INFO] --- maven-install-plugin:2.4:install (default-install) @ harvestdefinition-gui ---
[INFO] Installing /home/cibuild02/workspace/NetarchiveSuite-Full-Test-staging/harvester/harvestdefinition-gui/target/HarvestDefinition.war to /home/cibuild02/.m2/repository/org/netarchivesuite/harvestdefinition-gui/5.4-SNAPSHOT/harvestdefinition-gui-5.4-SNAPSHOT.war
[INFO] Installing /home/cibuild02/workspace/NetarchiveSuite-Full-Test-staging/harvester/harvestdefinition-gui/pom.xml to /home/cibuild02/.m2/repository/org/netarchivesuite/harvestdefinition-gui/5.4-SNAPSHOT/harvestdefinition-gui-5.4-SNAPSHOT.pom
[JENKINS] Archiving disabled
[INFO]                                                                         
[INFO] ------------------------------------------------------------------------
[INFO] Building NetarchiveSuite - harvestChannel - webapp 5.4-SNAPSHOT
[INFO] ------------------------------------------------------------------------
[INFO] 
[INFO] --- maven-clean-plugin:2.5:clean (default-clean) @ harvestchannel-gui ---
[INFO] Deleting /home/cibuild02/workspace/NetarchiveSuite-Full-Test-staging/harvester/harvestchannel-gui/target
[INFO] 
[INFO] --- maven-resources-plugin:2.6:resources (default-resources) @ harvestchannel-gui ---
[INFO] Using 'UTF-8' encoding to copy filtered resources.
[INFO] skip non existing resourceDirectory /home/cibuild02/workspace/NetarchiveSuite-Full-Test-staging/harvester/harvestchannel-gui/src/main/resources
[INFO] 
[INFO] --- maven-compiler-plugin:3.1:compile (default-compile) @ harvestchannel-gui ---
[INFO] No sources to compile
[INFO] 
[INFO] --- maven-resources-plugin:2.6:testResources (default-testResources) @ harvestchannel-gui ---
[INFO] Using 'UTF-8' encoding to copy filtered resources.
[INFO] skip non existing resourceDirectory /home/cibuild02/workspace/NetarchiveSuite-Full-Test-staging/harvester/harvestchannel-gui/src/test/resources
[INFO] 
[INFO] --- maven-compiler-plugin:3.1:testCompile (default-testCompile) @ harvestchannel-gui ---
[INFO] No sources to compile
[INFO] 
[INFO] --- maven-surefire-plugin:2.17:test (default-test) @ harvestchannel-gui ---
[INFO] No tests to run.
[JENKINS] Recording test results[INFO] 
[INFO] --- maven-jgit-buildnumber-plugin:1.2.9:extract-buildnumber (git-buildnumber) @ harvestchannel-gui ---

[INFO] 
[INFO] --- maven-war-plugin:2.2:war (default-war) @ harvestchannel-gui ---
[INFO] Packaging webapp
[INFO] Assembling webapp [harvestchannel-gui] in [/home/cibuild02/workspace/NetarchiveSuite-Full-Test-staging/harvester/harvestchannel-gui/target/HarvestChannel]
[INFO] Processing war project
[INFO] Copying webapp resources [/home/cibuild02/workspace/NetarchiveSuite-Full-Test-staging/harvester/harvestchannel-gui/src/main/webapp]
[INFO] Webapp assembled in [32 msecs]
[INFO] Building war: /home/cibuild02/workspace/NetarchiveSuite-Full-Test-staging/harvester/harvestchannel-gui/target/HarvestChannel.war
[INFO] WEB-INF/web.xml already added, skipping
[INFO] 
[INFO] >>> maven-source-plugin:2.2.1:jar (attach-sources) > generate-sources @ harvestchannel-gui >>>
[WARNING] Failed to getClass for org.apache.maven.plugin.source.SourceJarMojo
[INFO] 
[INFO] <<< maven-source-plugin:2.2.1:jar (attach-sources) < generate-sources @ harvestchannel-gui <<<
[INFO] 
[INFO] --- maven-source-plugin:2.2.1:jar (attach-sources) @ harvestchannel-gui ---
[INFO] No sources in project. Archive not created.
[INFO] 
[INFO] --- maven-javadoc-plugin:2.10.3:jar (attach-javadocs) @ harvestchannel-gui ---
[INFO] 
[INFO] --- maven-install-plugin:2.4:install (default-install) @ harvestchannel-gui ---
[INFO] Installing /home/cibuild02/workspace/NetarchiveSuite-Full-Test-staging/harvester/harvestchannel-gui/target/HarvestChannel.war to /home/cibuild02/.m2/repository/org/netarchivesuite/harvestchannel-gui/5.4-SNAPSHOT/harvestchannel-gui-5.4-SNAPSHOT.war
[INFO] Installing /home/cibuild02/workspace/NetarchiveSuite-Full-Test-staging/harvester/harvestchannel-gui/pom.xml to /home/cibuild02/.m2/repository/org/netarchivesuite/harvestchannel-gui/5.4-SNAPSHOT/harvestchannel-gui-5.4-SNAPSHOT.pom
[JENKINS] Archiving disabled
[INFO]                                                                         
[INFO] ------------------------------------------------------------------------
[INFO] Building NetarchiveSuite - deploy - distribution 5.4-SNAPSHOT
[INFO] ------------------------------------------------------------------------
[INFO] 
[INFO] --- maven-clean-plugin:2.5:clean (default-clean) @ distribution ---
[INFO] Deleting /home/cibuild02/workspace/NetarchiveSuite-Full-Test-staging/deploy/distribution/target
[INFO] 
[INFO] --- maven-jgit-buildnumber-plugin:1.2.9:extract-buildnumber (git-buildnumber) @ distribution ---
[INFO] 
[INFO] --- maven-assembly-plugin:2.4.1:single (distro-assembly) @ distribution ---
[INFO] Reading assembly descriptor: src/main/assembly/distribution.xml
[INFO] Building zip: /home/cibuild02/workspace/NetarchiveSuite-Full-Test-staging/deploy/distribution/target/NetarchiveSuite-5.4-SNAPSHOT.zip
[INFO] 
[INFO] >>> maven-source-plugin:2.2.1:jar (attach-sources) > generate-sources @ distribution >>>
[WARNING] Failed to getClass for org.apache.maven.plugin.source.SourceJarMojo
[INFO] 
[INFO] <<< maven-source-plugin:2.2.1:jar (attach-sources) < generate-sources @ distribution <<<
[INFO] 
[INFO] --- maven-source-plugin:2.2.1:jar (attach-sources) @ distribution ---
[INFO] 
[INFO] --- maven-javadoc-plugin:2.10.3:jar (attach-javadocs) @ distribution ---
[INFO] Not executing Javadoc as the project is not a Java classpath-capable package
[INFO] 
[INFO] --- maven-install-plugin:2.4:install (default-install) @ distribution ---
[INFO] Installing /home/cibuild02/workspace/NetarchiveSuite-Full-Test-staging/deploy/distribution/pom.xml to /home/cibuild02/.m2/repository/org/netarchivesuite/distribution/5.4-SNAPSHOT/distribution-5.4-SNAPSHOT.pom
[INFO] Installing /home/cibuild02/workspace/NetarchiveSuite-Full-Test-staging/deploy/distribution/target/NetarchiveSuite-5.4-SNAPSHOT.zip to /home/cibuild02/.m2/repository/org/netarchivesuite/distribution/5.4-SNAPSHOT/distribution-5.4-SNAPSHOT.zip
[JENKINS] Archiving disabled
[INFO]                                                                         
[INFO] ------------------------------------------------------------------------
[INFO] Building NetarchiveSuite - deploy - test 5.4-SNAPSHOT
[INFO] ------------------------------------------------------------------------
[INFO] 
[INFO] --- maven-clean-plugin:2.5:clean (default-clean) @ deploy-test ---
[INFO] Deleting /home/cibuild02/workspace/NetarchiveSuite-Full-Test-staging/deploy/deploy-test/target
[INFO] 
[INFO] --- jacoco-maven-plugin:0.7.9:prepare-agent (agent) @ deploy-test ---
[INFO] argLine set to -javaagent:/home/cibuild02/.m2/repository/org/jacoco/org.jacoco.agent/0.7.9/org.jacoco.agent-0.7.9-runtime.jar=destfile=/home/cibuild02/workspace/NetarchiveSuite-Full-Test-staging/deploy/deploy-test/../target/jacoco.exec,append=true
[INFO] 
[INFO] --- maven-resources-plugin:2.6:resources (default-resources) @ deploy-test ---
[INFO] Using 'UTF-8' encoding to copy filtered resources.
[INFO] skip non existing resourceDirectory /home/cibuild02/workspace/NetarchiveSuite-Full-Test-staging/deploy/deploy-test/src/main/resources
[INFO] 
[INFO] --- maven-compiler-plugin:3.1:compile (default-compile) @ deploy-test ---
[INFO] No sources to compile
[INFO] 
[INFO] --- maven-resources-plugin:2.6:testResources (default-testResources) @ deploy-test ---
[INFO] Using 'UTF-8' encoding to copy filtered resources.
[INFO] Copying 2 resources
[INFO] Copying 502 resources
[INFO] 
[INFO] --- maven-compiler-plugin:3.1:testCompile (default-testCompile) @ deploy-test ---
[INFO] Changes detected - recompiling the module!
[INFO] Compiling 10 source files to /home/cibuild02/workspace/NetarchiveSuite-Full-Test-staging/deploy/deploy-test/target/test-classes
[INFO] 
[INFO] --- maven-surefire-plugin:2.17:test (default-test) @ deploy-test ---
[INFO] Surefire report directory: /home/cibuild02/workspace/NetarchiveSuite-Full-Test-staging/deploy/deploy-test/target/surefire-reports

-------------------------------------------------------
 T E S T S
-------------------------------------------------------
Running dk.netarkivet.deploy.DeployTester
logback-test.xml
Tests run: 21, Failures: 0, Errors: 0, Skipped: 0, Time elapsed: 29.899 sec - in dk.netarkivet.deploy.DeployTester
Running dk.netarkivet.deploy.CompleteSettingsTester
Tests run: 1, Failures: 0, Errors: 0, Skipped: 0, Time elapsed: 0.678 sec - in dk.netarkivet.deploy.CompleteSettingsTester
Running dk.netarkivet.externalsoftware.Bug901Tester
Tests run: 1, Failures: 0, Errors: 0, Skipped: 1, Time elapsed: 0.011 sec - in dk.netarkivet.externalsoftware.Bug901Tester
Running dk.netarkivet.common.CleanupTester
Tests run: 1, Failures: 0, Errors: 0, Skipped: 1, Time elapsed: 0.005 sec - in dk.netarkivet.common.CleanupTester
Running dk.netarkivet.common.distribute.IntegrityTestSuite
Tests run: 1, Failures: 0, Errors: 0, Skipped: 1, Time elapsed: 0.001 sec - in dk.netarkivet.common.distribute.IntegrityTestSuite

Results :

Tests run: 25, Failures: 0, Errors: 0, Skipped: 3

[JENKINS] Recording test results
[INFO] 
[INFO] --- maven-jgit-buildnumber-plugin:1.2.9:extract-buildnumber (git-buildnumber) @ deploy-test ---
[INFO] 
[INFO] --- maven-jar-plugin:2.4:jar (default-jar) @ deploy-test ---
[WARNING] JAR will be empty - no content was marked for inclusion!
[INFO] Building jar: /home/cibuild02/workspace/NetarchiveSuite-Full-Test-staging/deploy/deploy-test/target/deploy-test-5.4-SNAPSHOT.jar
[INFO] 
[INFO] >>> maven-source-plugin:2.2.1:jar (attach-sources) > generate-sources @ deploy-test >>>
[INFO] 
[INFO] --- jacoco-maven-plugin:0.7.9:prepare-agent (agent) @ deploy-test ---
[INFO] argLine set to -javaagent:/home/cibuild02/.m2/repository/org/jacoco/org.jacoco.agent/0.7.9/org.jacoco.agent-0.7.9-runtime.jar=destfile=/home/cibuild02/workspace/NetarchiveSuite-Full-Test-staging/deploy/deploy-test/../target/jacoco.exec,append=true
[WARNING] Failed to getClass for org.apache.maven.plugin.source.SourceJarMojo
[INFO] 
[INFO] <<< maven-source-plugin:2.2.1:jar (attach-sources) < generate-sources @ deploy-test <<<
[INFO] 
[INFO] --- maven-source-plugin:2.2.1:jar (attach-sources) @ deploy-test ---
[INFO] No sources in project. Archive not created.
[INFO] 
[INFO] --- maven-javadoc-plugin:2.10.3:jar (attach-javadocs) @ deploy-test ---
[INFO] 
[INFO] --- maven-install-plugin:2.4:install (default-install) @ deploy-test ---
[INFO] Installing /home/cibuild02/workspace/NetarchiveSuite-Full-Test-staging/deploy/deploy-test/target/deploy-test-5.4-SNAPSHOT.jar to /home/cibuild02/.m2/repository/org/netarchivesuite/deploy-test/5.4-SNAPSHOT/deploy-test-5.4-SNAPSHOT.jar
[INFO] Installing /home/cibuild02/workspace/NetarchiveSuite-Full-Test-staging/deploy/deploy-test/pom.xml to /home/cibuild02/.m2/repository/org/netarchivesuite/deploy-test/5.4-SNAPSHOT/deploy-test-5.4-SNAPSHOT.pom
[JENKINS] Archiving disabled
[INFO]                                                                         
[INFO] ------------------------------------------------------------------------
[INFO] Building Netarchivesuite - Heritrix3 Bundler 5.4-SNAPSHOT
[INFO] ------------------------------------------------------------------------
[INFO] 
[INFO] --- maven-clean-plugin:2.5:clean (default-clean) @ heritrix3-bundler ---
[INFO] Deleting /home/cibuild02/workspace/NetarchiveSuite-Full-Test-staging/harvester/heritrix3/heritrix3-bundler/target
[INFO] 
[INFO] --- maven-jgit-buildnumber-plugin:1.2.9:extract-buildnumber (git-buildnumber) @ heritrix3-bundler ---
[INFO] 
[INFO] --- maven-assembly-plugin:2.4.1:single (distro-assembly) @ heritrix3-bundler ---
[INFO] Reading assembly descriptor: src/main/assembly/distribution.xml
[WARNING] The following patterns were never triggered in this artifact exclusion filter:
o  'org.eclipse.jetty:*:jar'
o  'org.eclipse.jetty.websocket:*:jar'
o  'org.eclipse.jetty.orbit:*:jar'
o  'org.glassfish:*:jar'
o  'org.glassfish.web:*:jar'
o  'javax.servlet:*:jar'
o  'org.ow2.asm:*:jar'
o  'org.apache.httpcomponents:httpclient:jar:4.2.5'
o  'org.apache.httpcomponents:httpcore:jar:4.2.4'

[INFO] Building zip: /home/cibuild02/workspace/NetarchiveSuite-Full-Test-staging/harvester/heritrix3/heritrix3-bundler/target/NetarchiveSuite-heritrix3-bundler-5.4-SNAPSHOT.zip
[INFO] 
[INFO] >>> maven-source-plugin:2.2.1:jar (attach-sources) > generate-sources @ heritrix3-bundler >>>
[WARNING] Failed to getClass for org.apache.maven.plugin.source.SourceJarMojo
[INFO] 
[INFO] <<< maven-source-plugin:2.2.1:jar (attach-sources) < generate-sources @ heritrix3-bundler <<<
[INFO] 
[INFO] --- maven-source-plugin:2.2.1:jar (attach-sources) @ heritrix3-bundler ---
[INFO] 
[INFO] --- maven-javadoc-plugin:2.10.3:jar (attach-javadocs) @ heritrix3-bundler ---
[INFO] Not executing Javadoc as the project is not a Java classpath-capable package
[INFO] 
[INFO] --- maven-install-plugin:2.4:install (default-install) @ heritrix3-bundler ---
[INFO] Installing /home/cibuild02/workspace/NetarchiveSuite-Full-Test-staging/harvester/heritrix3/heritrix3-bundler/pom.xml to /home/cibuild02/.m2/repository/org/netarchivesuite/heritrix3-bundler/5.4-SNAPSHOT/heritrix3-bundler-5.4-SNAPSHOT.pom
[INFO] Installing /home/cibuild02/workspace/NetarchiveSuite-Full-Test-staging/harvester/heritrix3/heritrix3-bundler/target/NetarchiveSuite-heritrix3-bundler-5.4-SNAPSHOT.zip to /home/cibuild02/.m2/repository/org/netarchivesuite/heritrix3-bundler/5.4-SNAPSHOT/heritrix3-bundler-5.4-SNAPSHOT.zip
[JENKINS] Archiving disabled
[INFO]                                                                         
[INFO] ------------------------------------------------------------------------
[INFO] Building NetarchiveSuite - harvester - test 5.4-SNAPSHOT
[INFO] ------------------------------------------------------------------------
[INFO] 
[INFO] --- maven-clean-plugin:2.5:clean (default-clean) @ harvester-test ---
[INFO] Deleting /home/cibuild02/workspace/NetarchiveSuite-Full-Test-staging/harvester/harvester-test/target
[INFO] 
[INFO] --- jacoco-maven-plugin:0.7.9:prepare-agent (agent) @ harvester-test ---
[INFO] argLine set to -javaagent:/home/cibuild02/.m2/repository/org/jacoco/org.jacoco.agent/0.7.9/org.jacoco.agent-0.7.9-runtime.jar=destfile=/home/cibuild02/workspace/NetarchiveSuite-Full-Test-staging/harvester/harvester-test/../target/jacoco.exec,append=true
[INFO] 
[INFO] --- maven-resources-plugin:2.6:resources (default-resources) @ harvester-test ---
[INFO] Using 'UTF-8' encoding to copy filtered resources.
[INFO] skip non existing resourceDirectory /home/cibuild02/workspace/NetarchiveSuite-Full-Test-staging/harvester/harvester-test/src/main/resources
[INFO] 
[INFO] --- maven-compiler-plugin:3.1:compile (default-compile) @ harvester-test ---
[INFO] No sources to compile
[INFO] 
[INFO] --- maven-resources-plugin:2.6:testResources (default-testResources) @ harvester-test ---
[INFO] Using 'UTF-8' encoding to copy filtered resources.
[INFO] Copying 13 resources
[INFO] Copying 444 resources
[INFO] 
[INFO] --- maven-compiler-plugin:3.1:testCompile (default-testCompile) @ harvester-test ---
[INFO] Changes detected - recompiling the module!
[INFO] Compiling 125 source files to /home/cibuild02/workspace/NetarchiveSuite-Full-Test-staging/harvester/harvester-test/target/test-classes
[WARNING] /home/cibuild02/workspace/NetarchiveSuite-Full-Test-staging/harvester/harvester-test/src/test/java/dk/netarkivet/viewerproxy/distribute/HTTPControllerServerTester.java: Some input files use or override a deprecated API.
[WARNING] /home/cibuild02/workspace/NetarchiveSuite-Full-Test-staging/harvester/harvester-test/src/test/java/dk/netarkivet/viewerproxy/distribute/HTTPControllerServerTester.java: Recompile with -Xlint:deprecation for details.
[WARNING] /home/cibuild02/workspace/NetarchiveSuite-Full-Test-staging/harvester/harvester-test/src/test/java/dk/netarkivet/harvester/indexserver/CombiningMultiFileBasedCacheTester.java: /home/cibuild02/workspace/NetarchiveSuite-Full-Test-staging/harvester/harvester-test/src/test/java/dk/netarkivet/harvester/indexserver/CombiningMultiFileBasedCacheTester.java uses unchecked or unsafe operations.
[WARNING] /home/cibuild02/workspace/NetarchiveSuite-Full-Test-staging/harvester/harvester-test/src/test/java/dk/netarkivet/harvester/indexserver/CombiningMultiFileBasedCacheTester.java: Recompile with -Xlint:unchecked for details.
[INFO] 
[INFO] --- maven-surefire-plugin:2.17:test (default-test) @ harvester-test ---
[INFO] Surefire report directory: /home/cibuild02/workspace/NetarchiveSuite-Full-Test-staging/harvester/harvester-test/target/surefire-reports

-------------------------------------------------------
 T E S T S
-------------------------------------------------------

-------------------------------------------------------
 T E S T S
-------------------------------------------------------
Running dk.netarkivet.viewerproxy.NotifyingURIResolverTester
Tests run: 3, Failures: 0, Errors: 0, Skipped: 0, Time elapsed: 0.573 sec - in dk.netarkivet.viewerproxy.NotifyingURIResolverTester
Running dk.netarkivet.viewerproxy.URIObserverTester
Tests run: 1, Failures: 0, Errors: 0, Skipped: 0, Time elapsed: 0.483 sec - in dk.netarkivet.viewerproxy.URIObserverTester
Running dk.netarkivet.viewerproxy.distribute.HTTPControllerClientTester
Tests run: 3, Failures: 0, Errors: 0, Skipped: 0, Time elapsed: 3.347 sec - in dk.netarkivet.viewerproxy.distribute.HTTPControllerClientTester
Running dk.netarkivet.viewerproxy.distribute.HTTPControllerServerTester
Tests run: 3, Failures: 0, Errors: 0, Skipped: 0, Time elapsed: 2.952 sec - in dk.netarkivet.viewerproxy.distribute.HTTPControllerServerTester
Cleaned up dk.netarkivet.common.distribute.JMSConnectionMockupMQ
Running dk.netarkivet.viewerproxy.WebProxyTester
Tests run: 7, Failures: 0, Errors: 0, Skipped: 3, Time elapsed: 6.006 sec - in dk.netarkivet.viewerproxy.WebProxyTester
Running dk.netarkivet.viewerproxy.CrawlLogLinesMatchingRegexpTester
Tests run: 1, Failures: 0, Errors: 0, Skipped: 0, Time elapsed: 3.318 sec - in dk.netarkivet.viewerproxy.CrawlLogLinesMatchingRegexpTester
Running dk.netarkivet.viewerproxy.ViewerProxyTester
Tests run: 4, Failures: 0, Errors: 0, Skipped: 0, Time elapsed: 6.133 sec - in dk.netarkivet.viewerproxy.ViewerProxyTester
Cleaned up dk.netarkivet.common.distribute.JMSConnectionMockupMQ
Running dk.netarkivet.viewerproxy.ARCArchiveAccessTester
Tests run: 6, Failures: 0, Errors: 0, Skipped: 0, Time elapsed: 4.723 sec - in dk.netarkivet.viewerproxy.ARCArchiveAccessTester
Running dk.netarkivet.viewerproxy.CommandResolverTester
Tests run: 1, Failures: 0, Errors: 0, Skipped: 0, Time elapsed: 0.679 sec - in dk.netarkivet.viewerproxy.CommandResolverTester
Running dk.netarkivet.viewerproxy.GetDataResolverTester
Tests run: 1, Failures: 0, Errors: 0, Skipped: 0, Time elapsed: 4.177 sec - in dk.netarkivet.viewerproxy.GetDataResolverTester
Cleaned up dk.netarkivet.common.distribute.JMSConnectionMockupMQ
Cleaned up dk.netarkivet.common.distribute.JMSConnectionMockupMQ
Cleaned up dk.netarkivet.common.distribute.HTTPRemoteFileRegistry
Running dk.netarkivet.viewerproxy.UnknownCommandResolverTester
Tests run: 1, Failures: 0, Errors: 0, Skipped: 0, Time elapsed: 0.759 sec - in dk.netarkivet.viewerproxy.UnknownCommandResolverTester
Running dk.netarkivet.viewerproxy.DelegatingControllerTester
Tests run: 6, Failures: 0, Errors: 0, Skipped: 0, Time elapsed: 1.87 sec - in dk.netarkivet.viewerproxy.DelegatingControllerTester
Running dk.netarkivet.viewerproxy.MissingURIRecorderTester
Tests run: 5, Failures: 0, Errors: 0, Skipped: 0, Time elapsed: 0.371 sec - in dk.netarkivet.viewerproxy.MissingURIRecorderTester
Running dk.netarkivet.viewerproxy.webinterface.ReportingTester
Tests run: 3, Failures: 0, Errors: 0, Skipped: 0, Time elapsed: 4.879 sec - in dk.netarkivet.viewerproxy.webinterface.ReportingTester
Cleaned up dk.netarkivet.common.distribute.HTTPRemoteFileRegistry
Running dk.netarkivet.viewerproxy.webinterface.ReportingWarcTester
Tests run: 3, Failures: 0, Errors: 0, Skipped: 0, Time elapsed: 3.433 sec - in dk.netarkivet.viewerproxy.webinterface.ReportingWarcTester
Cleaned up dk.netarkivet.common.distribute.HTTPRemoteFileRegistry
Running dk.netarkivet.harvester.distribute.HarvesterMessageHandlerTester
Tests run: 4, Failures: 0, Errors: 0, Skipped: 0, Time elapsed: 3.491 sec - in dk.netarkivet.harvester.distribute.HarvesterMessageHandlerTester
Running dk.netarkivet.harvester.distribute.HarvesterChannelsTester
Tests run: 1, Failures: 0, Errors: 0, Skipped: 0, Time elapsed: 1.809 sec - in dk.netarkivet.harvester.distribute.HarvesterChannelsTester
Running dk.netarkivet.harvester.distribute.IndexReadyMessageTester
Tests run: 1, Failures: 0, Errors: 0, Skipped: 0, Time elapsed: 1.216 sec - in dk.netarkivet.harvester.distribute.IndexReadyMessageTester
Running dk.netarkivet.harvester.distribute.ChannelIDTester
Tests run: 1, Failures: 0, Errors: 0, Skipped: 0, Time elapsed: 1.726 sec - in dk.netarkivet.harvester.distribute.ChannelIDTester
Running dk.netarkivet.harvester.tools.HarvestdatabaseUpdateApplicationTester
Tests run: 1, Failures: 0, Errors: 0, Skipped: 1, Time elapsed: 0.1 sec - in dk.netarkivet.harvester.tools.HarvestdatabaseUpdateApplicationTester
Running dk.netarkivet.harvester.tools.CreateIndexTester
Creating DEDUP index for ids: [1]
Tests run: 6, Failures: 0, Errors: 0, Skipped: 0, Time elapsed: 3.343 sec - in dk.netarkivet.harvester.tools.CreateIndexTester
Cleaned up dk.netarkivet.common.distribute.JMSConnectionMockupMQ
Cleaned up dk.netarkivet.common.distribute.JMSConnectionMockupMQ
Cleaned up dk.netarkivet.common.distribute.JMSConnectionMockupMQ
Cleaned up dk.netarkivet.common.distribute.JMSConnectionMockupMQ
Cleaned up dk.netarkivet.common.distribute.JMSConnectionMockupMQ
Cleaned up dk.netarkivet.common.distribute.JMSConnectionMockupMQ
Cleaned up dk.netarkivet.common.distribute.JMSConnectionMockupMQ
Cleaned up dk.netarkivet.common.distribute.JMSConnectionMockupMQ
Cleaned up dk.netarkivet.common.distribute.JMSConnectionMockupMQ
Cleaned up dk.netarkivet.common.distribute.JMSConnectionMockupMQ
Cleaned up dk.netarkivet.common.distribute.JMSConnectionMockupMQ
Cleaned up dk.netarkivet.common.distribute.JMSConnectionMockupMQ
Running dk.netarkivet.harvester.harvesting.HeritrixFilesTester
Tests run: 7, Failures: 0, Errors: 0, Skipped: 0, Time elapsed: 1.77 sec - in dk.netarkivet.harvester.harvesting.HeritrixFilesTester
Cleaned up dk.netarkivet.common.distribute.JMSConnectionMockupMQ
Cleaned up dk.netarkivet.common.distribute.JMSConnectionMockupMQ
Cleaned up dk.netarkivet.common.distribute.JMSConnectionMockupMQ
Cleaned up dk.netarkivet.common.distribute.JMSConnectionMockupMQ
Cleaned up dk.netarkivet.common.distribute.JMSConnectionMockupMQ
Cleaned up dk.netarkivet.common.distribute.JMSConnectionMockupMQ
Cleaned up dk.netarkivet.common.distribute.JMSConnectionMockupMQ
Cleaned up dk.netarkivet.common.distribute.JMSConnectionMockupMQ
Cleaned up dk.netarkivet.common.distribute.JMSConnectionMockupMQ
Cleaned up dk.netarkivet.common.distribute.JMSConnectionMockupMQ
Cleaned up dk.netarkivet.common.distribute.JMSConnectionMockupMQ
Cleaned up dk.netarkivet.common.distribute.JMSConnectionMockupMQ
Cleaned up dk.netarkivet.common.distribute.JMSConnectionMockupMQ
Cleaned up dk.netarkivet.common.distribute.JMSConnectionMockupMQ
Running dk.netarkivet.harvester.harvesting.monitor.StartedJobHistoryChartGenTest
log4j:WARN No appenders could be found for logger (com.mchange.v2.log.MLog).
log4j:WARN Please initialize the log4j system properly.
log4j:WARN See http://logging.apache.org/log4j/1.2/faq.html#noconfig for more info.
Tests run: 2, Failures: 0, Errors: 0, Skipped: 0, Time elapsed: 5.808 sec - in dk.netarkivet.harvester.harvesting.monitor.StartedJobHistoryChartGenTest
Running dk.netarkivet.harvester.harvesting.distribute.CrawlProgressMessageTester
Tests run: 1, Failures: 0, Errors: 0, Skipped: 0, Time elapsed: 1.871 sec - in dk.netarkivet.harvester.harvesting.distribute.CrawlProgressMessageTester
Running dk.netarkivet.harvester.harvesting.distribute.CrawlStatusMessageTester
Tests run: 5, Failures: 0, Errors: 0, Skipped: 0, Time elapsed: 2.261 sec - in dk.netarkivet.harvester.harvesting.distribute.CrawlStatusMessageTester
Running dk.netarkivet.harvester.harvesting.distribute.JobEndedMessageTester
Tests run: 1, Failures: 0, Errors: 0, Skipped: 0, Time elapsed: 1.809 sec - in dk.netarkivet.harvester.harvesting.distribute.JobEndedMessageTester
Running dk.netarkivet.harvester.harvesting.distribute.HangingListenerTest
Tests run: 1, Failures: 0, Errors: 0, Skipped: 1, Time elapsed: 0.079 sec - in dk.netarkivet.harvester.harvesting.distribute.HangingListenerTest
Running dk.netarkivet.harvester.harvesting.distribute.DomainStatsTester
Tests run: 4, Failures: 0, Errors: 0, Skipped: 0, Time elapsed: 1.122 sec - in dk.netarkivet.harvester.harvesting.distribute.DomainStatsTester
Running dk.netarkivet.harvester.harvesting.distribute.MetadataEntryTester
Tests run: 6, Failures: 0, Errors: 0, Skipped: 0, Time elapsed: 1.871 sec - in dk.netarkivet.harvester.harvesting.distribute.MetadataEntryTester
Running dk.netarkivet.harvester.harvesting.distribute.DoOneCrawlMessageTester
Tests run: 8, Failures: 0, Errors: 0, Skipped: 0, Time elapsed: 4.708 sec - in dk.netarkivet.harvester.harvesting.distribute.DoOneCrawlMessageTester
Running dk.netarkivet.harvester.datamodel.HourlyFrequencyTester
Tests run: 7, Failures: 0, Errors: 0, Skipped: 0, Time elapsed: 1.064 sec - in dk.netarkivet.harvester.datamodel.HourlyFrequencyTester
Running dk.netarkivet.harvester.datamodel.ScheduleDAOTester
log4j:WARN No appenders could be found for logger (com.mchange.v2.log.MLog).
log4j:WARN Please initialize the log4j system properly.
log4j:WARN See http://logging.apache.org/log4j/1.2/faq.html#noconfig for more info.
Tests run: 9, Failures: 0, Errors: 0, Skipped: 0, Time elapsed: 66.216 sec - in dk.netarkivet.harvester.datamodel.ScheduleDAOTester
Running dk.netarkivet.harvester.datamodel.DomainHistoryTester
Tests run: 3, Failures: 0, Errors: 0, Skipped: 0, Time elapsed: 1.584 sec - in dk.netarkivet.harvester.datamodel.DomainHistoryTester
Running dk.netarkivet.harvester.datamodel.HarvestDefinitionDAOTester
log4j:WARN No appenders could be found for logger (com.mchange.v2.log.MLog).
log4j:WARN Please initialize the log4j system properly.
log4j:WARN See http://logging.apache.org/log4j/1.2/faq.html#noconfig for more info.
Tests run: 25, Failures: 0, Errors: 0, Skipped: 0, Time elapsed: 138.455 sec - in dk.netarkivet.harvester.datamodel.HarvestDefinitionDAOTester
Running dk.netarkivet.harvester.datamodel.AliasInfoTester
Tests run: 4, Failures: 0, Errors: 0, Skipped: 0, Time elapsed: 2.68 sec - in dk.netarkivet.harvester.datamodel.AliasInfoTester
Running dk.netarkivet.harvester.datamodel.FullHarvestTester
log4j:WARN No appenders could be found for logger (com.mchange.v2.log.MLog).
log4j:WARN Please initialize the log4j system properly.
log4j:WARN See http://logging.apache.org/log4j/1.2/faq.html#noconfig for more info.
Tests run: 4, Failures: 0, Errors: 0, Skipped: 0, Time elapsed: 42.745 sec - in dk.netarkivet.harvester.datamodel.FullHarvestTester
Running dk.netarkivet.harvester.datamodel.SeedListTester
log4j:WARN No appenders could be found for logger (com.mchange.v2.log.MLog).
log4j:WARN Please initialize the log4j system properly.
log4j:WARN See http://logging.apache.org/log4j/1.2/faq.html#noconfig for more info.
Tests run: 1, Failures: 0, Errors: 0, Skipped: 0, Time elapsed: 19.518 sec - in dk.netarkivet.harvester.datamodel.SeedListTester
Running dk.netarkivet.harvester.datamodel.MonthlyFrequencyTester
Tests run: 10, Failures: 0, Errors: 0, Skipped: 0, Time elapsed: 1.186 sec - in dk.netarkivet.harvester.datamodel.MonthlyFrequencyTester
Running dk.netarkivet.harvester.datamodel.SparsePartialHarvestTester
log4j:WARN No appenders could be found for logger (com.mchange.v2.log.MLog).
log4j:WARN Please initialize the log4j system properly.
log4j:WARN See http://logging.apache.org/log4j/1.2/faq.html#noconfig for more info.
Tests run: 2, Failures: 0, Errors: 0, Skipped: 0, Time elapsed: 25.778 sec - in dk.netarkivet.harvester.datamodel.SparsePartialHarvestTester
Running dk.netarkivet.harvester.datamodel.GlobalCrawlerTrapListTester
Tests run: 3, Failures: 0, Errors: 0, Skipped: 0, Time elapsed: 20.838 sec - in dk.netarkivet.harvester.datamodel.GlobalCrawlerTrapListTester
Running dk.netarkivet.harvester.datamodel.WeeklyFrequencyTester
Tests run: 7, Failures: 0, Errors: 0, Skipped: 0, Time elapsed: 0.703 sec - in dk.netarkivet.harvester.datamodel.WeeklyFrequencyTester
Running dk.netarkivet.harvester.datamodel.TLDInfoTester
Tests run: 2, Failures: 0, Errors: 0, Skipped: 0, Time elapsed: 0.284 sec - in dk.netarkivet.harvester.datamodel.TLDInfoTester
Running dk.netarkivet.harvester.datamodel.DailyFrequencyTester
Tests run: 7, Failures: 0, Errors: 0, Skipped: 0, Time elapsed: 1.003 sec - in dk.netarkivet.harvester.datamodel.DailyFrequencyTester
Running dk.netarkivet.harvester.datamodel.JobDAOTester
log4j:WARN No appenders could be found for logger (com.mchange.v2.log.MLog).
log4j:WARN Please initialize the log4j system properly.
log4j:WARN See http://logging.apache.org/log4j/1.2/faq.html#noconfig for more info.
Tests run: 19, Failures: 0, Errors: 0, Skipped: 0, Time elapsed: 122.637 sec - in dk.netarkivet.harvester.datamodel.JobDAOTester
Running dk.netarkivet.harvester.datamodel.DomainDBDAOTester
log4j:WARN No appenders could be found for logger (com.mchange.v2.log.MLog).
log4j:WARN Please initialize the log4j system properly.
log4j:WARN See http://logging.apache.org/log4j/1.2/faq.html#noconfig for more info.
Tests run: 11, Failures: 0, Errors: 0, Skipped: 2, Time elapsed: 68.389 sec - in dk.netarkivet.harvester.datamodel.DomainDBDAOTester
Running dk.netarkivet.harvester.datamodel.NumberUtilsTester
Tests run: 3, Failures: 0, Errors: 0, Skipped: 0, Time elapsed: 0.2 sec - in dk.netarkivet.harvester.datamodel.NumberUtilsTester
Running dk.netarkivet.harvester.datamodel.ScheduleDBDAOTester
log4j:WARN No appenders could be found for logger (com.mchange.v2.log.MLog).
log4j:WARN Please initialize the log4j system properly.
log4j:WARN See http://logging.apache.org/log4j/1.2/faq.html#noconfig for more info.
Tests run: 1, Failures: 0, Errors: 0, Skipped: 0, Time elapsed: 12.862 sec - in dk.netarkivet.harvester.datamodel.ScheduleDBDAOTester
Running dk.netarkivet.harvester.datamodel.StopReasonTester
Tests run: 2, Failures: 0, Errors: 0, Skipped: 0, Time elapsed: 1.189 sec - in dk.netarkivet.harvester.datamodel.StopReasonTester
Running dk.netarkivet.harvester.datamodel.MySQLSpecificsTester
Tests run: 2, Failures: 0, Errors: 0, Skipped: 0, Time elapsed: 1.717 sec - in dk.netarkivet.harvester.datamodel.MySQLSpecificsTester
Running dk.netarkivet.harvester.datamodel.HarvestTemplateApplicationTester
Tests run: 1, Failures: 0, Errors: 0, Skipped: 1, Time elapsed: 0.106 sec - in dk.netarkivet.harvester.datamodel.HarvestTemplateApplicationTester
Running dk.netarkivet.harvester.datamodel.extendedfield.ExtendedFieldOptionsTester
Tests run: 1, Failures: 0, Errors: 0, Skipped: 0, Time elapsed: 0.367 sec - in dk.netarkivet.harvester.datamodel.extendedfield.ExtendedFieldOptionsTester
Running dk.netarkivet.harvester.datamodel.extendedfield.ExtendedFieldDefaultValuesTester
Tests run: 3, Failures: 0, Errors: 0, Skipped: 0, Time elapsed: 1.235 sec - in dk.netarkivet.harvester.datamodel.extendedfield.ExtendedFieldDefaultValuesTester
Running dk.netarkivet.harvester.datamodel.extendedfield.ExtendedFieldTypeTester
log4j:WARN No appenders could be found for logger (com.mchange.v2.log.MLog).
log4j:WARN Please initialize the log4j system properly.
log4j:WARN See http://logging.apache.org/log4j/1.2/faq.html#noconfig for more info.
Tests run: 1, Failures: 0, Errors: 0, Skipped: 0, Time elapsed: 13.824 sec - in dk.netarkivet.harvester.datamodel.extendedfield.ExtendedFieldTypeTester
Running dk.netarkivet.harvester.datamodel.extendedfield.ExtendedFieldValueTester
log4j:WARN No appenders could be found for logger (com.mchange.v2.log.MLog).
log4j:WARN Please initialize the log4j system properly.
log4j:WARN See http://logging.apache.org/log4j/1.2/faq.html#noconfig for more info.
Tests run: 1, Failures: 0, Errors: 0, Skipped: 0, Time elapsed: 15.604 sec - in dk.netarkivet.harvester.datamodel.extendedfield.ExtendedFieldValueTester
Running dk.netarkivet.harvester.datamodel.extendedfield.ExtendedFieldTester
log4j:WARN No appenders could be found for logger (com.mchange.v2.log.MLog).
log4j:WARN Please initialize the log4j system properly.
log4j:WARN See http://logging.apache.org/log4j/1.2/faq.html#noconfig for more info.
Tests run: 1, Failures: 0, Errors: 0, Skipped: 0, Time elapsed: 17.38 sec - in dk.netarkivet.harvester.datamodel.extendedfield.ExtendedFieldTester
Running dk.netarkivet.harvester.datamodel.HeritrixTemplateTester
Tests run: 5, Failures: 0, Errors: 0, Skipped: 0, Time elapsed: 6.111 sec - in dk.netarkivet.harvester.datamodel.HeritrixTemplateTester
Running dk.netarkivet.harvester.datamodel.HarvestDefinitionTester
Tests run: 1, Failures: 0, Errors: 0, Skipped: 1, Time elapsed: 0.071 sec - in dk.netarkivet.harvester.datamodel.HarvestDefinitionTester
Running dk.netarkivet.harvester.datamodel.TimedScheduleTester
Tests run: 5, Failures: 0, Errors: 0, Skipped: 0, Time elapsed: 1.006 sec - in dk.netarkivet.harvester.datamodel.TimedScheduleTester
Running dk.netarkivet.harvester.datamodel.RunningJobsInfoDAOTester
log4j:WARN No appenders could be found for logger (com.mchange.v2.log.MLog).
log4j:WARN Please initialize the log4j system properly.
log4j:WARN See http://logging.apache.org/log4j/1.2/faq.html#noconfig for more info.
Tests run: 1, Failures: 0, Errors: 0, Skipped: 0, Time elapsed: 12.979 sec - in dk.netarkivet.harvester.datamodel.RunningJobsInfoDAOTester
Running dk.netarkivet.harvester.datamodel.ScheduleTester
Tests run: 9, Failures: 0, Errors: 0, Skipped: 0, Time elapsed: 48.141 sec - in dk.netarkivet.harvester.datamodel.ScheduleTester
Running dk.netarkivet.harvester.datamodel.JobStatusTester
Tests run: 3, Failures: 0, Errors: 0, Skipped: 0, Time elapsed: 1.304 sec - in dk.netarkivet.harvester.datamodel.JobStatusTester
Running dk.netarkivet.harvester.datamodel.FrequencyTester
Tests run: 1, Failures: 0, Errors: 0, Skipped: 0, Time elapsed: 1.244 sec - in dk.netarkivet.harvester.datamodel.FrequencyTester
Running dk.netarkivet.harvester.datamodel.PartialHarvestTester
log4j:WARN No appenders could be found for logger (com.mchange.v2.log.MLog).
log4j:WARN Please initialize the log4j system properly.
log4j:WARN See http://logging.apache.org/log4j/1.2/faq.html#noconfig for more info.
Tests run: 10, Failures: 0, Errors: 0, Skipped: 1, Time elapsed: 73.994 sec - in dk.netarkivet.harvester.datamodel.PartialHarvestTester
Running dk.netarkivet.harvester.datamodel.ConstantsTester
Tests run: 1, Failures: 0, Errors: 0, Skipped: 0, Time elapsed: 1.271 sec - in dk.netarkivet.harvester.datamodel.ConstantsTester
Running dk.netarkivet.harvester.datamodel.DomainDAOTester
log4j:WARN No appenders could be found for logger (com.mchange.v2.log.MLog).
log4j:WARN Please initialize the log4j system properly.
log4j:WARN See http://logging.apache.org/log4j/1.2/faq.html#noconfig for more info.
Tests run: 18, Failures: 0, Errors: 0, Skipped: 1, Time elapsed: 100.082 sec - in dk.netarkivet.harvester.datamodel.DomainDAOTester
Running dk.netarkivet.harvester.datamodel.DomainTester
log4j:WARN No appenders could be found for logger (com.mchange.v2.log.MLog).
log4j:WARN Please initialize the log4j system properly.
log4j:WARN See http://logging.apache.org/log4j/1.2/faq.html#noconfig for more info.
Tests run: 31, Failures: 0, Errors: 0, Skipped: 1, Time elapsed: 155.101 sec - in dk.netarkivet.harvester.datamodel.DomainTester
Running dk.netarkivet.harvester.datamodel.DomainOwnerInfoTester
Tests run: 1, Failures: 0, Errors: 0, Skipped: 0, Time elapsed: 0.353 sec - in dk.netarkivet.harvester.datamodel.DomainOwnerInfoTester
Running dk.netarkivet.harvester.datamodel.TemplateDAOTester
log4j:WARN No appenders could be found for logger (com.mchange.v2.log.MLog).
log4j:WARN Please initialize the log4j system properly.
log4j:WARN See http://logging.apache.org/log4j/1.2/faq.html#noconfig for more info.
Tests run: 4, Failures: 0, Errors: 0, Skipped: 0, Time elapsed: 31.813 sec - in dk.netarkivet.harvester.datamodel.TemplateDAOTester
Running dk.netarkivet.harvester.datamodel.DerbySpecificsTester
log4j:WARN No appenders could be found for logger (com.mchange.v2.log.MLog).
log4j:WARN Please initialize the log4j system properly.
log4j:WARN See http://logging.apache.org/log4j/1.2/faq.html#noconfig for more info.
Tests run: 2, Failures: 0, Errors: 0, Skipped: 0, Time elapsed: 23.418 sec - in dk.netarkivet.harvester.datamodel.DerbySpecificsTester
Running dk.netarkivet.harvester.datamodel.RepeatingScheduleTester
Tests run: 4, Failures: 0, Errors: 0, Skipped: 0, Time elapsed: 1.515 sec - in dk.netarkivet.harvester.datamodel.RepeatingScheduleTester
Running dk.netarkivet.harvester.datamodel.HarvestDBConnectionTester
Tests run: 1, Failures: 0, Errors: 0, Skipped: 1, Time elapsed: 0.097 sec - in dk.netarkivet.harvester.datamodel.HarvestDBConnectionTester
Running dk.netarkivet.harvester.datamodel.MinuteFrequencyTest
Tests run: 2, Failures: 0, Errors: 0, Skipped: 0, Time elapsed: 1.211 sec - in dk.netarkivet.harvester.datamodel.MinuteFrequencyTest
Running dk.netarkivet.harvester.datamodel.TemplateDAOTesterAlternate
log4j:WARN No appenders could be found for logger (com.mchange.v2.log.MLog).
log4j:WARN Please initialize the log4j system properly.
log4j:WARN See http://logging.apache.org/log4j/1.2/faq.html#noconfig for more info.
Tests run: 1, Failures: 0, Errors: 0, Skipped: 0, Time elapsed: 13.239 sec - in dk.netarkivet.harvester.datamodel.TemplateDAOTesterAlternate
Running dk.netarkivet.harvester.datamodel.GlobalCrawlerTrapListDBDAOTester
log4j:WARN No appenders could be found for logger (com.mchange.v2.log.MLog).
log4j:WARN Please initialize the log4j system properly.
log4j:WARN See http://logging.apache.org/log4j/1.2/faq.html#noconfig for more info.
Tests run: 9, Failures: 0, Errors: 0, Skipped: 0, Time elapsed: 59.293 sec - in dk.netarkivet.harvester.datamodel.GlobalCrawlerTrapListDBDAOTester
Running dk.netarkivet.harvester.indexserver.GetMetadataArchiveBatchJobTester
Tests run: 1, Failures: 0, Errors: 0, Skipped: 0, Time elapsed: 2.822 sec - in dk.netarkivet.harvester.indexserver.GetMetadataArchiveBatchJobTester
Running dk.netarkivet.harvester.indexserver.distribute.IndexRequestMessageTester
Tests run: 7, Failures: 0, Errors: 0, Skipped: 0, Time elapsed: 3.061 sec - in dk.netarkivet.harvester.indexserver.distribute.IndexRequestMessageTester
Running dk.netarkivet.harvester.indexserver.distribute.IndexRequestClientTester
Tests run: 1, Failures: 0, Errors: 0, Skipped: 1, Time elapsed: 0.148 sec - in dk.netarkivet.harvester.indexserver.distribute.IndexRequestClientTester
Running dk.netarkivet.harvester.indexserver.distribute.IndexRequestServerTester
Tests run: 6, Failures: 1, Errors: 0, Skipped: 2, Time elapsed: 4.512 sec <<< FAILURE! - in dk.netarkivet.harvester.indexserver.distribute.IndexRequestServerTester
testUnblocking(dk.netarkivet.harvester.indexserver.distribute.IndexRequestServerTester)  Time elapsed: 0.539 sec  <<< FAILURE!
java.lang.AssertionError: Threads should have been woken up
	at org.junit.Assert.fail(Assert.java:88)
	at org.junit.Assert.assertTrue(Assert.java:41)
	at dk.netarkivet.harvester.indexserver.distribute.IndexRequestServerTester.testUnblocking(IndexRequestServerTester.java:374)

Cleaned up dk.netarkivet.common.distribute.JMSConnectionMockupMQ
Cleaned up dk.netarkivet.common.distribute.JMSConnectionMockupMQ
Cleaned up dk.netarkivet.common.distribute.JMSConnectionMockupMQ
Cleaned up dk.netarkivet.common.distribute.JMSConnectionMockupMQ
Cleaned up dk.netarkivet.common.distribute.JMSConnectionMockupMQ
Cleaned up dk.netarkivet.common.distribute.JMSConnectionMockupMQ
Cleaned up dk.netarkivet.common.distribute.JMSConnectionMockupMQ
Cleaned up dk.netarkivet.common.distribute.JMSConnectionMockupMQ
Running dk.netarkivet.harvester.indexserver.DedupCrawlLogIndexCacheTester
Tests run: 3, Failures: 0, Errors: 0, Skipped: 0, Time elapsed: 14.199 sec - in dk.netarkivet.harvester.indexserver.DedupCrawlLogIndexCacheTester
Cleaned up dk.netarkivet.common.distribute.JMSConnectionMockupMQ
Running dk.netarkivet.harvester.indexserver.FileBasedCacheTester
Tests run: 1, Failures: 0, Errors: 0, Skipped: 1, Time elapsed: 0.404 sec - in dk.netarkivet.harvester.indexserver.FileBasedCacheTester
Running dk.netarkivet.harvester.indexserver.CombiningMultiFileBasedCacheTester
Tests run: 1, Failures: 0, Errors: 0, Skipped: 0, Time elapsed: 2.472 sec - in dk.netarkivet.harvester.indexserver.CombiningMultiFileBasedCacheTester
Cleaned up dk.netarkivet.common.distribute.JMSConnectionMockupMQ
Running dk.netarkivet.harvester.indexserver.CrawlLogIndexCacheTester
Tests run: 2, Failures: 0, Errors: 0, Skipped: 0, Time elapsed: 3.077 sec - in dk.netarkivet.harvester.indexserver.CrawlLogIndexCacheTester
Cleaned up dk.netarkivet.common.distribute.JMSConnectionMockupMQ
Running dk.netarkivet.harvester.indexserver.CDXIndexCacheTester
Tests run: 1, Failures: 0, Errors: 0, Skipped: 0, Time elapsed: 3.169 sec - in dk.netarkivet.harvester.indexserver.CDXIndexCacheTester
Cleaned up dk.netarkivet.common.distribute.JMSConnectionMockupMQ
Running dk.netarkivet.harvester.indexserver.IndexServerTester
Tests run: 1, Failures: 0, Errors: 0, Skipped: 0, Time elapsed: 2.216 sec - in dk.netarkivet.harvester.indexserver.IndexServerTester
Cleaned up dk.netarkivet.common.distribute.JMSConnectionMockupMQ
Cleaned up dk.netarkivet.common.distribute.JMSConnectionMockupMQ
Running dk.netarkivet.harvester.indexserver.CDXOriginCrawlLogIteratorTester
Tests run: 2, Failures: 0, Errors: 0, Skipped: 0, Time elapsed: 2.708 sec - in dk.netarkivet.harvester.indexserver.CDXOriginCrawlLogIteratorTester
Running dk.netarkivet.harvester.indexserver.MultiFileBasedCacheTester
Tests run: 1, Failures: 0, Errors: 0, Skipped: 0, Time elapsed: 1.767 sec - in dk.netarkivet.harvester.indexserver.MultiFileBasedCacheTester
Running dk.netarkivet.harvester.indexserver.RawMetadataCacheTester
Tests run: 4, Failures: 0, Errors: 0, Skipped: 0, Time elapsed: 5.015 sec - in dk.netarkivet.harvester.indexserver.RawMetadataCacheTester
Cleaned up dk.netarkivet.common.distribute.JMSConnectionMockupMQ
Cleaned up dk.netarkivet.common.distribute.JMSConnectionMockupMQ
Cleaned up dk.netarkivet.common.distribute.JMSConnectionMockupMQ
Cleaned up dk.netarkivet.common.distribute.JMSConnectionMockupMQ
Cleaned up dk.netarkivet.common.distribute.JMSConnectionMockupMQ
Cleaned up dk.netarkivet.common.distribute.JMSConnectionMockupMQ
Cleaned up dk.netarkivet.common.distribute.JMSConnectionMockupMQ
Cleaned up dk.netarkivet.common.distribute.JMSConnectionMockupMQ
Cleaned up dk.netarkivet.common.distribute.JMSConnectionMockupMQ
Cleaned up dk.netarkivet.common.distribute.HTTPRemoteFileRegistry
Running dk.netarkivet.harvester.scheduler.HarvestJobGeneratorTest
Tests run: 1, Failures: 0, Errors: 0, Skipped: 1, Time elapsed: 0.511 sec - in dk.netarkivet.harvester.scheduler.HarvestJobGeneratorTest
Running dk.netarkivet.harvester.scheduler.jobgen.DefaultJobGeneratorTest
log4j:WARN No appenders could be found for logger (com.mchange.v2.log.MLog).
log4j:WARN Please initialize the log4j system properly.
log4j:WARN See http://logging.apache.org/log4j/1.2/faq.html#noconfig for more info.
Tests run: 6, Failures: 0, Errors: 0, Skipped: 1, Time elapsed: 33.147 sec - in dk.netarkivet.harvester.scheduler.jobgen.DefaultJobGeneratorTest
Running dk.netarkivet.harvester.HarvesterSettingsTester
Tests run: 2, Failures: 0, Errors: 0, Skipped: 0, Time elapsed: 0.943 sec - in dk.netarkivet.harvester.HarvesterSettingsTester
Running dk.netarkivet.harvester.webinterface.ScheduleDefinitionTester
Tests run: 1, Failures: 0, Errors: 0, Skipped: 1, Time elapsed: 0.071 sec - in dk.netarkivet.harvester.webinterface.ScheduleDefinitionTester
Running dk.netarkivet.harvester.webinterface.SnapshotHarvestDefinitionTester
Tests run: 3, Failures: 0, Errors: 0, Skipped: 0, Time elapsed: 1.785 sec - in dk.netarkivet.harvester.webinterface.SnapshotHarvestDefinitionTester
Running dk.netarkivet.harvester.webinterface.HarvestStatusTester
log4j:WARN No appenders could be found for logger (com.mchange.v2.log.MLog).
log4j:WARN Please initialize the log4j system properly.
log4j:WARN See http://logging.apache.org/log4j/1.2/faq.html#noconfig for more info.
Tests run: 7, Failures: 0, Errors: 0, Skipped: 0, Time elapsed: 48.304 sec - in dk.netarkivet.harvester.webinterface.HarvestStatusTester
Running dk.netarkivet.harvester.webinterface.servlet.NASEnvironmentTester
log4j:WARN No appenders could be found for logger (com.mchange.v2.log.MLog).
log4j:WARN Please initialize the log4j system properly.
log4j:WARN See http://logging.apache.org/log4j/1.2/faq.html#noconfig for more info.
Tests run: 1, Failures: 0, Errors: 0, Skipped: 0, Time elapsed: 15.92 sec - in dk.netarkivet.harvester.webinterface.servlet.NASEnvironmentTester
Cleaned up dk.netarkivet.common.distribute.JMSConnectionMockupMQ
Running dk.netarkivet.harvester.webinterface.DomainDefinitionTester
log4j:WARN No appenders could be found for logger (com.mchange.v2.log.MLog).
log4j:WARN Please initialize the log4j system properly.
log4j:WARN See http://logging.apache.org/log4j/1.2/faq.html#noconfig for more info.
Tests run: 8, Failures: 0, Errors: 0, Skipped: 0, Time elapsed: 51.239 sec - in dk.netarkivet.harvester.webinterface.DomainDefinitionTester
Running dk.netarkivet.harvester.webinterface.EventHarvestUtilTester
log4j:WARN No appenders could be found for logger (com.mchange.v2.log.MLog).
log4j:WARN Please initialize the log4j system properly.
log4j:WARN See http://logging.apache.org/log4j/1.2/faq.html#noconfig for more info.
Tests run: 1, Failures: 0, Errors: 0, Skipped: 0, Time elapsed: 20.579 sec - in dk.netarkivet.harvester.webinterface.EventHarvestUtilTester
Running dk.netarkivet.harvester.webinterface.HarvestDefinitionGUITester
Tests run: 4, Failures: 0, Errors: 0, Skipped: 0, Time elapsed: 25.983 sec - in dk.netarkivet.harvester.webinterface.HarvestDefinitionGUITester
Running dk.netarkivet.harvester.webinterface.HistorySiteSectionTester
Tests run: 1, Failures: 0, Errors: 0, Skipped: 0, Time elapsed: 0.955 sec - in dk.netarkivet.harvester.webinterface.HistorySiteSectionTester
Running dk.netarkivet.common.webinterface.GUIWebServerTester
Tests run: 1, Failures: 0, Errors: 0, Skipped: 0, Time elapsed: 1.015 sec - in dk.netarkivet.common.webinterface.GUIWebServerTester
Cleaned up dk.netarkivet.common.distribute.JMSConnectionMockupMQ
Cleaned up dk.netarkivet.common.distribute.JMSConnectionMockupMQ
Running dk.netarkivet.common.webinterface.SiteSectionTester
Tests run: 6, Failures: 0, Errors: 0, Skipped: 0, Time elapsed: 2.349 sec - in dk.netarkivet.common.webinterface.SiteSectionTester
Running dk.netarkivet.common.webinterface.HTMLUtilsTester
Tests run: 11, Failures: 0, Errors: 0, Skipped: 0, Time elapsed: 1.188 sec - in dk.netarkivet.common.webinterface.HTMLUtilsTester

Results :

Failed tests: 
  IndexRequestServerTester.testUnblocking:374 Threads should have been woken up

Tests run: 420, Failures: 1, Errors: 0, Skipped: 20

[ERROR] There are test failures.

Please refer to /home/cibuild02/workspace/NetarchiveSuite-Full-Test-staging/harvester/harvester-test/target/surefire-reports for the individual test results.
[JENKINS] Recording test results
[INFO] 
[INFO] --- maven-jgit-buildnumber-plugin:1.2.9:extract-buildnumber (git-buildnumber) @ harvester-test ---
[INFO] 
[INFO] --- maven-jar-plugin:2.4:jar (default-jar) @ harvester-test ---
[WARNING] JAR will be empty - no content was marked for inclusion!
[INFO] Building jar: /home/cibuild02/workspace/NetarchiveSuite-Full-Test-staging/harvester/harvester-test/target/harvester-test-5.4-SNAPSHOT.jar
[INFO] 
[INFO] >>> maven-source-plugin:2.2.1:jar (attach-sources) > generate-sources @ harvester-test >>>
[INFO] 
[INFO] --- jacoco-maven-plugin:0.7.9:prepare-agent (agent) @ harvester-test ---
[INFO] argLine set to -javaagent:/home/cibuild02/.m2/repository/org/jacoco/org.jacoco.agent/0.7.9/org.jacoco.agent-0.7.9-runtime.jar=destfile=/home/cibuild02/workspace/NetarchiveSuite-Full-Test-staging/harvester/harvester-test/../target/jacoco.exec,append=true
[WARNING] Failed to getClass for org.apache.maven.plugin.source.SourceJarMojo
[INFO] 
[INFO] <<< maven-source-plugin:2.2.1:jar (attach-sources) < generate-sources @ harvester-test <<<
[INFO] 
[INFO] --- maven-source-plugin:2.2.1:jar (attach-sources) @ harvester-test ---
[INFO] No sources in project. Archive not created.
[INFO] 
[INFO] --- maven-javadoc-plugin:2.10.3:jar (attach-javadocs) @ harvester-test ---
[INFO] 
[INFO] --- maven-install-plugin:2.4:install (default-install) @ harvester-test ---
[INFO] Installing /home/cibuild02/workspace/NetarchiveSuite-Full-Test-staging/harvester/harvester-test/target/harvester-test-5.4-SNAPSHOT.jar to /home/cibuild02/.m2/repository/org/netarchivesuite/harvester-test/5.4-SNAPSHOT/harvester-test-5.4-SNAPSHOT.jar
[INFO] Installing /home/cibuild02/workspace/NetarchiveSuite-Full-Test-staging/harvester/harvester-test/pom.xml to /home/cibuild02/.m2/repository/org/netarchivesuite/harvester-test/5.4-SNAPSHOT/harvester-test-5.4-SNAPSHOT.pom
[JENKINS] Archiving disabled
[INFO]                                                                         
[INFO] ------------------------------------------------------------------------
[INFO] Building NetarchiveSuite - monitor - test 5.4-SNAPSHOT
[INFO] ------------------------------------------------------------------------
[INFO] 
[INFO] --- maven-clean-plugin:2.5:clean (default-clean) @ monitor-test ---
[INFO] Deleting /home/cibuild02/workspace/NetarchiveSuite-Full-Test-staging/monitor/monitor-test/target
[INFO] 
[INFO] --- jacoco-maven-plugin:0.7.9:prepare-agent (agent) @ monitor-test ---
[INFO] argLine set to -javaagent:/home/cibuild02/.m2/repository/org/jacoco/org.jacoco.agent/0.7.9/org.jacoco.agent-0.7.9-runtime.jar=destfile=/home/cibuild02/workspace/NetarchiveSuite-Full-Test-staging/monitor/monitor-test/../target/jacoco.exec,append=true
[INFO] 
[INFO] --- maven-resources-plugin:2.6:resources (default-resources) @ monitor-test ---
[INFO] Using 'UTF-8' encoding to copy filtered resources.
[INFO] skip non existing resourceDirectory /home/cibuild02/workspace/NetarchiveSuite-Full-Test-staging/monitor/monitor-test/src/main/resources
[INFO] 
[INFO] --- maven-compiler-plugin:3.1:compile (default-compile) @ monitor-test ---
[INFO] No sources to compile
[INFO] 
[INFO] --- maven-resources-plugin:2.6:testResources (default-testResources) @ monitor-test ---
[INFO] Using 'UTF-8' encoding to copy filtered resources.
[INFO] Copying 1 resource
[INFO] Copying 8 resources
[INFO] 
[INFO] --- maven-compiler-plugin:3.1:testCompile (default-testCompile) @ monitor-test ---
[INFO] Changes detected - recompiling the module!
[INFO] Compiling 4 source files to /home/cibuild02/workspace/NetarchiveSuite-Full-Test-staging/monitor/monitor-test/target/test-classes
[INFO] 
[INFO] --- maven-surefire-plugin:2.17:test (default-test) @ monitor-test ---
[INFO] Surefire report directory: /home/cibuild02/workspace/NetarchiveSuite-Full-Test-staging/monitor/monitor-test/target/surefire-reports

-------------------------------------------------------
 T E S T S
-------------------------------------------------------
Running dk.netarkivet.monitor.registry.MonitorRegistryServerTester
Tests run: 2, Failures: 0, Errors: 0, Skipped: 0, Time elapsed: 0.784 sec - in dk.netarkivet.monitor.registry.MonitorRegistryServerTester
Running dk.netarkivet.monitor.webinterface.JMXStatusEntryTester
[Tue Feb 06 14:12:24 CET 2018] Remote JMX beanen genererede en Exception
javax.management.InstanceNotFoundException: east:httpport=8081,location=EAST,index=1,applicationinstanceid=XX,channel=FOCUSED,machine=machine,replicaname=ReplicaOne,applicationname=SH
	at com.sun.jmx.interceptor.DefaultMBeanServerInterceptor.getMBean(DefaultMBeanServerInterceptor.java:1095)
	at com.sun.jmx.interceptor.DefaultMBeanServerInterceptor.getAttribute(DefaultMBeanServerInterceptor.java:643)
	at com.sun.jmx.mbeanserver.JmxMBeanServer.getAttribute(JmxMBeanServer.java:678)
	at dk.netarkivet.monitor.webinterface.JMXStatusEntry.getLogMessage(JMXStatusEntry.java:150)
	at dk.netarkivet.monitor.webinterface.JMXStatusEntryTester.testGetLogmessage(JMXStatusEntryTester.java:70)
	at sun.reflect.NativeMethodAccessorImpl.invoke0(Native Method)
	at sun.reflect.NativeMethodAccessorImpl.invoke(NativeMethodAccessorImpl.java:62)
	at sun.reflect.DelegatingMethodAccessorImpl.invoke(DelegatingMethodAccessorImpl.java:43)
	at java.lang.reflect.Method.invoke(Method.java:498)
	at org.junit.runners.model.FrameworkMethod$1.runReflectiveCall(FrameworkMethod.java:47)
	at org.junit.internal.runners.model.ReflectiveCallable.run(ReflectiveCallable.java:12)
	at org.junit.runners.model.FrameworkMethod.invokeExplosively(FrameworkMethod.java:44)
	at org.junit.internal.runners.statements.InvokeMethod.evaluate(InvokeMethod.java:17)
	at org.junit.internal.runners.statements.RunBefores.evaluate(RunBefores.java:26)
	at org.junit.runners.ParentRunner.runLeaf(ParentRunner.java:271)
	at org.junit.runners.BlockJUnit4ClassRunner.runChild(BlockJUnit4ClassRunner.java:70)
	at org.junit.runners.BlockJUnit4ClassRunner.runChild(BlockJUnit4ClassRunner.java:50)
	at org.junit.runners.ParentRunner$3.run(ParentRunner.java:238)
	at org.junit.runners.ParentRunner$1.schedule(ParentRunner.java:63)
	at org.junit.runners.ParentRunner.runChildren(ParentRunner.java:236)
	at org.junit.runners.ParentRunner.access$000(ParentRunner.java:53)
	at org.junit.runners.ParentRunner$2.evaluate(ParentRunner.java:229)
	at org.junit.runners.ParentRunner.run(ParentRunner.java:309)
	at org.apache.maven.surefire.junit4.JUnit4Provider.execute(JUnit4Provider.java:264)
	at org.apache.maven.surefire.junit4.JUnit4Provider.executeTestSet(JUnit4Provider.java:153)
	at org.apache.maven.surefire.junit4.JUnit4Provider.invoke(JUnit4Provider.java:124)
	at org.apache.maven.surefire.booter.ForkedBooter.invokeProviderInSameClassLoader(ForkedBooter.java:200)
	at org.apache.maven.surefire.booter.ForkedBooter.runSuitesInProcess(ForkedBooter.java:153)
	at org.apache.maven.surefire.booter.ForkedBooter.main(ForkedBooter.java:103)

Tests run: 2, Failures: 0, Errors: 0, Skipped: 0, Time elapsed: 0.343 sec - in dk.netarkivet.monitor.webinterface.JMXStatusEntryTester
Running dk.netarkivet.monitor.webinterface.StatusSiteSectionTester
Tests run: 1, Failures: 0, Errors: 0, Skipped: 0, Time elapsed: 0.004 sec - in dk.netarkivet.monitor.webinterface.StatusSiteSectionTester
Running dk.netarkivet.monitor.webinterface.JMXSummaryUtilsTester
Tests run: 2, Failures: 0, Errors: 0, Skipped: 0, Time elapsed: 0.021 sec - in dk.netarkivet.monitor.webinterface.JMXSummaryUtilsTester
Cleaned up dk.netarkivet.common.distribute.JMSConnectionMockupMQ

Results :

Tests run: 7, Failures: 0, Errors: 0, Skipped: 0

[JENKINS] Recording test results
[INFO] 
[INFO] --- maven-jgit-buildnumber-plugin:1.2.9:extract-buildnumber (git-buildnumber) @ monitor-test ---
[INFO] 
[INFO] --- maven-jar-plugin:2.4:jar (default-jar) @ monitor-test ---
[WARNING] JAR will be empty - no content was marked for inclusion!
[INFO] Building jar: /home/cibuild02/workspace/NetarchiveSuite-Full-Test-staging/monitor/monitor-test/target/monitor-test-5.4-SNAPSHOT.jar
[INFO] 
[INFO] >>> maven-source-plugin:2.2.1:jar (attach-sources) > generate-sources @ monitor-test >>>
[INFO] 
[INFO] --- jacoco-maven-plugin:0.7.9:prepare-agent (agent) @ monitor-test ---
[INFO] argLine set to -javaagent:/home/cibuild02/.m2/repository/org/jacoco/org.jacoco.agent/0.7.9/org.jacoco.agent-0.7.9-runtime.jar=destfile=/home/cibuild02/workspace/NetarchiveSuite-Full-Test-staging/monitor/monitor-test/../target/jacoco.exec,append=true
[WARNING] Failed to getClass for org.apache.maven.plugin.source.SourceJarMojo
[INFO] 
[INFO] <<< maven-source-plugin:2.2.1:jar (attach-sources) < generate-sources @ monitor-test <<<
[INFO] 
[INFO] --- maven-source-plugin:2.2.1:jar (attach-sources) @ monitor-test ---
[INFO] No sources in project. Archive not created.
[INFO] 
[INFO] --- maven-javadoc-plugin:2.10.3:jar (attach-javadocs) @ monitor-test ---
[INFO] 
[INFO] --- maven-install-plugin:2.4:install (default-install) @ monitor-test ---
[INFO] Installing /home/cibuild02/workspace/NetarchiveSuite-Full-Test-staging/monitor/monitor-test/target/monitor-test-5.4-SNAPSHOT.jar to /home/cibuild02/.m2/repository/org/netarchivesuite/monitor-test/5.4-SNAPSHOT/monitor-test-5.4-SNAPSHOT.jar
[INFO] Installing /home/cibuild02/workspace/NetarchiveSuite-Full-Test-staging/monitor/monitor-test/pom.xml to /home/cibuild02/.m2/repository/org/netarchivesuite/monitor-test/5.4-SNAPSHOT/monitor-test-5.4-SNAPSHOT.pom
[JENKINS] Archiving disabled
[INFO]                                                                         
[INFO] ------------------------------------------------------------------------
[INFO] Building NetarchiveSuite - wayback resourceStore 5.4-SNAPSHOT
[INFO] ------------------------------------------------------------------------
[INFO] 
[INFO] --- maven-clean-plugin:2.5:clean (default-clean) @ wayback-resourcestore ---
[INFO] Deleting /home/cibuild02/workspace/NetarchiveSuite-Full-Test-staging/wayback/wayback-resourcestore/target
[INFO] 
[INFO] --- jacoco-maven-plugin:0.7.9:prepare-agent (agent) @ wayback-resourcestore ---
[INFO] argLine set to -javaagent:/home/cibuild02/.m2/repository/org/jacoco/org.jacoco.agent/0.7.9/org.jacoco.agent-0.7.9-runtime.jar=destfile=/home/cibuild02/workspace/NetarchiveSuite-Full-Test-staging/wayback/wayback-resourcestore/../target/jacoco.exec,append=true
[INFO] 
[INFO] --- maven-resources-plugin:2.6:resources (default-resources) @ wayback-resourcestore ---
[INFO] Using 'UTF-8' encoding to copy filtered resources.
[INFO] skip non existing resourceDirectory /home/cibuild02/workspace/NetarchiveSuite-Full-Test-staging/wayback/wayback-resourcestore/src/main/resources
[INFO] 
[INFO] --- maven-compiler-plugin:3.1:compile (default-compile) @ wayback-resourcestore ---
[INFO] Changes detected - recompiling the module!
[INFO] Compiling 7 source files to /home/cibuild02/workspace/NetarchiveSuite-Full-Test-staging/wayback/wayback-resourcestore/target/classes
[INFO] 
[INFO] --- maven-resources-plugin:2.6:testResources (default-testResources) @ wayback-resourcestore ---
[INFO] Using 'UTF-8' encoding to copy filtered resources.
[INFO] skip non existing resourceDirectory /home/cibuild02/workspace/NetarchiveSuite-Full-Test-staging/wayback/wayback-resourcestore/src/test/resources
[INFO] 
[INFO] --- maven-compiler-plugin:3.1:testCompile (default-testCompile) @ wayback-resourcestore ---
[INFO] Changes detected - recompiling the module!
[INFO] Compiling 4 source files to /home/cibuild02/workspace/NetarchiveSuite-Full-Test-staging/wayback/wayback-resourcestore/target/test-classes
[INFO] 
[INFO] --- maven-surefire-plugin:2.17:test (default-test) @ wayback-resourcestore ---
[INFO] Surefire report directory: /home/cibuild02/workspace/NetarchiveSuite-Full-Test-staging/wayback/wayback-resourcestore/target/surefire-reports

-------------------------------------------------------
 T E S T S
-------------------------------------------------------
Running dk.netarkivet.wayback.NetarchiveResourceStoreWarcTester
Tests run: 1, Failures: 0, Errors: 0, Skipped: 1, Time elapsed: 0.084 sec - in dk.netarkivet.wayback.NetarchiveResourceStoreWarcTester
Running dk.netarkivet.wayback.NetarchiveResourceStoreTester
14:12:30.545 [main] DEBUG dk.netarkivet.common.utils.Settings - Value found in loaded data: test/testdata/archive
14:12:30.595 [main] INFO dk.netarkivet.common.distribute.arcrepository.LocalArcRepositoryClient - directory '/home/cibuild02/workspace/NetarchiveSuite-Full-Test-staging/wayback/wayback-resourcestore/test/testdata/archive' is part of this local archive repository
14:12:30.645 [main] DEBUG dk.netarkivet.common.utils.Settings - Value found in loaded data: test/testdata/archive
14:12:30.646 [main] INFO dk.netarkivet.common.distribute.arcrepository.LocalArcRepositoryClient - directory '/home/cibuild02/workspace/NetarchiveSuite-Full-Test-staging/wayback/wayback-resourcestore/test/testdata/archive' is part of this local archive repository
14:12:30.658 [main] ERROR dk.netarkivet.wayback.NetarchiveResourceStore - Error looking for non existing resource
java.lang.NumberFormatException: null
	at java.lang.Long.parseLong(Long.java:552)
	at java.lang.Long.parseLong(Long.java:631)
	at org.archive.wayback.core.CaptureSearchResult.getOffset(CaptureSearchResult.java:252)
	at dk.netarkivet.wayback.NetarchiveResourceStore.retrieveResource(NetarchiveResourceStore.java:88)
	at dk.netarkivet.wayback.NetarchiveResourceStoreTester.testResourceNotAvailable(NetarchiveResourceStoreTester.java:130)
	at sun.reflect.NativeMethodAccessorImpl.invoke0(Native Method)
	at sun.reflect.NativeMethodAccessorImpl.invoke(NativeMethodAccessorImpl.java:62)
	at sun.reflect.DelegatingMethodAccessorImpl.invoke(DelegatingMethodAccessorImpl.java:43)
	at java.lang.reflect.Method.invoke(Method.java:498)
	at org.junit.runners.model.FrameworkMethod$1.runReflectiveCall(FrameworkMethod.java:47)
	at org.junit.internal.runners.model.ReflectiveCallable.run(ReflectiveCallable.java:12)
	at org.junit.runners.model.FrameworkMethod.invokeExplosively(FrameworkMethod.java:44)
	at org.junit.internal.runners.statements.InvokeMethod.evaluate(InvokeMethod.java:17)
	at org.junit.internal.runners.statements.ExpectException.evaluate(ExpectException.java:19)
	at org.junit.internal.runners.statements.RunBefores.evaluate(RunBefores.java:26)
	at org.junit.internal.runners.statements.RunAfters.evaluate(RunAfters.java:27)
	at org.junit.rules.TestWatcher$1.evaluate(TestWatcher.java:55)
	at org.junit.rules.RunRules.evaluate(RunRules.java:20)
	at org.junit.runners.ParentRunner.runLeaf(ParentRunner.java:271)
	at org.junit.runners.BlockJUnit4ClassRunner.runChild(BlockJUnit4ClassRunner.java:70)
	at org.junit.runners.BlockJUnit4ClassRunner.runChild(BlockJUnit4ClassRunner.java:50)
	at org.junit.runners.ParentRunner$3.run(ParentRunner.java:238)
	at org.junit.runners.ParentRunner$1.schedule(ParentRunner.java:63)
	at org.junit.runners.ParentRunner.runChildren(ParentRunner.java:236)
	at org.junit.runners.ParentRunner.access$000(ParentRunner.java:53)
	at org.junit.runners.ParentRunner$2.evaluate(ParentRunner.java:229)
	at org.junit.runners.ParentRunner.run(ParentRunner.java:309)
	at org.apache.maven.surefire.junit4.JUnit4Provider.execute(JUnit4Provider.java:264)
	at org.apache.maven.surefire.junit4.JUnit4Provider.executeTestSet(JUnit4Provider.java:153)
	at org.apache.maven.surefire.junit4.JUnit4Provider.invoke(JUnit4Provider.java:124)
	at org.apache.maven.surefire.booter.ForkedBooter.invokeProviderInSameClassLoader(ForkedBooter.java:200)
	at org.apache.maven.surefire.booter.ForkedBooter.runSuitesInProcess(ForkedBooter.java:153)
	at org.apache.maven.surefire.booter.ForkedBooter.main(ForkedBooter.java:103)
14:12:30.677 [main] DEBUG dk.netarkivet.common.utils.Settings - Value found in loaded data: test/testdata/archive
14:12:30.680 [main] INFO dk.netarkivet.common.distribute.arcrepository.LocalArcRepositoryClient - directory '/home/cibuild02/workspace/NetarchiveSuite-Full-Test-staging/wayback/wayback-resourcestore/test/testdata/archive' is part of this local archive repository
14:12:30.682 [main] DEBUG dk.netarkivet.common.utils.Settings - Value found in loaded data: test/testdata/archive
14:12:30.684 [main] INFO dk.netarkivet.common.distribute.arcrepository.LocalArcRepositoryClient - directory '/home/cibuild02/workspace/NetarchiveSuite-Full-Test-staging/wayback/wayback-resourcestore/test/testdata/archive' is part of this local archive repository
14:12:30.685 [main] INFO dk.netarkivet.wayback.NetarchiveResourceStore - Received request for resource from file '2-metadata-1.arc' at offset '0'
14:12:30.686 [main] WARN dk.netarkivet.common.distribute.arcrepository.LocalArcRepositoryClient - File '2-metadata-1.arc' does not exist. Null BitarchiveRecord returned
14:12:30.694 [main] DEBUG dk.netarkivet.common.utils.Settings - Value found in loaded data: test/testdata/archive
14:12:30.698 [main] INFO dk.netarkivet.common.distribute.arcrepository.LocalArcRepositoryClient - directory '/home/cibuild02/workspace/NetarchiveSuite-Full-Test-staging/wayback/wayback-resourcestore/test/testdata/archive' is part of this local archive repository
14:12:30.700 [main] DEBUG dk.netarkivet.common.utils.Settings - Value found in loaded data: test/testdata/archive
14:12:30.703 [main] INFO dk.netarkivet.common.distribute.arcrepository.LocalArcRepositoryClient - directory '/home/cibuild02/workspace/NetarchiveSuite-Full-Test-staging/wayback/wayback-resourcestore/test/testdata/archive' is part of this local archive repository
14:12:30.708 [main] DEBUG dk.netarkivet.common.utils.Settings - Value found in loaded data: test/testdata/archive
14:12:30.712 [main] INFO dk.netarkivet.common.distribute.arcrepository.LocalArcRepositoryClient - directory '/home/cibuild02/workspace/NetarchiveSuite-Full-Test-staging/wayback/wayback-resourcestore/test/testdata/archive' is part of this local archive repository
14:12:30.715 [main] DEBUG dk.netarkivet.common.utils.Settings - Value found in loaded data: test/testdata/archive
14:12:30.715 [main] INFO dk.netarkivet.common.distribute.arcrepository.LocalArcRepositoryClient - directory '/home/cibuild02/workspace/NetarchiveSuite-Full-Test-staging/wayback/wayback-resourcestore/test/testdata/archive' is part of this local archive repository
14:12:30.717 [main] DEBUG dk.netarkivet.common.utils.Settings - Value found in loaded data: test/testdata/archive
14:12:30.724 [main] INFO dk.netarkivet.common.distribute.arcrepository.LocalArcRepositoryClient - directory '/home/cibuild02/workspace/NetarchiveSuite-Full-Test-staging/wayback/wayback-resourcestore/test/testdata/archive' is part of this local archive repository
14:12:30.747 [main] INFO dk.netarkivet.wayback.NetarchiveResourceStore - Received request for resource from file 'arcfile_withredirects.arc' at offset '3311'
14:12:30.902 [main] DEBUG dk.netarkivet.common.distribute.arcrepository.BitarchiveRecord - Bytes stored in objectBuffer: 241
14:12:30.904 [main] INFO dk.netarkivet.wayback.NetarchiveResourceStore - Retrieved resource from file 'arcfile_withredirects.arc' at offset '3311'
14:12:30.904 [main] DEBUG dk.netarkivet.common.distribute.arcrepository.BitarchiveRecord - Reading 241 bytes from objectBuffer
14:12:31.021 [main] DEBUG dk.netarkivet.wayback.NetarchiveResourceStore - ARCRecord created with code '302'
14:12:31.022 [main] DEBUG dk.netarkivet.wayback.NetarchiveResourceStore - Headers: null
14:12:31.030 [main] INFO dk.netarkivet.wayback.NetarchiveResourceStore - Returning resource 'org.archive.wayback.resourcestore.resourcefile.ArcResource@3cd26422'
14:12:31.044 [main] DEBUG dk.netarkivet.common.utils.Settings - Value found in loaded data: test/testdata/archive
14:12:31.044 [main] INFO dk.netarkivet.common.distribute.arcrepository.LocalArcRepositoryClient - directory '/home/cibuild02/workspace/NetarchiveSuite-Full-Test-staging/wayback/wayback-resourcestore/test/testdata/archive' is part of this local archive repository
14:12:31.047 [main] DEBUG dk.netarkivet.common.utils.Settings - Value found in loaded data: test/testdata/archive
14:12:31.047 [main] INFO dk.netarkivet.common.distribute.arcrepository.LocalArcRepositoryClient - directory '/home/cibuild02/workspace/NetarchiveSuite-Full-Test-staging/wayback/wayback-resourcestore/test/testdata/archive' is part of this local archive repository
14:12:31.054 [main] DEBUG dk.netarkivet.common.utils.Settings - Value found in loaded data: test/testdata/archive
14:12:31.057 [main] INFO dk.netarkivet.common.distribute.arcrepository.LocalArcRepositoryClient - directory '/home/cibuild02/workspace/NetarchiveSuite-Full-Test-staging/wayback/wayback-resourcestore/test/testdata/archive' is part of this local archive repository
14:12:31.058 [main] DEBUG dk.netarkivet.common.utils.Settings - Value found in loaded data: test/testdata/archive
14:12:31.060 [main] INFO dk.netarkivet.common.distribute.arcrepository.LocalArcRepositoryClient - directory '/home/cibuild02/workspace/NetarchiveSuite-Full-Test-staging/wayback/wayback-resourcestore/test/testdata/archive' is part of this local archive repository
14:12:31.063 [main] DEBUG dk.netarkivet.common.utils.Settings - Value found in loaded data: test/testdata/archive
14:12:31.063 [main] INFO dk.netarkivet.common.distribute.arcrepository.LocalArcRepositoryClient - directory '/home/cibuild02/workspace/NetarchiveSuite-Full-Test-staging/wayback/wayback-resourcestore/test/testdata/archive' is part of this local archive repository
14:12:31.064 [main] INFO dk.netarkivet.wayback.NetarchiveResourceStore - Received request for resource from file 'arcfile_withredirects.arc' at offset '3619'
14:12:31.078 [main] DEBUG dk.netarkivet.common.distribute.arcrepository.BitarchiveRecord - Bytes stored in objectBuffer: 67439
14:12:31.080 [main] INFO dk.netarkivet.wayback.NetarchiveResourceStore - Retrieved resource from file 'arcfile_withredirects.arc' at offset '3619'
14:12:31.080 [main] DEBUG dk.netarkivet.common.distribute.arcrepository.BitarchiveRecord - Reading 67439 bytes from objectBuffer
14:12:31.083 [main] DEBUG dk.netarkivet.wayback.NetarchiveResourceStore - ARCRecord created with code '200'
14:12:31.083 [main] DEBUG dk.netarkivet.wayback.NetarchiveResourceStore - Headers: null
14:12:31.084 [main] INFO dk.netarkivet.wayback.NetarchiveResourceStore - Returning resource 'org.archive.wayback.resourcestore.resourcefile.ArcResource@2eda072'
Tests run: 6, Failures: 0, Errors: 0, Skipped: 0, Time elapsed: 1.788 sec - in dk.netarkivet.wayback.NetarchiveResourceStoreTester
Running dk.netarkivet.wayback.LRUCacheTester
Tests run: 1, Failures: 0, Errors: 0, Skipped: 1, Time elapsed: 0.002 sec - in dk.netarkivet.wayback.LRUCacheTester

Results :

Tests run: 8, Failures: 0, Errors: 0, Skipped: 2

[JENKINS] Recording test results
[INFO] 
[INFO] --- maven-jgit-buildnumber-plugin:1.2.9:extract-buildnumber (git-buildnumber) @ wayback-resourcestore ---
[INFO] 
[INFO] --- maven-jar-plugin:2.4:jar (default-jar) @ wayback-resourcestore ---
[INFO] Building jar: /home/cibuild02/workspace/NetarchiveSuite-Full-Test-staging/wayback/wayback-resourcestore/target/wayback-resourcestore-5.4-SNAPSHOT.jar
[INFO] 
[INFO] >>> maven-source-plugin:2.2.1:jar (attach-sources) > generate-sources @ wayback-resourcestore >>>
[INFO] 
[INFO] --- jacoco-maven-plugin:0.7.9:prepare-agent (agent) @ wayback-resourcestore ---
[INFO] argLine set to -javaagent:/home/cibuild02/.m2/repository/org/jacoco/org.jacoco.agent/0.7.9/org.jacoco.agent-0.7.9-runtime.jar=destfile=/home/cibuild02/workspace/NetarchiveSuite-Full-Test-staging/wayback/wayback-resourcestore/../target/jacoco.exec,append=true
[WARNING] Failed to getClass for org.apache.maven.plugin.source.SourceJarMojo
[INFO] 
[INFO] <<< maven-source-plugin:2.2.1:jar (attach-sources) < generate-sources @ wayback-resourcestore <<<
[INFO] 
[INFO] --- maven-source-plugin:2.2.1:jar (attach-sources) @ wayback-resourcestore ---
[INFO] Building jar: /home/cibuild02/workspace/NetarchiveSuite-Full-Test-staging/wayback/wayback-resourcestore/target/wayback-resourcestore-5.4-SNAPSHOT-sources.jar
[INFO] 
[INFO] --- maven-javadoc-plugin:2.10.3:jar (attach-javadocs) @ wayback-resourcestore ---
[INFO] Building jar: /home/cibuild02/workspace/NetarchiveSuite-Full-Test-staging/wayback/wayback-resourcestore/target/wayback-resourcestore-5.4-SNAPSHOT-javadoc.jar
[INFO] 
[INFO] --- maven-install-plugin:2.4:install (default-install) @ wayback-resourcestore ---
[INFO] Installing /home/cibuild02/workspace/NetarchiveSuite-Full-Test-staging/wayback/wayback-resourcestore/target/wayback-resourcestore-5.4-SNAPSHOT.jar to /home/cibuild02/.m2/repository/org/netarchivesuite/wayback-resourcestore/5.4-SNAPSHOT/wayback-resourcestore-5.4-SNAPSHOT.jar
[INFO] Installing /home/cibuild02/workspace/NetarchiveSuite-Full-Test-staging/wayback/wayback-resourcestore/pom.xml to /home/cibuild02/.m2/repository/org/netarchivesuite/wayback-resourcestore/5.4-SNAPSHOT/wayback-resourcestore-5.4-SNAPSHOT.pom
[INFO] Installing /home/cibuild02/workspace/NetarchiveSuite-Full-Test-staging/wayback/wayback-resourcestore/target/wayback-resourcestore-5.4-SNAPSHOT-sources.jar to /home/cibuild02/.m2/repository/org/netarchivesuite/wayback-resourcestore/5.4-SNAPSHOT/wayback-resourcestore-5.4-SNAPSHOT-sources.jar
[INFO] Installing /home/cibuild02/workspace/NetarchiveSuite-Full-Test-staging/wayback/wayback-resourcestore/target/wayback-resourcestore-5.4-SNAPSHOT-javadoc.jar to /home/cibuild02/.m2/repository/org/netarchivesuite/wayback-resourcestore/5.4-SNAPSHOT/wayback-resourcestore-5.4-SNAPSHOT-javadoc.jar
[JENKINS] Archiving disabled
[INFO]                                                                         
[INFO] ------------------------------------------------------------------------
[INFO] Building NetarchiveSuite - wayback - test 5.4-SNAPSHOT
[INFO] ------------------------------------------------------------------------
[INFO] 
[INFO] --- maven-clean-plugin:2.5:clean (default-clean) @ wayback-test ---
[INFO] Deleting /home/cibuild02/workspace/NetarchiveSuite-Full-Test-staging/wayback/wayback-test/target
[INFO] 
[INFO] --- jacoco-maven-plugin:0.7.9:prepare-agent (agent) @ wayback-test ---
[INFO] argLine set to -javaagent:/home/cibuild02/.m2/repository/org/jacoco/org.jacoco.agent/0.7.9/org.jacoco.agent-0.7.9-runtime.jar=destfile=/home/cibuild02/workspace/NetarchiveSuite-Full-Test-staging/wayback/wayback-test/../target/jacoco.exec,append=true
[INFO] 
[INFO] --- maven-resources-plugin:2.6:resources (default-resources) @ wayback-test ---
[INFO] Using 'UTF-8' encoding to copy filtered resources.
[INFO] skip non existing resourceDirectory /home/cibuild02/workspace/NetarchiveSuite-Full-Test-staging/wayback/wayback-test/src/main/resources
[INFO] 
[INFO] --- maven-compiler-plugin:3.1:compile (default-compile) @ wayback-test ---
[INFO] No sources to compile
[INFO] 
[INFO] --- maven-resources-plugin:2.6:testResources (default-testResources) @ wayback-test ---
[INFO] Using 'UTF-8' encoding to copy filtered resources.
[INFO] Copying 1 resource
[INFO] Copying 56 resources
[INFO] 
[INFO] --- maven-compiler-plugin:3.1:testCompile (default-testCompile) @ wayback-test ---
[INFO] Changes detected - recompiling the module!
[INFO] Compiling 15 source files to /home/cibuild02/workspace/NetarchiveSuite-Full-Test-staging/wayback/wayback-test/target/test-classes
[INFO] 
[INFO] --- maven-surefire-plugin:2.17:test (default-test) @ wayback-test ---
[INFO] Surefire report directory: /home/cibuild02/workspace/NetarchiveSuite-Full-Test-staging/wayback/wayback-test/target/surefire-reports

-------------------------------------------------------
 T E S T S
-------------------------------------------------------
Running dk.netarkivet.wayback.aggregator.IndexAggregatorTest
Tests run: 4, Failures: 0, Errors: 0, Skipped: 0, Time elapsed: 1.32 sec - in dk.netarkivet.wayback.aggregator.IndexAggregatorTest
Running dk.netarkivet.wayback.aggregator.AggregationWorkerTest
Tests run: 6, Failures: 0, Errors: 0, Skipped: 0, Time elapsed: 0.246 sec - in dk.netarkivet.wayback.aggregator.AggregationWorkerTest
Running dk.netarkivet.wayback.DeduplicateToCDXApplicationTester
Tests run: 1, Failures: 0, Errors: 0, Skipped: 0, Time elapsed: 0.758 sec - in dk.netarkivet.wayback.DeduplicateToCDXApplicationTester
Running dk.netarkivet.wayback.indexer.ArchiveFileDAOTester
Hibernate: 
    insert 
    into
        ArchiveFile
        (indexed, indexedDate, indexingFailedAttempts, originalIndexFileName, filename) 
    values
        (?, ?, ?, ?, ?)
Hibernate: 
    select
        archivefil0_.filename as filename2_0_,
        archivefil0_.indexed as indexed2_0_,
        archivefil0_.indexedDate as indexedD3_2_0_,
        archivefil0_.indexingFailedAttempts as indexing4_2_0_,
        archivefil0_.originalIndexFileName as original5_2_0_ 
    from
        ArchiveFile archivefil0_ 
    where
        archivefil0_.filename=?
Tests run: 3, Failures: 0, Errors: 0, Skipped: 2, Time elapsed: 5.624 sec - in dk.netarkivet.wayback.indexer.ArchiveFileDAOTester
Running dk.netarkivet.wayback.indexer.FileNameHarvesterTester
Hibernate: 
    select
        archivefil0_.filename as filename6_,
        archivefil0_.indexed as indexed6_,
        archivefil0_.indexedDate as indexedD3_6_,
        archivefil0_.indexingFailedAttempts as indexing4_6_,
        archivefil0_.originalIndexFileName as original5_6_ 
    from
        ArchiveFile archivefil0_ 
    where
        archivefil0_.filename='Upload4.WARC'
Hibernate: 
    insert 
    into
        ArchiveFile
        (indexed, indexedDate, indexingFailedAttempts, originalIndexFileName, filename) 
    values
        (?, ?, ?, ?, ?)
Hibernate: 
    select
        archivefil0_.filename as filename6_,
        archivefil0_.indexed as indexed6_,
        archivefil0_.indexedDate as indexedD3_6_,
        archivefil0_.indexingFailedAttempts as indexing4_6_,
        archivefil0_.originalIndexFileName as original5_6_ 
    from
        ArchiveFile archivefil0_ 
    where
        archivefil0_.filename='2-metadata-1.warc'
Hibernate: 
    insert 
    into
        ArchiveFile
        (indexed, indexedDate, indexingFailedAttempts, originalIndexFileName, filename) 
    values
        (?, ?, ?, ?, ?)
Hibernate: 
    select
        archivefil0_.filename as filename6_,
        archivefil0_.indexed as indexed6_,
        archivefil0_.indexedDate as indexedD3_6_,
        archivefil0_.indexingFailedAttempts as indexing4_6_,
        archivefil0_.originalIndexFileName as original5_6_ 
    from
        ArchiveFile archivefil0_ 
    where
        archivefil0_.filename='arcfile_withredirects.arc'
Hibernate: 
    insert 
    into
        ArchiveFile
        (indexed, indexedDate, indexingFailedAttempts, originalIndexFileName, filename) 
    values
        (?, ?, ?, ?, ?)
Hibernate: 
    select
        archivefil0_.filename as filename6_,
        archivefil0_.indexed as indexed6_,
        archivefil0_.indexedDate as indexedD3_6_,
        archivefil0_.indexingFailedAttempts as indexing4_6_,
        archivefil0_.originalIndexFileName as original5_6_ 
    from
        ArchiveFile archivefil0_ 
    where
        archivefil0_.filename='2-metadata-1.arc'
Hibernate: 
    insert 
    into
        ArchiveFile
        (indexed, indexedDate, indexingFailedAttempts, originalIndexFileName, filename) 
    values
        (?, ?, ?, ?, ?)
Hibernate: 
    select
        archivefil0_.filename as filename6_,
        archivefil0_.indexed as indexed6_,
        archivefil0_.indexedDate as indexedD3_6_,
        archivefil0_.indexingFailedAttempts as indexing4_6_,
        archivefil0_.originalIndexFileName as original5_6_ 
    from
        ArchiveFile archivefil0_ 
    where
        archivefil0_.filename='12345-metadata-4.arc'
Hibernate: 
    insert 
    into
        ArchiveFile
        (indexed, indexedDate, indexingFailedAttempts, originalIndexFileName, filename) 
    values
        (?, ?, ?, ?, ?)
Hibernate: 
    select
        archivefil0_.filename as filename6_,
        archivefil0_.indexed as indexed6_,
        archivefil0_.indexedDate as indexedD3_6_,
        archivefil0_.indexingFailedAttempts as indexing4_6_,
        archivefil0_.originalIndexFileName as original5_6_ 
    from
        ArchiveFile archivefil0_ 
    where
        archivefil0_.filename='Upload4.ARC'
Hibernate: 
    insert 
    into
        ArchiveFile
        (indexed, indexedDate, indexingFailedAttempts, originalIndexFileName, filename) 
    values
        (?, ?, ?, ?, ?)
Hibernate: 
    select
        archivefil0_.filename as filename6_,
        archivefil0_.indexed as indexed6_,
        archivefil0_.indexedDate as indexedD3_6_,
        archivefil0_.indexingFailedAttempts as indexing4_6_,
        archivefil0_.originalIndexFileName as original5_6_ 
    from
        ArchiveFile archivefil0_
Hibernate: 
    select
        archivefil0_.filename as filename6_,
        archivefil0_.indexed as indexed6_,
        archivefil0_.indexedDate as indexedD3_6_,
        archivefil0_.indexingFailedAttempts as indexing4_6_,
        archivefil0_.originalIndexFileName as original5_6_ 
    from
        ArchiveFile archivefil0_ 
    where
        archivefil0_.filename='Upload4.WARC'
Hibernate: 
    select
        archivefil0_.filename as filename6_,
        archivefil0_.indexed as indexed6_,
        archivefil0_.indexedDate as indexedD3_6_,
        archivefil0_.indexingFailedAttempts as indexing4_6_,
        archivefil0_.originalIndexFileName as original5_6_ 
    from
        ArchiveFile archivefil0_ 
    where
        archivefil0_.filename='2-metadata-1.warc'
Hibernate: 
    select
        archivefil0_.filename as filename6_,
        archivefil0_.indexed as indexed6_,
        archivefil0_.indexedDate as indexedD3_6_,
        archivefil0_.indexingFailedAttempts as indexing4_6_,
        archivefil0_.originalIndexFileName as original5_6_ 
    from
        ArchiveFile archivefil0_ 
    where
        archivefil0_.filename='arcfile_withredirects.arc'
Hibernate: 
    select
        archivefil0_.filename as filename6_,
        archivefil0_.indexed as indexed6_,
        archivefil0_.indexedDate as indexedD3_6_,
        archivefil0_.indexingFailedAttempts as indexing4_6_,
        archivefil0_.originalIndexFileName as original5_6_ 
    from
        ArchiveFile archivefil0_ 
    where
        archivefil0_.filename='2-metadata-1.arc'
Hibernate: 
    select
        archivefil0_.filename as filename6_,
        archivefil0_.indexed as indexed6_,
        archivefil0_.indexedDate as indexedD3_6_,
        archivefil0_.indexingFailedAttempts as indexing4_6_,
        archivefil0_.originalIndexFileName as original5_6_ 
    from
        ArchiveFile archivefil0_ 
    where
        archivefil0_.filename='12345-metadata-4.arc'
Hibernate: 
    select
        archivefil0_.filename as filename6_,
        archivefil0_.indexed as indexed6_,
        archivefil0_.indexedDate as indexedD3_6_,
        archivefil0_.indexingFailedAttempts as indexing4_6_,
        archivefil0_.originalIndexFileName as original5_6_ 
    from
        ArchiveFile archivefil0_ 
    where
        archivefil0_.filename='Upload4.ARC'
Tests run: 1, Failures: 0, Errors: 0, Skipped: 0, Time elapsed: 1.356 sec - in dk.netarkivet.wayback.indexer.FileNameHarvesterTester
Running dk.netarkivet.wayback.indexer.WaybackIndexerTester
Hibernate: 
    select
        archivefil0_.filename as filename10_,
        archivefil0_.indexed as indexed10_,
        archivefil0_.indexedDate as indexedD3_10_,
        archivefil0_.indexingFailedAttempts as indexing4_10_,
        archivefil0_.originalIndexFileName as original5_10_ 
    from
        ArchiveFile archivefil0_ 
    where
        archivefil0_.filename='1.arc'
Hibernate: 
    insert 
    into
        ArchiveFile
        (indexed, indexedDate, indexingFailedAttempts, originalIndexFileName, filename) 
    values
        (?, ?, ?, ?, ?)
Hibernate: 
    select
        archivefil0_.filename as filename10_,
        archivefil0_.indexed as indexed10_,
        archivefil0_.indexedDate as indexedD3_10_,
        archivefil0_.indexingFailedAttempts as indexing4_10_,
        archivefil0_.originalIndexFileName as original5_10_ 
    from
        ArchiveFile archivefil0_ 
    where
        archivefil0_.filename='2.arc'
Hibernate: 
    insert 
    into
        ArchiveFile
        (indexed, indexedDate, indexingFailedAttempts, originalIndexFileName, filename) 
    values
        (?, ?, ?, ?, ?)
Hibernate: 
    select
        archivefil0_.filename as filename10_,
        archivefil0_.indexed as indexed10_,
        archivefil0_.indexedDate as indexedD3_10_,
        archivefil0_.indexingFailedAttempts as indexing4_10_,
        archivefil0_.originalIndexFileName as original5_10_ 
    from
        ArchiveFile archivefil0_ 
    where
        archivefil0_.filename='3.arc'
Hibernate: 
    insert 
    into
        ArchiveFile
        (indexed, indexedDate, indexingFailedAttempts, originalIndexFileName, filename) 
    values
        (?, ?, ?, ?, ?)
Hibernate: 
    select
        archivefil0_.filename as filename10_,
        archivefil0_.indexed as indexed10_,
        archivefil0_.indexedDate as indexedD3_10_,
        archivefil0_.indexingFailedAttempts as indexing4_10_,
        archivefil0_.originalIndexFileName as original5_10_ 
    from
        ArchiveFile archivefil0_ 
    where
        archivefil0_.filename='1.arc'
Hibernate: 
    select
        archivefil0_.filename as filename10_,
        archivefil0_.indexed as indexed10_,
        archivefil0_.indexedDate as indexedD3_10_,
        archivefil0_.indexingFailedAttempts as indexing4_10_,
        archivefil0_.originalIndexFileName as original5_10_ 
    from
        ArchiveFile archivefil0_ 
    where
        archivefil0_.filename='2.arc'
Hibernate: 
    select
        archivefil0_.filename as filename10_,
        archivefil0_.indexed as indexed10_,
        archivefil0_.indexedDate as indexedD3_10_,
        archivefil0_.indexingFailedAttempts as indexing4_10_,
        archivefil0_.originalIndexFileName as original5_10_ 
    from
        ArchiveFile archivefil0_ 
    where
        archivefil0_.filename='3.arc'
Hibernate: 
    select
        archivefil0_.filename as filename10_,
        archivefil0_.indexed as indexed10_,
        archivefil0_.indexedDate as indexedD3_10_,
        archivefil0_.indexingFailedAttempts as indexing4_10_,
        archivefil0_.originalIndexFileName as original5_10_ 
    from
        ArchiveFile archivefil0_ 
    where
        archivefil0_.indexed=0 
        and archivefil0_.indexingFailedAttempts<3 
    order by
        archivefil0_.indexingFailedAttempts ASC
Tests run: 2, Failures: 0, Errors: 0, Skipped: 0, Time elapsed: 0.925 sec - in dk.netarkivet.wayback.indexer.WaybackIndexerTester
Running dk.netarkivet.wayback.indexer.IndexerQueueTester
Hibernate: 
    select
        archivefil0_.filename as filename18_,
        archivefil0_.indexed as indexed18_,
        archivefil0_.indexedDate as indexedD3_18_,
        archivefil0_.indexingFailedAttempts as indexing4_18_,
        archivefil0_.originalIndexFileName as original5_18_ 
    from
        ArchiveFile archivefil0_ 
    where
        archivefil0_.filename='arcfile_withredirects.arc'
Hibernate: 
    insert 
    into
        ArchiveFile
        (indexed, indexedDate, indexingFailedAttempts, originalIndexFileName, filename) 
    values
        (?, ?, ?, ?, ?)
Hibernate: 
    select
        archivefil0_.filename as filename18_,
        archivefil0_.indexed as indexed18_,
        archivefil0_.indexedDate as indexedD3_18_,
        archivefil0_.indexingFailedAttempts as indexing4_18_,
        archivefil0_.originalIndexFileName as original5_18_ 
    from
        ArchiveFile archivefil0_ 
    where
        archivefil0_.filename='2-metadata-1.arc'
Hibernate: 
    insert 
    into
        ArchiveFile
        (indexed, indexedDate, indexingFailedAttempts, originalIndexFileName, filename) 
    values
        (?, ?, ?, ?, ?)
Hibernate: 
    select
        archivefil0_.filename as filename18_,
        archivefil0_.indexed as indexed18_,
        archivefil0_.indexedDate as indexedD3_18_,
        archivefil0_.indexingFailedAttempts as indexing4_18_,
        archivefil0_.originalIndexFileName as original5_18_ 
    from
        ArchiveFile archivefil0_ 
    where
        archivefil0_.filename='12345-metadata-4.arc'
Hibernate: 
    insert 
    into
        ArchiveFile
        (indexed, indexedDate, indexingFailedAttempts, originalIndexFileName, filename) 
    values
        (?, ?, ?, ?, ?)
Hibernate: 
    select
        archivefil0_.filename as filename18_,
        archivefil0_.indexed as indexed18_,
        archivefil0_.indexedDate as indexedD3_18_,
        archivefil0_.indexingFailedAttempts as indexing4_18_,
        archivefil0_.originalIndexFileName as original5_18_ 
    from
        ArchiveFile archivefil0_ 
    where
        archivefil0_.filename='Upload4.ARC'
Hibernate: 
    insert 
    into
        ArchiveFile
        (indexed, indexedDate, indexingFailedAttempts, originalIndexFileName, filename) 
    values
        (?, ?, ?, ?, ?)
Hibernate: 
    select
        archivefil0_.filename as filename18_,
        archivefil0_.indexed as indexed18_,
        archivefil0_.indexedDate as indexedD3_18_,
        archivefil0_.indexingFailedAttempts as indexing4_18_,
        archivefil0_.originalIndexFileName as original5_18_ 
    from
        ArchiveFile archivefil0_ 
    where
        archivefil0_.indexed=0 
        and archivefil0_.indexingFailedAttempts<3 
    order by
        archivefil0_.indexingFailedAttempts ASC
Hibernate: 
    select
        archivefil0_.filename as filename18_,
        archivefil0_.indexed as indexed18_,
        archivefil0_.indexedDate as indexedD3_18_,
        archivefil0_.indexingFailedAttempts as indexing4_18_,
        archivefil0_.originalIndexFileName as original5_18_ 
    from
        ArchiveFile archivefil0_ 
    where
        archivefil0_.indexed=0 
        and archivefil0_.indexingFailedAttempts<3 
    order by
        archivefil0_.indexingFailedAttempts ASC
Hibernate: 
    select
        archivefil0_.filename as filename22_,
        archivefil0_.indexed as indexed22_,
        archivefil0_.indexedDate as indexedD3_22_,
        archivefil0_.indexingFailedAttempts as indexing4_22_,
        archivefil0_.originalIndexFileName as original5_22_ 
    from
        ArchiveFile archivefil0_ 
    where
        archivefil0_.filename='Upload4.WARC'
Hibernate: 
    insert 
    into
        ArchiveFile
        (indexed, indexedDate, indexingFailedAttempts, originalIndexFileName, filename) 
    values
        (?, ?, ?, ?, ?)
Hibernate: 
    select
        archivefil0_.filename as filename22_,
        archivefil0_.indexed as indexed22_,
        archivefil0_.indexedDate as indexedD3_22_,
        archivefil0_.indexingFailedAttempts as indexing4_22_,
        archivefil0_.originalIndexFileName as original5_22_ 
    from
        ArchiveFile archivefil0_ 
    where
        archivefil0_.filename='2-metadata-1.warc'
Hibernate: 
    insert 
    into
        ArchiveFile
        (indexed, indexedDate, indexingFailedAttempts, originalIndexFileName, filename) 
    values
        (?, ?, ?, ?, ?)
Hibernate: 
    select
        archivefil0_.filename as filename22_,
        archivefil0_.indexed as indexed22_,
        archivefil0_.indexedDate as indexedD3_22_,
        archivefil0_.indexingFailedAttempts as indexing4_22_,
        archivefil0_.originalIndexFileName as original5_22_ 
    from
        ArchiveFile archivefil0_ 
    where
        archivefil0_.filename='arcfile_withredirects.arc'
Hibernate: 
    insert 
    into
        ArchiveFile
        (indexed, indexedDate, indexingFailedAttempts, originalIndexFileName, filename) 
    values
        (?, ?, ?, ?, ?)
Hibernate: 
    select
        archivefil0_.filename as filename22_,
        archivefil0_.indexed as indexed22_,
        archivefil0_.indexedDate as indexedD3_22_,
        archivefil0_.indexingFailedAttempts as indexing4_22_,
        archivefil0_.originalIndexFileName as original5_22_ 
    from
        ArchiveFile archivefil0_ 
    where
        archivefil0_.filename='2-metadata-1.arc'
Hibernate: 
    insert 
    into
        ArchiveFile
        (indexed, indexedDate, indexingFailedAttempts, originalIndexFileName, filename) 
    values
        (?, ?, ?, ?, ?)
Hibernate: 
    select
        archivefil0_.filename as filename22_,
        archivefil0_.indexed as indexed22_,
        archivefil0_.indexedDate as indexedD3_22_,
        archivefil0_.indexingFailedAttempts as indexing4_22_,
        archivefil0_.originalIndexFileName as original5_22_ 
    from
        ArchiveFile archivefil0_ 
    where
        archivefil0_.filename='12345-metadata-4.arc'
Hibernate: 
    insert 
    into
        ArchiveFile
        (indexed, indexedDate, indexingFailedAttempts, originalIndexFileName, filename) 
    values
        (?, ?, ?, ?, ?)
Hibernate: 
    select
        archivefil0_.filename as filename22_,
        archivefil0_.indexed as indexed22_,
        archivefil0_.indexedDate as indexedD3_22_,
        archivefil0_.indexingFailedAttempts as indexing4_22_,
        archivefil0_.originalIndexFileName as original5_22_ 
    from
        ArchiveFile archivefil0_ 
    where
        archivefil0_.filename='Upload4.ARC'
Hibernate: 
    insert 
    into
        ArchiveFile
        (indexed, indexedDate, indexingFailedAttempts, originalIndexFileName, filename) 
    values
        (?, ?, ?, ?, ?)
Hibernate: 
    select
        archivefil0_.filename as filename22_,
        archivefil0_.indexed as indexed22_,
        archivefil0_.indexedDate as indexedD3_22_,
        archivefil0_.indexingFailedAttempts as indexing4_22_,
        archivefil0_.originalIndexFileName as original5_22_ 
    from
        ArchiveFile archivefil0_ 
    where
        archivefil0_.indexed=0 
        and archivefil0_.indexingFailedAttempts<3 
    order by
        archivefil0_.indexingFailedAttempts ASC
Hibernate: 
    select
        archivefil0_.filename as filename22_,
        archivefil0_.indexed as indexed22_,
        archivefil0_.indexedDate as indexedD3_22_,
        archivefil0_.indexingFailedAttempts as indexing4_22_,
        archivefil0_.originalIndexFileName as original5_22_ 
    from
        ArchiveFile archivefil0_ 
    where
        archivefil0_.indexed=0 
        and archivefil0_.indexingFailedAttempts<3 
    order by
        archivefil0_.indexingFailedAttempts ASC
Tests run: 2, Failures: 0, Errors: 0, Skipped: 0, Time elapsed: 1.216 sec - in dk.netarkivet.wayback.indexer.IndexerQueueTester
Running dk.netarkivet.wayback.indexer.ArchiveFileTester
Hibernate: 
    insert 
    into
        ArchiveFile
        (indexed, indexedDate, indexingFailedAttempts, originalIndexFileName, filename) 
    values
        (?, ?, ?, ?, ?)
Hibernate: 
    update
        ArchiveFile 
    set
        indexed=?,
        indexedDate=?,
        indexingFailedAttempts=?,
        originalIndexFileName=? 
    where
        filename=?
Hibernate: 
    insert 
    into
        ArchiveFile
        (indexed, indexedDate, indexingFailedAttempts, originalIndexFileName, filename) 
    values
        (?, ?, ?, ?, ?)
Hibernate: 
    update
        ArchiveFile 
    set
        indexed=?,
        indexedDate=?,
        indexingFailedAttempts=?,
        originalIndexFileName=? 
    where
        filename=?
Tests run: 2, Failures: 0, Errors: 0, Skipped: 0, Time elapsed: 1.85 sec - in dk.netarkivet.wayback.indexer.ArchiveFileTester
Running dk.netarkivet.wayback.batch.WaybackCDXExtractionArcAndWarcBatchJobTester
Tests run: 2, Failures: 0, Errors: 0, Skipped: 0, Time elapsed: 1.804 sec - in dk.netarkivet.wayback.batch.WaybackCDXExtractionArcAndWarcBatchJobTester
Running dk.netarkivet.wayback.batch.DeduplicationCDXExtractionBatchJobTester
Tests run: 5, Failures: 0, Errors: 0, Skipped: 0, Time elapsed: 0.339 sec - in dk.netarkivet.wayback.batch.DeduplicationCDXExtractionBatchJobTester
Running dk.netarkivet.wayback.batch.DeduplicateToCDXAdapterTester
Tests run: 6, Failures: 0, Errors: 0, Skipped: 0, Time elapsed: 0.313 sec - in dk.netarkivet.wayback.batch.DeduplicateToCDXAdapterTester

Results :

Tests run: 34, Failures: 0, Errors: 0, Skipped: 2

[JENKINS] Recording test results
[INFO] 
[INFO] --- maven-jgit-buildnumber-plugin:1.2.9:extract-buildnumber (git-buildnumber) @ wayback-test ---
[INFO] 
[INFO] --- maven-jar-plugin:2.4:jar (default-jar) @ wayback-test ---
[WARNING] JAR will be empty - no content was marked for inclusion!
[INFO] Building jar: /home/cibuild02/workspace/NetarchiveSuite-Full-Test-staging/wayback/wayback-test/target/wayback-test-5.4-SNAPSHOT.jar
[INFO] 
[INFO] >>> maven-source-plugin:2.2.1:jar (attach-sources) > generate-sources @ wayback-test >>>
[INFO] 
[INFO] --- jacoco-maven-plugin:0.7.9:prepare-agent (agent) @ wayback-test ---
[INFO] argLine set to -javaagent:/home/cibuild02/.m2/repository/org/jacoco/org.jacoco.agent/0.7.9/org.jacoco.agent-0.7.9-runtime.jar=destfile=/home/cibuild02/workspace/NetarchiveSuite-Full-Test-staging/wayback/wayback-test/../target/jacoco.exec,append=true
[WARNING] Failed to getClass for org.apache.maven.plugin.source.SourceJarMojo
[INFO] 
[INFO] <<< maven-source-plugin:2.2.1:jar (attach-sources) < generate-sources @ wayback-test <<<
[INFO] 
[INFO] --- maven-source-plugin:2.2.1:jar (attach-sources) @ wayback-test ---
[INFO] No sources in project. Archive not created.
[INFO] 
[INFO] --- maven-javadoc-plugin:2.10.3:jar (attach-javadocs) @ wayback-test ---
[INFO] 
[INFO] --- maven-install-plugin:2.4:install (default-install) @ wayback-test ---
[INFO] Installing /home/cibuild02/workspace/NetarchiveSuite-Full-Test-staging/wayback/wayback-test/target/wayback-test-5.4-SNAPSHOT.jar to /home/cibuild02/.m2/repository/org/netarchivesuite/wayback-test/5.4-SNAPSHOT/wayback-test-5.4-SNAPSHOT.jar
[INFO] Installing /home/cibuild02/workspace/NetarchiveSuite-Full-Test-staging/wayback/wayback-test/pom.xml to /home/cibuild02/.m2/repository/org/netarchivesuite/wayback-test/5.4-SNAPSHOT/wayback-test-5.4-SNAPSHOT.pom
[JENKINS] Archiving disabled
[INFO]                                                                         
[INFO] ------------------------------------------------------------------------
[INFO] Building NetarchiveSuite - integration tests 5.4-SNAPSHOT
[INFO] ------------------------------------------------------------------------
[INFO] 
[INFO] --- maven-clean-plugin:2.5:clean (default-clean) @ integration-test ---
[INFO] 
[INFO] --- maven-jgit-buildnumber-plugin:1.2.9:extract-buildnumber (git-buildnumber) @ integration-test ---
[INFO] 
[INFO] >>> maven-source-plugin:2.2.1:jar (attach-sources) > generate-sources @ integration-test >>>
[WARNING] Failed to getClass for org.apache.maven.plugin.source.SourceJarMojo
[INFO] 
[INFO] <<< maven-source-plugin:2.2.1:jar (attach-sources) < generate-sources @ integration-test <<<
[INFO] 
[INFO] --- maven-source-plugin:2.2.1:jar (attach-sources) @ integration-test ---
[INFO] 
[INFO] --- maven-javadoc-plugin:2.10.3:jar (attach-javadocs) @ integration-test ---
[INFO] Not executing Javadoc as the project is not a Java classpath-capable package
[INFO] 
[INFO] --- maven-install-plugin:2.4:install (default-install) @ integration-test ---
[INFO] Installing /home/cibuild02/workspace/NetarchiveSuite-Full-Test-staging/integration-test/pom.xml to /home/cibuild02/.m2/repository/org/netarchivesuite/integration-test/5.4-SNAPSHOT/integration-test-5.4-SNAPSHOT.pom
[JENKINS] Archiving disabled
[INFO]                                                                         
[INFO] ------------------------------------------------------------------------
[INFO] Building NetarchiveSuite System test 5.4-SNAPSHOT
[INFO] ------------------------------------------------------------------------
[INFO] 
[INFO] --- maven-clean-plugin:2.5:clean (default-clean) @ system-test ---
[INFO] Deleting /home/cibuild02/workspace/NetarchiveSuite-Full-Test-staging/integration-test/system-test/target
[INFO] 
[INFO] --- maven-resources-plugin:2.6:resources (default-resources) @ system-test ---
[INFO] Using 'UTF-8' encoding to copy filtered resources.
[INFO] skip non existing resourceDirectory /home/cibuild02/workspace/NetarchiveSuite-Full-Test-staging/integration-test/system-test/src/main/resources
[INFO] 
[INFO] --- maven-compiler-plugin:3.1:compile (default-compile) @ system-test ---
[INFO] No sources to compile
[INFO] 
[INFO] --- maven-resources-plugin:2.6:testResources (default-testResources) @ system-test ---
[INFO] Using 'UTF-8' encoding to copy filtered resources.
[INFO] Copying 4 resources
[INFO] 
[INFO] --- maven-compiler-plugin:3.1:testCompile (default-testCompile) @ system-test ---
[INFO] Changes detected - recompiling the module!
[INFO] Compiling 33 source files to /home/cibuild02/workspace/NetarchiveSuite-Full-Test-staging/integration-test/system-test/target/test-classes
[INFO] 
[INFO] --- maven-surefire-plugin:2.17:test (default-test) @ system-test ---
[INFO] Tests are skipped.
[INFO] 
[INFO] --- maven-jgit-buildnumber-plugin:1.2.9:extract-buildnumber (git-buildnumber) @ system-test ---
[INFO] 
[INFO] --- maven-jar-plugin:2.4:jar (default-jar) @ system-test ---
[WARNING] JAR will be empty - no content was marked for inclusion!
[INFO] Building jar: /home/cibuild02/workspace/NetarchiveSuite-Full-Test-staging/integration-test/system-test/target/system-test-5.4-SNAPSHOT.jar
[INFO] 
[INFO] >>> maven-source-plugin:2.2.1:jar (attach-sources) > generate-sources @ system-test >>>
[WARNING] Failed to getClass for org.apache.maven.plugin.source.SourceJarMojo
[INFO] 
[INFO] <<< maven-source-plugin:2.2.1:jar (attach-sources) < generate-sources @ system-test <<<
[INFO] 
[INFO] --- maven-source-plugin:2.2.1:jar (attach-sources) @ system-test ---
[INFO] No sources in project. Archive not created.
[INFO] 
[INFO] --- maven-javadoc-plugin:2.10.3:jar (attach-javadocs) @ system-test ---
[INFO] 
[INFO] --- maven-install-plugin:2.4:install (default-install) @ system-test ---
[INFO] Installing /home/cibuild02/workspace/NetarchiveSuite-Full-Test-staging/integration-test/system-test/target/system-test-5.4-SNAPSHOT.jar to /home/cibuild02/.m2/repository/org/netarchivesuite/system-test/5.4-SNAPSHOT/system-test-5.4-SNAPSHOT.jar
[INFO] Installing /home/cibuild02/workspace/NetarchiveSuite-Full-Test-staging/integration-test/system-test/pom.xml to /home/cibuild02/.m2/repository/org/netarchivesuite/system-test/5.4-SNAPSHOT/system-test-5.4-SNAPSHOT.pom
[JENKINS] Archiving disabled
[JENKINS] Archiving disabled
[JENKINS] Archiving disabled
[JENKINS] Archiving disabled
[JENKINS] Archiving disabled
[JENKINS] Archiving disabled
[JENKINS] Archiving disabled
[JENKINS] Archiving disabled
[JENKINS] Archiving disabled
[JENKINS] Archiving disabled
[JENKINS] Archiving disabled
[JENKINS] Archiving disabled
[JENKINS] Archiving disabled
[JENKINS] Archiving disabled
[JENKINS] Archiving disabled
[JENKINS] Archiving disabled
[JENKINS] Archiving disabled
[JENKINS] Archiving disabled
[JENKINS] Archiving disabled
[JENKINS] Archiving disabled
[JENKINS] Archiving disabled
[JENKINS] Archiving disabled
[JENKINS] Archiving disabled
[JENKINS] Archiving disabled
[JENKINS] Archiving disabled
[JENKINS] Archiving disabled
[JENKINS] Archiving disabled
[JENKINS] Archiving disabled
[JENKINS] Archiving disabled
[JENKINS] Archiving disabled
[JENKINS] Archiving disabled
[JENKINS] Archiving disabled
[JENKINS] Archiving disabled
[JENKINS] Archiving disabled
[JENKINS] Archiving disabled
[JENKINS] Archiving disabled
[JENKINS] Archiving disabled
[INFO] ------------------------------------------------------------------------
[INFO] Reactor Summary:
[INFO] 
[INFO] NetarchiveSuite .................................... SUCCESS [  7.981 s]
[INFO] NetarchiveSuite - build-tools ...................... SUCCESS [  2.622 s]
[INFO] NetarchiveSuite - common ........................... SUCCESS [  0.376 s]
[INFO] NetarchiveSuite - test utils ....................... SUCCESS [  8.832 s]
[INFO] NetarchiveSuite - common - core .................... SUCCESS [ 49.032 s]
[INFO] NetarchiveSuite - common - test .................... SUCCESS [ 52.614 s]
[INFO] NetarchiveSuite - archive .......................... SUCCESS [  0.388 s]
[INFO] NetarchiveSuite - archive - core ................... SUCCESS [02:41 min]
[INFO] NetarchiveSuite - harvester ........................ SUCCESS [  0.344 s]
[INFO] NetarchiveSuite - harvester - core ................. SUCCESS [02:00 min]
[INFO] NetarchiveSuite - archive - test ................... SUCCESS [ 49.452 s]
[INFO] NetarchiveSuite - bitpreservation - webapp ......... SUCCESS [  1.896 s]
[INFO] NetarchiveSuite - Harvest Scheduler ................ SUCCESS [ 23.571 s]
[INFO] NetarchiveSuite - monitor .......................... SUCCESS [  0.317 s]
[INFO] NetarchiveSuite - monitor - core ................... SUCCESS [ 23.752 s]
[INFO] NetarchiveSuite - wayback .......................... SUCCESS [  1.508 s]
[INFO] NetarchiveSuite - wayback - indexer ................ SUCCESS [ 36.564 s]
[INFO] NetarchiveSuite - deploy ........................... SUCCESS [  0.376 s]
[INFO] NetarchiveSuite - deploy - core .................... SUCCESS [ 37.471 s]
[INFO] NetarchiveSuite - harvester - heritrix3 ............ SUCCESS [  0.651 s]
[INFO] Netarchivesuite - Heritrix3 Extensions ............. SUCCESS [ 30.149 s]
[INFO] NetarchiveSuite - heritrix3 controller ............. SUCCESS [ 28.631 s]
[INFO] NetarchiveSuite - Status - Webapp .................. SUCCESS [  3.171 s]
[INFO] NetarchiveSuite - qa - webapp ...................... SUCCESS [  1.055 s]
[INFO] NetarchiveSuite - history - webapp ................. SUCCESS [  3.272 s]
[INFO] NetarchiveSuite - harvestDefinition - webapp ....... SUCCESS [  3.086 s]
[INFO] NetarchiveSuite - harvestChannel - webapp .......... SUCCESS [  0.836 s]
[INFO] NetarchiveSuite - deploy - distribution ............ SUCCESS [01:17 min]
[INFO] NetarchiveSuite - deploy - test .................... SUCCESS [ 43.824 s]
[INFO] Netarchivesuite - Heritrix3 Bundler ................ SUCCESS [ 52.594 s]
[INFO] NetarchiveSuite - harvester - test ................. SUCCESS [26:07 min]
[INFO] NetarchiveSuite - monitor - test ................... SUCCESS [  4.306 s]
[INFO] NetarchiveSuite - wayback resourceStore ............ SUCCESS [  9.514 s]
[INFO] NetarchiveSuite - wayback - test ................... SUCCESS [ 20.081 s]
[INFO] NetarchiveSuite - integration tests ................ SUCCESS [  0.296 s]
[INFO] NetarchiveSuite System test ........................ SUCCESS [  1.746 s]
[INFO] ------------------------------------------------------------------------
[INFO] BUILD SUCCESS
[INFO] ------------------------------------------------------------------------
[INFO] Total time: 40:50 min
[INFO] Finished at: 2018-02-06T14:13:04+01:00
[INFO] Final Memory: 77M/184M
[INFO] ------------------------------------------------------------------------
channel stopped
An attempt to send an e-mail to empty list of recipients, ignored.
Warning: you have no plugins providing access control for builds, so falling back to legacy behavior of permitting any downstream builds to be triggered
Finished: UNSTABLE