AbortedConsole Output

Skipping 1,421 KB.. Full Log
/metadata308413945155914121cdx 45001
14:19:20.190 [main] INFO dk.netarkivet.harvester.harvesting.metadata.MetadataFileWriterWarc - /tmp/metadata2373553633221660375cdx 45001
14:19:20.191 [main] INFO dk.netarkivet.harvester.harvesting.metadata.MetadataFileWriterWarc - /tmp/metadata8337165597426566075cdx 45001
14:19:20.193 [main] INFO dk.netarkivet.harvester.harvesting.metadata.MetadataFileWriterWarc - /tmp/metadata8862370667128224408cdx 45001
14:19:20.194 [main] INFO dk.netarkivet.harvester.harvesting.metadata.MetadataFileWriterWarc - /tmp/metadata967208672719425586cdx 45001
14:19:20.196 [main] INFO dk.netarkivet.harvester.harvesting.metadata.MetadataFileWriterWarc - /tmp/metadata7687022096039740444cdx 45001
14:19:20.197 [main] INFO dk.netarkivet.harvester.harvesting.metadata.MetadataFileWriterWarc - /tmp/metadata7167848489834896800cdx 45001
14:19:20.197 [main] INFO dk.netarkivet.harvester.harvesting.metadata.MetadataFileWriterWarc - /tmp/metadata2717254275392946406cdx 45001
14:19:20.199 [main] INFO dk.netarkivet.harvester.harvesting.metadata.MetadataFileWriterWarc - /tmp/metadata7906157445441732804cdx 45001
14:19:20.200 [main] INFO dk.netarkivet.harvester.harvesting.metadata.MetadataFileWriterWarc - /tmp/metadata8033517712681253770cdx 45001
14:19:20.202 [main] INFO dk.netarkivet.harvester.harvesting.metadata.MetadataFileWriterWarc - /tmp/metadata5958551041139365854cdx 45001
14:19:20.203 [main] INFO dk.netarkivet.harvester.harvesting.metadata.MetadataFileWriterWarc - /tmp/metadata7879318217535877414cdx 45001
14:19:20.205 [main] INFO dk.netarkivet.harvester.harvesting.metadata.MetadataFileWriterWarc - /tmp/metadata6123288446830276157cdx 45001
14:19:20.206 [main] INFO dk.netarkivet.harvester.harvesting.metadata.MetadataFileWriterWarc - /tmp/metadata2728533012152094061cdx 45001
14:19:20.207 [main] INFO dk.netarkivet.harvester.harvesting.metadata.MetadataFileWriterWarc - /tmp/metadata8660074189282376838cdx 45001
14:19:20.209 [main] INFO dk.netarkivet.harvester.harvesting.metadata.MetadataFileWriterWarc - /tmp/metadata3471560221425826508cdx 45001
14:19:20.210 [main] INFO dk.netarkivet.harvester.harvesting.metadata.MetadataFileWriterWarc - /tmp/metadata7208064047600232942cdx 45001
14:19:20.211 [main] INFO dk.netarkivet.harvester.harvesting.metadata.MetadataFileWriterWarc - /tmp/metadata2558414786107670945cdx 45001
14:19:20.213 [main] INFO dk.netarkivet.harvester.harvesting.metadata.MetadataFileWriterWarc - /tmp/metadata4252572655610871789cdx 45001
14:19:20.214 [main] INFO dk.netarkivet.harvester.harvesting.metadata.MetadataFileWriterWarc - /tmp/metadata1588988277692638124cdx 45001
14:19:20.214 [main] INFO dk.netarkivet.harvester.harvesting.metadata.MetadataFileWriterWarc - /tmp/metadata7304465260381848112cdx 45001
14:19:20.216 [main] INFO dk.netarkivet.harvester.harvesting.metadata.MetadataFileWriterWarc - /tmp/metadata687556805228940202cdx 45001
14:19:20.217 [main] INFO dk.netarkivet.harvester.harvesting.metadata.MetadataFileWriterWarc - /tmp/metadata6677046782271281570cdx 45001
14:19:20.219 [main] INFO dk.netarkivet.harvester.harvesting.metadata.MetadataFileWriterWarc - /tmp/metadata4986855398505424727cdx 45001
14:19:20.219 [main] INFO dk.netarkivet.harvester.harvesting.metadata.MetadataFileWriterWarc - /tmp/metadata2405131527208460816cdx 45001
14:19:20.222 [main] INFO dk.netarkivet.harvester.harvesting.metadata.MetadataFileWriterWarc - /tmp/metadata6983768331026228092cdx 45001
14:19:20.222 [main] INFO dk.netarkivet.harvester.harvesting.metadata.MetadataFileWriterWarc - /tmp/metadata8425873610191263328cdx 45001
14:19:20.224 [main] INFO dk.netarkivet.harvester.harvesting.metadata.MetadataFileWriterWarc - /tmp/metadata7955191351482251368cdx 45001
14:19:20.225 [main] INFO dk.netarkivet.harvester.harvesting.metadata.MetadataFileWriterWarc - /tmp/metadata965619416484430635cdx 45001
14:19:20.226 [main] INFO dk.netarkivet.harvester.harvesting.metadata.MetadataFileWriterWarc - /tmp/metadata3843301268397646316cdx 45001
14:19:20.228 [main] INFO dk.netarkivet.harvester.harvesting.metadata.MetadataFileWriterWarc - /tmp/metadata808148277113451922cdx 45001
14:19:20.229 [main] INFO dk.netarkivet.harvester.harvesting.metadata.MetadataFileWriterWarc - /tmp/metadata6029334660200892220cdx 45001
14:19:20.230 [main] INFO dk.netarkivet.harvester.harvesting.metadata.MetadataFileWriterWarc - /tmp/metadata2610346174633130804cdx 45001
14:19:20.232 [main] INFO dk.netarkivet.harvester.harvesting.metadata.MetadataFileWriterWarc - /tmp/metadata7299628108932339785cdx 45001
14:19:20.233 [main] INFO dk.netarkivet.harvester.harvesting.metadata.MetadataFileWriterWarc - /tmp/metadata3744615515499096876cdx 45001
14:19:20.235 [main] INFO dk.netarkivet.harvester.harvesting.metadata.MetadataFileWriterWarc - /tmp/metadata1446083615347485737cdx 45001
14:19:20.235 [main] INFO dk.netarkivet.harvester.harvesting.metadata.MetadataFileWriterWarc - /tmp/metadata6849194688006303207cdx 45001
14:19:20.237 [main] INFO dk.netarkivet.harvester.harvesting.metadata.MetadataFileWriterWarc - /tmp/metadata4217140394288796662cdx 45001
14:19:20.238 [main] INFO dk.netarkivet.harvester.harvesting.metadata.MetadataFileWriterWarc - /tmp/metadata1284734499389463861cdx 45001
14:19:20.239 [main] INFO dk.netarkivet.harvester.harvesting.metadata.MetadataFileWriterWarc - /tmp/metadata3146967042517730251cdx 45001
14:19:20.241 [main] INFO dk.netarkivet.harvester.harvesting.metadata.MetadataFileWriterWarc - /tmp/metadata766328159121025235cdx 45001
14:19:20.242 [main] INFO dk.netarkivet.harvester.harvesting.metadata.MetadataFileWriterWarc - /tmp/metadata5611857780516922299cdx 45001
14:19:20.243 [main] INFO dk.netarkivet.harvester.harvesting.metadata.MetadataFileWriterWarc - /tmp/metadata5305605155071857529cdx 45001
14:19:20.245 [main] INFO dk.netarkivet.harvester.harvesting.metadata.MetadataFileWriterWarc - /tmp/metadata4295434020731324004cdx 45001
14:19:20.246 [main] INFO dk.netarkivet.harvester.harvesting.metadata.MetadataFileWriterWarc - /tmp/metadata158695556877453505cdx 45001
14:19:20.247 [main] INFO dk.netarkivet.harvester.harvesting.metadata.MetadataFileWriterWarc - /tmp/metadata7310987670274274173cdx 45001
14:19:20.249 [main] INFO dk.netarkivet.harvester.harvesting.metadata.MetadataFileWriterWarc - /tmp/metadata5988542434379866785cdx 45001
14:19:20.249 [main] INFO dk.netarkivet.harvester.harvesting.metadata.MetadataFileWriterWarc - /tmp/metadata889355939234479670cdx 45001
14:19:20.251 [main] INFO dk.netarkivet.harvester.harvesting.metadata.MetadataFileWriterWarc - /tmp/metadata1892373361316808780cdx 45001
14:19:20.253 [main] INFO dk.netarkivet.harvester.harvesting.metadata.MetadataFileWriterWarc - /tmp/metadata2703070491356431860cdx 45001
14:19:20.253 [main] INFO dk.netarkivet.harvester.harvesting.metadata.MetadataFileWriterWarc - /tmp/metadata8481541653059088633cdx 45001
14:19:20.254 [main] INFO dk.netarkivet.harvester.harvesting.metadata.MetadataFileWriterWarc - /tmp/metadata5115226995788097204cdx 45001
14:19:20.256 [main] INFO dk.netarkivet.harvester.harvesting.metadata.MetadataFileWriterWarc - /tmp/metadata4612375572163865727cdx 45001
14:19:20.257 [main] INFO dk.netarkivet.harvester.harvesting.metadata.MetadataFileWriterWarc - /tmp/metadata3583293403909498670cdx 45001
14:19:20.259 [main] INFO dk.netarkivet.harvester.harvesting.metadata.MetadataFileWriterWarc - /tmp/metadata497977947194903012cdx 45001
14:19:20.260 [main] INFO dk.netarkivet.harvester.harvesting.metadata.MetadataFileWriterWarc - /tmp/metadata6191437815276349742cdx 45001
14:19:20.262 [main] INFO dk.netarkivet.harvester.harvesting.metadata.MetadataFileWriterWarc - /tmp/metadata2177090645328667495cdx 45001
14:19:20.263 [main] INFO dk.netarkivet.harvester.harvesting.metadata.MetadataFileWriterWarc - /tmp/metadata5645422782289724073cdx 45001
14:19:20.263 [main] INFO dk.netarkivet.harvester.harvesting.metadata.MetadataFileWriterWarc - /tmp/metadata4078909404805465746cdx 45001
14:19:20.265 [main] INFO dk.netarkivet.harvester.harvesting.metadata.MetadataFileWriterWarc - /tmp/metadata3216876326206456324cdx 45001
14:19:20.267 [main] INFO dk.netarkivet.harvester.harvesting.metadata.MetadataFileWriterWarc - /tmp/metadata3602457695759897327cdx 45001
14:19:20.268 [main] INFO dk.netarkivet.harvester.harvesting.metadata.MetadataFileWriterWarc - /tmp/metadata4756488550026335610cdx 45001
14:19:20.269 [main] INFO dk.netarkivet.harvester.harvesting.metadata.MetadataFileWriterWarc - /tmp/metadata8923772305619154775cdx 45001
14:19:20.271 [main] INFO dk.netarkivet.harvester.harvesting.metadata.MetadataFileWriterWarc - /tmp/metadata5843619817350699702cdx 45001
14:19:20.272 [main] INFO dk.netarkivet.harvester.harvesting.metadata.MetadataFileWriterWarc - /tmp/metadata8406569173386851604cdx 45001
14:19:20.272 [main] INFO dk.netarkivet.harvester.harvesting.metadata.MetadataFileWriterWarc - /tmp/metadata5991139569310109889cdx 45001
14:19:20.274 [main] INFO dk.netarkivet.harvester.harvesting.metadata.MetadataFileWriterWarc - /tmp/metadata8428860732515393069cdx 45001
14:19:20.276 [main] INFO dk.netarkivet.harvester.harvesting.metadata.MetadataFileWriterWarc - /tmp/metadata4333167742412661205cdx 45001
14:19:20.277 [main] INFO dk.netarkivet.harvester.harvesting.metadata.MetadataFileWriterWarc - /tmp/metadata4871575240239010615cdx 45001
14:19:20.278 [main] INFO dk.netarkivet.harvester.harvesting.metadata.MetadataFileWriterWarc - /tmp/metadata7552388114245128952cdx 45001
14:19:20.280 [main] INFO dk.netarkivet.harvester.harvesting.metadata.MetadataFileWriterWarc - /tmp/metadata7620400095573584301cdx 45001
14:19:20.281 [main] INFO dk.netarkivet.harvester.harvesting.metadata.MetadataFileWriterWarc - /tmp/metadata947760321727966708cdx 45001
14:19:20.282 [main] INFO dk.netarkivet.harvester.harvesting.metadata.MetadataFileWriterWarc - /tmp/metadata1420430954398920105cdx 45001
14:19:20.284 [main] INFO dk.netarkivet.harvester.harvesting.metadata.MetadataFileWriterWarc - /tmp/metadata4674775182721960394cdx 45001
14:19:20.285 [main] INFO dk.netarkivet.harvester.harvesting.metadata.MetadataFileWriterWarc - /tmp/metadata3138990836295780876cdx 45001
14:19:20.285 [main] INFO dk.netarkivet.harvester.harvesting.metadata.MetadataFileWriterWarc - /tmp/metadata9100421666849325353cdx 45001
14:19:20.287 [main] INFO dk.netarkivet.harvester.harvesting.metadata.MetadataFileWriterWarc - /tmp/metadata6297244525600139069cdx 45001
14:19:20.288 [main] INFO dk.netarkivet.harvester.harvesting.metadata.MetadataFileWriterWarc - /tmp/metadata8835112749696308621cdx 45001
14:19:20.290 [main] INFO dk.netarkivet.harvester.harvesting.metadata.MetadataFileWriterWarc - /tmp/metadata5122661580947162208cdx 45001
14:19:20.290 [main] INFO dk.netarkivet.harvester.harvesting.metadata.MetadataFileWriterWarc - /tmp/metadata3001733898168591216cdx 45001
14:19:20.292 [main] INFO dk.netarkivet.harvester.harvesting.metadata.MetadataFileWriterWarc - /tmp/metadata1484046385080547964cdx 45001
14:19:20.293 [main] INFO dk.netarkivet.harvester.harvesting.metadata.MetadataFileWriterWarc - /tmp/metadata2555330103789264431cdx 45001
14:19:20.295 [main] INFO dk.netarkivet.harvester.harvesting.metadata.MetadataFileWriterWarc - /tmp/metadata1358968183418711562cdx 45001
14:19:20.296 [main] INFO dk.netarkivet.harvester.harvesting.metadata.MetadataFileWriterWarc - /tmp/metadata8811852842428927712cdx 45001
14:19:20.298 [main] INFO dk.netarkivet.harvester.harvesting.metadata.MetadataFileWriterWarc - /tmp/metadata4050339533771565069cdx 45001
14:19:20.299 [main] INFO dk.netarkivet.harvester.harvesting.metadata.MetadataFileWriterWarc - /tmp/metadata5125324436018196844cdx 45001
14:19:20.299 [main] INFO dk.netarkivet.harvester.harvesting.metadata.MetadataFileWriterWarc - /tmp/metadata8152137637806527660cdx 45001
14:19:20.301 [main] INFO dk.netarkivet.harvester.harvesting.metadata.MetadataFileWriterWarc - /tmp/metadata3879981393220091640cdx 45001
14:19:20.302 [main] INFO dk.netarkivet.harvester.harvesting.metadata.MetadataFileWriterWarc - /tmp/metadata4231157314978905007cdx 45001
14:19:20.304 [main] INFO dk.netarkivet.harvester.harvesting.metadata.MetadataFileWriterWarc - /tmp/metadata3090928614608648920cdx 45001
14:19:20.305 [main] INFO dk.netarkivet.harvester.harvesting.metadata.MetadataFileWriterWarc - /tmp/metadata5198507580072139240cdx 45001
14:19:20.306 [main] INFO dk.netarkivet.harvester.harvesting.metadata.MetadataFileWriterWarc - /tmp/metadata5850967833116776322cdx 45001
14:19:20.308 [main] INFO dk.netarkivet.harvester.harvesting.metadata.MetadataFileWriterWarc - /tmp/metadata3176753358226166657cdx 45001
14:19:20.309 [main] INFO dk.netarkivet.harvester.harvesting.metadata.MetadataFileWriterWarc - /tmp/metadata3799239246480379011cdx 45001
14:19:20.310 [main] INFO dk.netarkivet.harvester.harvesting.metadata.MetadataFileWriterWarc - /tmp/metadata5230413622157995248cdx 45001
14:19:20.312 [main] INFO dk.netarkivet.harvester.harvesting.metadata.MetadataFileWriterWarc - /tmp/metadata284175671211543066cdx 45001
14:19:20.312 [main] INFO dk.netarkivet.harvester.harvesting.metadata.MetadataFileWriterWarc - /tmp/metadata4030239213904597746cdx 45001
14:19:20.314 [main] INFO dk.netarkivet.harvester.harvesting.metadata.MetadataFileWriterWarc - /tmp/metadata7912892867903928431cdx 45001
14:19:20.316 [main] INFO dk.netarkivet.harvester.harvesting.metadata.MetadataFileWriterWarc - /tmp/metadata2550127348663177244cdx 45001
14:19:20.317 [main] INFO dk.netarkivet.harvester.harvesting.metadata.MetadataFileWriterWarc - /tmp/metadata8008518686309035814cdx 45001
14:19:20.318 [main] INFO dk.netarkivet.harvester.harvesting.metadata.MetadataFileWriterWarc - /tmp/metadata4064934806444341620cdx 45001
14:19:20.319 [main] INFO dk.netarkivet.harvester.harvesting.metadata.MetadataFileWriterWarc - /tmp/metadata9017727872670964056cdx 45001
14:19:20.321 [main] INFO dk.netarkivet.harvester.harvesting.metadata.MetadataFileWriterWarc - /tmp/metadata5814309699312607989cdx 45001
14:19:20.322 [main] INFO dk.netarkivet.harvester.harvesting.metadata.MetadataFileWriterWarc - /tmp/metadata1870718745505646066cdx 45001
14:19:20.323 [main] INFO dk.netarkivet.harvester.harvesting.metadata.MetadataFileWriterWarc - /tmp/metadata615828518212871599cdx 45001
14:19:20.325 [main] INFO dk.netarkivet.harvester.harvesting.metadata.MetadataFileWriterWarc - /tmp/metadata1998140969256225944cdx 45001
14:19:20.325 [main] INFO dk.netarkivet.harvester.harvesting.metadata.MetadataFileWriterWarc - /tmp/metadata3750649578690547026cdx 45001
14:19:20.327 [main] INFO dk.netarkivet.harvester.harvesting.metadata.MetadataFileWriterWarc - /tmp/metadata8805347015330449464cdx 45001
14:19:20.328 [main] INFO dk.netarkivet.harvester.harvesting.metadata.MetadataFileWriterWarc - /tmp/metadata2470274321202335328cdx 45001
14:19:20.329 [main] INFO dk.netarkivet.harvester.harvesting.metadata.MetadataFileWriterWarc - /tmp/metadata1700796100172639720cdx 45001
14:19:20.331 [main] INFO dk.netarkivet.harvester.harvesting.metadata.MetadataFileWriterWarc - /tmp/metadata1935860828530470069cdx 45001
14:19:20.332 [main] INFO dk.netarkivet.harvester.harvesting.metadata.MetadataFileWriterWarc - /tmp/metadata8771193120965484634cdx 45001
14:19:20.333 [main] INFO dk.netarkivet.harvester.harvesting.metadata.MetadataFileWriterWarc - /tmp/metadata7935923919911522835cdx 45001
14:19:20.335 [main] INFO dk.netarkivet.harvester.harvesting.metadata.MetadataFileWriterWarc - /tmp/metadata7631530650508987015cdx 45001
14:19:20.335 [main] INFO dk.netarkivet.harvester.harvesting.metadata.MetadataFileWriterWarc - /tmp/metadata8272528361395395389cdx 45001
14:19:20.337 [main] INFO dk.netarkivet.harvester.harvesting.metadata.MetadataFileWriterWarc - /tmp/metadata3347961977575638806cdx 45001
14:19:20.338 [main] INFO dk.netarkivet.harvester.harvesting.metadata.MetadataFileWriterWarc - /tmp/metadata5936419150450516106cdx 45001
14:19:20.340 [main] INFO dk.netarkivet.harvester.harvesting.metadata.MetadataFileWriterWarc - /tmp/metadata2290143745726628200cdx 45001
14:19:20.341 [main] INFO dk.netarkivet.harvester.harvesting.metadata.MetadataFileWriterWarc - /tmp/metadata1959552153611318044cdx 45001
14:19:20.343 [main] INFO dk.netarkivet.harvester.harvesting.metadata.MetadataFileWriterWarc - /tmp/metadata4707040590935160707cdx 45001
14:19:20.344 [main] INFO dk.netarkivet.harvester.harvesting.metadata.MetadataFileWriterWarc - /tmp/metadata259803276080133801cdx 45001
14:19:20.344 [main] INFO dk.netarkivet.harvester.harvesting.metadata.MetadataFileWriterWarc - /tmp/metadata5895267407966661989cdx 45001
14:19:20.346 [main] INFO dk.netarkivet.harvester.harvesting.metadata.MetadataFileWriterWarc - /tmp/metadata7155847745346956497cdx 45001
14:19:20.347 [main] INFO dk.netarkivet.harvester.harvesting.metadata.MetadataFileWriterWarc - /tmp/metadata4622753878480896296cdx 45001
14:19:20.349 [main] INFO dk.netarkivet.harvester.harvesting.metadata.MetadataFileWriterWarc - /tmp/metadata7089833019381011552cdx 45001
14:19:20.350 [main] INFO dk.netarkivet.harvester.harvesting.metadata.MetadataFileWriterWarc - /tmp/metadata8771622756873889689cdx 45001
14:19:20.352 [main] INFO dk.netarkivet.harvester.harvesting.metadata.MetadataFileWriterWarc - /tmp/metadata7527335998905881074cdx 45001
14:19:20.352 [main] INFO dk.netarkivet.harvester.harvesting.metadata.MetadataFileWriterWarc - /tmp/metadata3355150060493398327cdx 45001
14:19:20.354 [main] INFO dk.netarkivet.harvester.harvesting.metadata.MetadataFileWriterWarc - /tmp/metadata9088208327650890291cdx 45001
14:19:20.355 [main] INFO dk.netarkivet.harvester.harvesting.metadata.MetadataFileWriterWarc - /tmp/metadata4790156435679442835cdx 45001
14:19:20.356 [main] INFO dk.netarkivet.harvester.harvesting.metadata.MetadataFileWriterWarc - /tmp/metadata239758280106895412cdx 45001
14:19:20.358 [main] INFO dk.netarkivet.harvester.harvesting.metadata.MetadataFileWriterWarc - /tmp/metadata8613555060975121475cdx 45001
14:19:20.359 [main] INFO dk.netarkivet.harvester.harvesting.metadata.MetadataFileWriterWarc - /tmp/metadata4403800503658436433cdx 45001
14:19:20.360 [main] INFO dk.netarkivet.harvester.harvesting.metadata.MetadataFileWriterWarc - /tmp/metadata3843410628257084230cdx 45001
14:19:20.361 [main] INFO dk.netarkivet.harvester.harvesting.metadata.MetadataFileWriterWarc - /tmp/metadata3034694968477274092cdx 45001
14:19:20.362 [main] INFO dk.netarkivet.harvester.harvesting.metadata.MetadataFileWriterWarc - /tmp/metadata8566706445851485421cdx 45001
14:19:20.364 [main] INFO dk.netarkivet.harvester.harvesting.metadata.MetadataFileWriterWarc - /tmp/metadata907315614112397798cdx 45001
14:19:20.366 [main] INFO dk.netarkivet.harvester.harvesting.metadata.MetadataFileWriterWarc - /tmp/metadata769792334688313824cdx 45001
14:19:20.367 [main] INFO dk.netarkivet.harvester.harvesting.metadata.MetadataFileWriterWarc - /tmp/metadata8787063847657058855cdx 45001
14:19:20.367 [main] INFO dk.netarkivet.harvester.harvesting.metadata.MetadataFileWriterWarc - /tmp/metadata6791629130293945456cdx 45001
14:19:20.369 [main] INFO dk.netarkivet.harvester.harvesting.metadata.MetadataFileWriterWarc - /tmp/metadata5428966547881808677cdx 45001
14:19:20.370 [main] INFO dk.netarkivet.harvester.harvesting.metadata.MetadataFileWriterWarc - /tmp/metadata1725566905487345512cdx 45001
14:19:20.372 [main] INFO dk.netarkivet.harvester.harvesting.metadata.MetadataFileWriterWarc - /tmp/metadata140682223446581792cdx 45001
14:19:20.373 [main] INFO dk.netarkivet.harvester.harvesting.metadata.MetadataFileWriterWarc - /tmp/metadata4489863777549811178cdx 45001
14:19:20.375 [main] INFO dk.netarkivet.harvester.harvesting.metadata.MetadataFileWriterWarc - /tmp/metadata872113245399203571cdx 45001
14:19:20.375 [main] INFO dk.netarkivet.harvester.harvesting.metadata.MetadataFileWriterWarc - /tmp/metadata8932205694930742363cdx 45001
14:19:20.377 [main] INFO dk.netarkivet.harvester.harvesting.metadata.MetadataFileWriterWarc - /tmp/metadata5763384229338149559cdx 45001
14:19:20.378 [main] INFO dk.netarkivet.harvester.harvesting.metadata.MetadataFileWriterWarc - /tmp/metadata7269115006826225385cdx 45001
14:19:20.379 [main] INFO dk.netarkivet.harvester.harvesting.metadata.MetadataFileWriterWarc - /tmp/metadata3861062426292884875cdx 45001
14:19:20.381 [main] INFO dk.netarkivet.harvester.harvesting.metadata.MetadataFileWriterWarc - /tmp/metadata990046299536079934cdx 45001
14:19:20.382 [main] INFO dk.netarkivet.harvester.harvesting.metadata.MetadataFileWriterWarc - /tmp/metadata6703765633302653605cdx 45001
14:19:20.384 [main] INFO dk.netarkivet.harvester.harvesting.metadata.MetadataFileWriterWarc - /tmp/metadata8744949367513203172cdx 45001
14:19:20.384 [main] INFO dk.netarkivet.harvester.harvesting.metadata.MetadataFileWriterWarc - /tmp/metadata5759590044960228607cdx 45001
14:19:20.385 [main] INFO dk.netarkivet.harvester.harvesting.metadata.MetadataFileWriterWarc - /tmp/metadata1858978537179227199cdx 45001
14:19:20.387 [main] INFO dk.netarkivet.harvester.harvesting.metadata.MetadataFileWriterWarc - /tmp/metadata8990791407824108789cdx 45001
14:19:20.389 [main] INFO dk.netarkivet.harvester.harvesting.metadata.MetadataFileWriterWarc - /tmp/metadata4438838438448339132cdx 45001
14:19:20.390 [main] INFO dk.netarkivet.harvester.harvesting.metadata.MetadataFileWriterWarc - /tmp/metadata526502812922415793cdx 45001
14:19:20.391 [main] INFO dk.netarkivet.harvester.harvesting.metadata.MetadataFileWriterWarc - /tmp/metadata79065969696828317cdx 45001
14:19:20.392 [main] INFO dk.netarkivet.harvester.harvesting.metadata.MetadataFileWriterWarc - /tmp/metadata8841095841637753956cdx 45001
14:19:20.394 [main] INFO dk.netarkivet.harvester.harvesting.metadata.MetadataFileWriterWarc - /tmp/metadata7974355863964327487cdx 45001
14:19:20.394 [main] INFO dk.netarkivet.harvester.harvesting.metadata.MetadataFileWriterWarc - /tmp/metadata6834091286330725083cdx 45001
14:19:20.396 [main] INFO dk.netarkivet.harvester.harvesting.metadata.MetadataFileWriterWarc - /tmp/metadata4436589261157947517cdx 45001
14:19:20.397 [main] INFO dk.netarkivet.harvester.harvesting.metadata.MetadataFileWriterWarc - /tmp/metadata4969028201828607803cdx 45001
14:19:20.398 [main] INFO dk.netarkivet.harvester.harvesting.metadata.MetadataFileWriterWarc - /tmp/metadata3169324496622103518cdx 45001
14:19:20.400 [main] INFO dk.netarkivet.harvester.harvesting.metadata.MetadataFileWriterWarc - /tmp/metadata2426440571592996263cdx 45001
14:19:20.401 [main] INFO dk.netarkivet.harvester.harvesting.metadata.MetadataFileWriterWarc - /tmp/metadata5135388979676043231cdx 45001
14:19:20.403 [main] INFO dk.netarkivet.harvester.harvesting.metadata.MetadataFileWriterWarc - /tmp/metadata6865452354964348098cdx 45001
14:19:20.404 [main] INFO dk.netarkivet.harvester.harvesting.metadata.MetadataFileWriterWarc - /tmp/metadata6733311308806848959cdx 45001
14:19:20.406 [main] INFO dk.netarkivet.harvester.harvesting.metadata.MetadataFileWriterWarc - /tmp/metadata5105178538941120112cdx 45001
14:19:20.407 [main] INFO dk.netarkivet.harvester.harvesting.metadata.MetadataFileWriterWarc - /tmp/metadata9050309317689675429cdx 45001
14:19:20.409 [main] INFO dk.netarkivet.harvester.harvesting.metadata.MetadataFileWriterWarc - /tmp/metadata6746841582033405669cdx 45001
14:19:20.410 [main] INFO dk.netarkivet.harvester.harvesting.metadata.MetadataFileWriterWarc - /tmp/metadata6102159344210303157cdx 45001
14:19:20.410 [main] INFO dk.netarkivet.harvester.harvesting.metadata.MetadataFileWriterWarc - /tmp/metadata3230494935034195491cdx 45001
14:19:20.412 [main] INFO dk.netarkivet.harvester.harvesting.metadata.MetadataFileWriterWarc - /tmp/metadata6148144121531686645cdx 45001
14:19:20.413 [main] INFO dk.netarkivet.harvester.harvesting.metadata.MetadataFileWriterWarc - /tmp/metadata8524681195945937687cdx 45001
14:19:20.414 [main] INFO dk.netarkivet.harvester.harvesting.metadata.MetadataFileWriterWarc - /tmp/metadata438573678797142306cdx 45001
14:19:20.416 [main] INFO dk.netarkivet.harvester.harvesting.metadata.MetadataFileWriterWarc - /tmp/metadata1198422653171350511cdx 45001
14:19:20.418 [main] INFO dk.netarkivet.harvester.harvesting.metadata.MetadataFileWriterWarc - /tmp/metadata2597190772132641997cdx 45001
14:19:20.419 [main] INFO dk.netarkivet.harvester.harvesting.metadata.MetadataFileWriterWarc - /tmp/metadata2492995676700662794cdx 45001
14:19:20.419 [main] INFO dk.netarkivet.harvester.harvesting.metadata.MetadataFileWriterWarc - /tmp/metadata894802147573976622cdx 45001
14:19:20.421 [main] INFO dk.netarkivet.harvester.harvesting.metadata.MetadataFileWriterWarc - /tmp/metadata847310681291152988cdx 45001
14:19:20.422 [main] INFO dk.netarkivet.harvester.harvesting.metadata.MetadataFileWriterWarc - /tmp/metadata6100810021727092192cdx 45001
14:19:20.424 [main] INFO dk.netarkivet.harvester.harvesting.metadata.MetadataFileWriterWarc - /tmp/metadata2221991715318098272cdx 45001
14:19:20.425 [main] INFO dk.netarkivet.harvester.harvesting.metadata.MetadataFileWriterWarc - /tmp/metadata5292430871412386588cdx 45001
14:19:20.426 [main] INFO dk.netarkivet.harvester.harvesting.metadata.MetadataFileWriterWarc - /tmp/metadata8713200231205063065cdx 45001
14:19:20.427 [main] INFO dk.netarkivet.harvester.harvesting.metadata.MetadataFileWriterWarc - /tmp/metadata5955297363962784975cdx 45001
14:19:20.428 [main] INFO dk.netarkivet.harvester.harvesting.metadata.MetadataFileWriterWarc - /tmp/metadata8000010909184743918cdx 45001
14:19:20.429 [main] INFO dk.netarkivet.harvester.harvesting.metadata.MetadataFileWriterWarc - /tmp/metadata5028388346607127432cdx 45001
14:19:20.431 [main] INFO dk.netarkivet.harvester.harvesting.metadata.MetadataFileWriterWarc - /tmp/metadata8398906815849638568cdx 45001
14:19:20.433 [main] INFO dk.netarkivet.harvester.harvesting.metadata.MetadataFileWriterWarc - /tmp/metadata7052348094777802213cdx 45001
14:19:20.436 [main] INFO dk.netarkivet.harvester.harvesting.metadata.MetadataFileWriterWarc - /tmp/metadata242158405312612377cdx 45001
14:19:20.436 [main] INFO dk.netarkivet.harvester.harvesting.metadata.MetadataFileWriterWarc - /tmp/metadata5052458858535376245cdx 45001
14:19:20.438 [main] INFO dk.netarkivet.harvester.harvesting.metadata.MetadataFileWriterWarc - /tmp/metadata1628600100462073428cdx 45001
14:19:20.439 [main] INFO dk.netarkivet.harvester.harvesting.metadata.MetadataFileWriterWarc - /tmp/metadata1312753252505816215cdx 45001
14:19:20.440 [main] INFO dk.netarkivet.harvester.harvesting.metadata.MetadataFileWriterWarc - /tmp/metadata2234029929676779430cdx 45001
14:19:20.442 [main] INFO dk.netarkivet.harvester.harvesting.metadata.MetadataFileWriterWarc - /tmp/metadata6866690747337470774cdx 45001
14:19:20.443 [main] INFO dk.netarkivet.harvester.harvesting.metadata.MetadataFileWriterWarc - /tmp/metadata4486222220078358985cdx 45001
14:19:20.444 [main] INFO dk.netarkivet.harvester.harvesting.metadata.MetadataFileWriterWarc - /tmp/metadata7384828042418624583cdx 45001
14:19:20.446 [main] INFO dk.netarkivet.harvester.harvesting.metadata.MetadataFileWriterWarc - /tmp/metadata7401096457386801472cdx 45001
14:19:20.446 [main] INFO dk.netarkivet.harvester.harvesting.metadata.MetadataFileWriterWarc - /tmp/metadata420484630364845427cdx 45001
14:19:20.448 [main] INFO dk.netarkivet.harvester.harvesting.metadata.MetadataFileWriterWarc - /tmp/metadata1290674988708753729cdx 45001
14:19:20.450 [main] INFO dk.netarkivet.harvester.harvesting.metadata.MetadataFileWriterWarc - /tmp/metadata3068343574465068255cdx 45001
14:19:20.451 [main] INFO dk.netarkivet.harvester.harvesting.metadata.MetadataFileWriterWarc - /tmp/metadata1555655930688265650cdx 45001
14:19:20.452 [main] INFO dk.netarkivet.harvester.harvesting.metadata.MetadataFileWriterWarc - /tmp/metadata4754201169556363910cdx 45001
14:19:20.453 [main] INFO dk.netarkivet.harvester.harvesting.metadata.MetadataFileWriterWarc - /tmp/metadata1741718146673020462cdx 45001
14:19:20.455 [main] INFO dk.netarkivet.harvester.harvesting.metadata.MetadataFileWriterWarc - /tmp/metadata6015882154401329972cdx 45001
14:19:20.455 [main] INFO dk.netarkivet.harvester.harvesting.metadata.MetadataFileWriterWarc - /tmp/metadata8894396143040213346cdx 45001
14:19:20.457 [main] INFO dk.netarkivet.harvester.harvesting.metadata.MetadataFileWriterWarc - /tmp/metadata7796297701990802280cdx 45001
14:19:20.458 [main] INFO dk.netarkivet.harvester.harvesting.metadata.MetadataFileWriterWarc - /tmp/metadata1252094991714607024cdx 45001
14:19:20.460 [main] INFO dk.netarkivet.harvester.harvesting.metadata.MetadataFileWriterWarc - /tmp/metadata1183446610950386823cdx 45001
14:19:20.461 [main] INFO dk.netarkivet.harvester.harvesting.metadata.MetadataFileWriterWarc - /tmp/metadata6763255537989950486cdx 45001
14:19:20.462 [main] INFO dk.netarkivet.harvester.harvesting.metadata.MetadataFileWriterWarc - /tmp/metadata7393655503986041296cdx 45001
14:19:20.463 [main] INFO dk.netarkivet.harvester.harvesting.metadata.MetadataFileWriterWarc - /tmp/metadata8904518415233521174cdx 45001
14:19:20.465 [main] INFO dk.netarkivet.harvester.harvesting.metadata.MetadataFileWriterWarc - /tmp/metadata615696057885486481cdx 45001
14:19:20.465 [main] INFO dk.netarkivet.harvester.harvesting.metadata.MetadataFileWriterWarc - /tmp/metadata7423661571148373029cdx 45001
14:19:20.468 [main] INFO dk.netarkivet.harvester.harvesting.metadata.MetadataFileWriterWarc - /tmp/metadata4985888639754997641cdx 45001
14:19:20.468 [main] INFO dk.netarkivet.harvester.harvesting.metadata.MetadataFileWriterWarc - /tmp/metadata4697618273096838665cdx 45001
14:19:20.470 [main] INFO dk.netarkivet.harvester.harvesting.metadata.MetadataFileWriterWarc - /tmp/metadata2086949913449300730cdx 45001
14:19:20.471 [main] INFO dk.netarkivet.harvester.harvesting.metadata.MetadataFileWriterWarc - /tmp/metadata4365315848188727372cdx 45001
14:19:20.472 [main] INFO dk.netarkivet.harvester.harvesting.metadata.MetadataFileWriterWarc - /tmp/metadata3610553525170744607cdx 45001
14:19:20.474 [main] INFO dk.netarkivet.harvester.harvesting.metadata.MetadataFileWriterWarc - /tmp/metadata1116502835854771639cdx 45001
14:19:20.475 [main] INFO dk.netarkivet.harvester.harvesting.metadata.MetadataFileWriterWarc - /tmp/metadata5583636100939944777cdx 45001
14:19:20.476 [main] INFO dk.netarkivet.harvester.harvesting.metadata.MetadataFileWriterWarc - /tmp/metadata5324941639777895988cdx 45001
14:19:20.478 [main] INFO dk.netarkivet.harvester.harvesting.metadata.MetadataFileWriterWarc - /tmp/metadata2279590548177472763cdx 45001
14:19:20.479 [main] INFO dk.netarkivet.harvester.harvesting.metadata.MetadataFileWriterWarc - /tmp/metadata60043158929369175cdx 45001
14:19:20.481 [main] INFO dk.netarkivet.harvester.harvesting.metadata.MetadataFileWriterWarc - /tmp/metadata8124610655185134003cdx 45001
14:19:20.481 [main] INFO dk.netarkivet.harvester.harvesting.metadata.MetadataFileWriterWarc - /tmp/metadata3847854064903900861cdx 45001
14:19:20.482 [main] INFO dk.netarkivet.harvester.harvesting.metadata.MetadataFileWriterWarc - /tmp/metadata7054044281437472400cdx 45001
14:19:20.484 [main] INFO dk.netarkivet.harvester.harvesting.metadata.MetadataFileWriterWarc - /tmp/metadata3503584977696021118cdx 45001
14:19:20.485 [main] INFO dk.netarkivet.harvester.harvesting.metadata.MetadataFileWriterWarc - /tmp/metadata212328704908825231cdx 45001
14:19:20.487 [main] INFO dk.netarkivet.harvester.harvesting.metadata.MetadataFileWriterWarc - /tmp/metadata7737727171447056938cdx 45001
14:19:20.488 [main] INFO dk.netarkivet.harvester.harvesting.metadata.MetadataFileWriterWarc - /tmp/metadata7993733815126707361cdx 45001
14:19:20.489 [main] INFO dk.netarkivet.harvester.harvesting.metadata.MetadataFileWriterWarc - /tmp/metadata8569330179989489198cdx 45001
14:19:20.491 [main] INFO dk.netarkivet.harvester.harvesting.metadata.MetadataFileWriterWarc - /tmp/metadata5514070857382050258cdx 45001
14:19:20.491 [main] INFO dk.netarkivet.harvester.harvesting.metadata.MetadataFileWriterWarc - /tmp/metadata5929105675287478382cdx 45001
14:19:20.493 [main] INFO dk.netarkivet.harvester.harvesting.metadata.MetadataFileWriterWarc - /tmp/metadata579930683751065988cdx 45001
14:19:20.495 [main] INFO dk.netarkivet.harvester.harvesting.metadata.MetadataFileWriterWarc - /tmp/metadata4405194886261330120cdx 45001
14:19:20.568 [main] INFO dk.netarkivet.harvester.harvesting.metadata.MetadataFileWriterArc - Writing file '/home/cibuild02/workspace/NetarchiveSuite-Full-Test-staging/harvester/harvester-core/target/test-classes/crawldir/logs/runtime-errors.log' to ARC file: 0
14:19:20.571 [main] INFO dk.netarkivet.harvester.harvesting.metadata.MetadataFileWriterArc - Writing file '/home/cibuild02/workspace/NetarchiveSuite-Full-Test-staging/harvester/harvester-core/target/test-classes/crawldir/logs/local-errors.log' to ARC file: 2121
14:19:20.571 [main] INFO dk.netarkivet.harvester.harvesting.metadata.MetadataFileWriterArc - Writing file '/home/cibuild02/workspace/NetarchiveSuite-Full-Test-staging/harvester/harvester-core/target/test-classes/crawldir/logs/recover.gz' to ARC file: 4594
14:19:20.572 [main] INFO dk.netarkivet.harvester.harvesting.metadata.MetadataFileWriterArc - Writing file '/home/cibuild02/workspace/NetarchiveSuite-Full-Test-staging/harvester/harvester-core/target/test-classes/crawldir/logs/uri-errors.log' to ARC file: 2827
14:19:20.572 [main] INFO dk.netarkivet.harvester.harvesting.metadata.MetadataFileWriterArc - Writing file '/home/cibuild02/workspace/NetarchiveSuite-Full-Test-staging/harvester/harvester-core/target/test-classes/crawldir/logs/crawl.log' to ARC file: 14863
14:19:20.573 [main] INFO dk.netarkivet.harvester.harvesting.metadata.MetadataFileWriterArc - Writing file '/home/cibuild02/workspace/NetarchiveSuite-Full-Test-staging/harvester/harvester-core/target/test-classes/crawldir/logs/progress-statistics.log' to ARC file: 821
Tests run: 3, Failures: 0, Errors: 0, Skipped: 0, Time elapsed: 20.001 sec - in dk.netarkivet.harvester.harvesting.metadata.MetadataFileWriterTester
Running dk.netarkivet.harvester.datamodel.DomainConfigurationTest
14:19:21.144 [main] DEBUG dk.netarkivet.harvester.datamodel.DomainConfiguration - Cannot add password dk.netarkivet.harvester.datamodel.Password@71680a08 to Configuration 'defaultdomain.org' of domain 'defaultdomain.org' as it differs from the one defined for Mock for Domain, hashCode: 1876848389: dk.netarkivet.harvester.datamodel.Password@c2731a39
-------
14:19:21.190 [main] DEBUG dk.netarkivet.harvester.datamodel.DomainConfiguration - Cannot add seedlist default-domain.org: [other-domain.org] to Configuration 'defaultdomain.org' of domain 'defaultdomain.org' as it differs from the one defined for Mock for Domain, hashCode: 1897195392: default-domain.org: [default-domain.org]
14:19:21.228 [main] DEBUG dk.netarkivet.harvester.datamodel.DomainConfiguration - Cannot add seedlist default-domain.org: [default-domain.org] to Configuration 'defaultdomain.org' of domain 'defaultdomain.org' as it differs from the one defined for Mock for Domain, hashCode: 1442526942: null
Tests run: 21, Failures: 0, Errors: 0, Skipped: 0, Time elapsed: 0.658 sec - in dk.netarkivet.harvester.datamodel.DomainConfigurationTest
Running dk.netarkivet.harvester.datamodel.H3HeritrixTemplateTester
Tests run: 4, Failures: 0, Errors: 0, Skipped: 0, Time elapsed: 0.269 sec - in dk.netarkivet.harvester.datamodel.H3HeritrixTemplateTester
Running dk.netarkivet.harvester.datamodel.JobTest
14:19:22.198 [main] DEBUG dk.netarkivet.harvester.datamodel.H1HeritrixTemplate - WARC format selected to be used by Heritrix
14:19:22.286 [main] WARN dk.netarkivet.harvester.datamodel.H1HeritrixTemplate - No attribute insertion is done for H1 templates
14:19:22.294 [main] DEBUG dk.netarkivet.harvester.datamodel.H1HeritrixTemplate - In H1 templates we don't enable/disable deduplication.
14:19:22.294 [main] DEBUG dk.netarkivet.harvester.datamodel.Job - Status change from DONE to NEW is not allowed
14:19:22.374 [main] DEBUG dk.netarkivet.harvester.datamodel.H1HeritrixTemplate - WARC format selected to be used by Heritrix
14:19:22.430 [main] WARN dk.netarkivet.harvester.datamodel.H1HeritrixTemplate - No attribute insertion is done for H1 templates
14:19:22.434 [main] DEBUG dk.netarkivet.harvester.datamodel.H1HeritrixTemplate - In H1 templates we don't enable/disable deduplication.
14:19:22.494 [main] DEBUG dk.netarkivet.harvester.datamodel.H1HeritrixTemplate - WARC format selected to be used by Heritrix
14:19:22.552 [main] WARN dk.netarkivet.harvester.datamodel.H1HeritrixTemplate - No attribute insertion is done for H1 templates
14:19:22.554 [main] DEBUG dk.netarkivet.harvester.datamodel.H1HeritrixTemplate - In H1 templates we don't enable/disable deduplication.
14:19:22.614 [main] DEBUG dk.netarkivet.harvester.datamodel.H1HeritrixTemplate - WARC format selected to be used by Heritrix
14:19:22.666 [main] WARN dk.netarkivet.harvester.datamodel.H1HeritrixTemplate - No attribute insertion is done for H1 templates
14:19:22.667 [main] DEBUG dk.netarkivet.harvester.datamodel.H1HeritrixTemplate - In H1 templates we don't enable/disable deduplication.
14:19:22.719 [main] DEBUG dk.netarkivet.harvester.datamodel.H1HeritrixTemplate - WARC format selected to be used by Heritrix
14:19:22.763 [main] WARN dk.netarkivet.harvester.datamodel.H1HeritrixTemplate - No attribute insertion is done for H1 templates
14:19:22.766 [main] DEBUG dk.netarkivet.harvester.datamodel.H1HeritrixTemplate - In H1 templates we don't enable/disable deduplication.
14:19:22.823 [main] DEBUG dk.netarkivet.harvester.datamodel.H1HeritrixTemplate - WARC format selected to be used by Heritrix
14:19:22.868 [main] WARN dk.netarkivet.harvester.datamodel.H1HeritrixTemplate - No attribute insertion is done for H1 templates
14:19:22.869 [main] DEBUG dk.netarkivet.harvester.datamodel.H1HeritrixTemplate - In H1 templates we don't enable/disable deduplication.
14:19:22.974 [main] DEBUG dk.netarkivet.harvester.datamodel.H1HeritrixTemplate - WARC format selected to be used by Heritrix
14:19:23.005 [main] WARN dk.netarkivet.harvester.datamodel.H1HeritrixTemplate - No attribute insertion is done for H1 templates
14:19:23.010 [main] DEBUG dk.netarkivet.harvester.datamodel.H1HeritrixTemplate - In H1 templates we don't enable/disable deduplication.
14:19:23.011 [main] WARN dk.netarkivet.harvester.datamodel.Job - Job(null): actualStart should be defined before setting actualStop
14:19:23.055 [main] DEBUG dk.netarkivet.harvester.datamodel.Job - forceMaxObjectsPerDomain must be either -1 or positive
14:19:23.268 [main] DEBUG dk.netarkivet.harvester.datamodel.H1HeritrixTemplate - WARC format selected to be used by Heritrix
14:19:23.317 [main] WARN dk.netarkivet.harvester.datamodel.H1HeritrixTemplate - No attribute insertion is done for H1 templates
14:19:23.322 [main] DEBUG dk.netarkivet.harvester.datamodel.H1HeritrixTemplate - In H1 templates we don't enable/disable deduplication.
14:19:23.382 [main] DEBUG dk.netarkivet.harvester.datamodel.H1HeritrixTemplate - WARC format selected to be used by Heritrix
14:19:23.414 [main] WARN dk.netarkivet.harvester.datamodel.H1HeritrixTemplate - No attribute insertion is done for H1 templates
14:19:23.417 [main] DEBUG dk.netarkivet.harvester.datamodel.H1HeritrixTemplate - In H1 templates we don't enable/disable deduplication.
14:19:23.471 [main] DEBUG dk.netarkivet.harvester.datamodel.H1HeritrixTemplate - WARC format selected to be used by Heritrix
14:19:23.500 [main] WARN dk.netarkivet.harvester.datamodel.H1HeritrixTemplate - No attribute insertion is done for H1 templates
14:19:23.504 [main] DEBUG dk.netarkivet.harvester.datamodel.H1HeritrixTemplate - In H1 templates we don't enable/disable deduplication.
14:19:23.616 [main] DEBUG dk.netarkivet.harvester.datamodel.H1HeritrixTemplate - WARC format selected to be used by Heritrix
14:19:23.646 [main] WARN dk.netarkivet.harvester.datamodel.H1HeritrixTemplate - No attribute insertion is done for H1 templates
14:19:23.648 [main] DEBUG dk.netarkivet.harvester.datamodel.H1HeritrixTemplate - In H1 templates we don't enable/disable deduplication.
14:19:23.697 [main] DEBUG dk.netarkivet.harvester.datamodel.H1HeritrixTemplate - WARC format selected to be used by Heritrix
14:19:23.729 [main] WARN dk.netarkivet.harvester.datamodel.H1HeritrixTemplate - No attribute insertion is done for H1 templates
14:19:23.733 [main] DEBUG dk.netarkivet.harvester.datamodel.H1HeritrixTemplate - In H1 templates we don't enable/disable deduplication.
14:19:23.796 [main] DEBUG dk.netarkivet.harvester.datamodel.H1HeritrixTemplate - WARC format selected to be used by Heritrix
14:19:23.827 [main] WARN dk.netarkivet.harvester.datamodel.H1HeritrixTemplate - No attribute insertion is done for H1 templates
14:19:23.827 [main] DEBUG dk.netarkivet.harvester.datamodel.H1HeritrixTemplate - In H1 templates we don't enable/disable deduplication.
14:19:23.889 [main] DEBUG dk.netarkivet.harvester.datamodel.H1HeritrixTemplate - WARC format selected to be used by Heritrix
14:19:23.921 [main] WARN dk.netarkivet.harvester.datamodel.H1HeritrixTemplate - No attribute insertion is done for H1 templates
14:19:23.925 [main] DEBUG dk.netarkivet.harvester.datamodel.H1HeritrixTemplate - In H1 templates we don't enable/disable deduplication.
14:19:23.926 [main] INFO dk.netarkivet.harvester.datamodel.HeritrixTemplate - Inserting 2 crawlertraps for domain 'otherDomain.org' into the template
14:19:23.983 [main] DEBUG dk.netarkivet.harvester.datamodel.H1HeritrixTemplate - WARC format selected to be used by Heritrix
14:19:24.019 [main] WARN dk.netarkivet.harvester.datamodel.H1HeritrixTemplate - No attribute insertion is done for H1 templates
14:19:24.019 [main] DEBUG dk.netarkivet.harvester.datamodel.H1HeritrixTemplate - In H1 templates we don't enable/disable deduplication.
14:19:24.071 [main] DEBUG dk.netarkivet.harvester.datamodel.H1HeritrixTemplate - WARC format selected to be used by Heritrix
14:19:24.105 [main] WARN dk.netarkivet.harvester.datamodel.H1HeritrixTemplate - No attribute insertion is done for H1 templates
14:19:24.105 [main] DEBUG dk.netarkivet.harvester.datamodel.H1HeritrixTemplate - In H1 templates we don't enable/disable deduplication.
14:19:24.152 [main] DEBUG dk.netarkivet.harvester.datamodel.H1HeritrixTemplate - WARC format selected to be used by Heritrix
14:19:24.184 [main] WARN dk.netarkivet.harvester.datamodel.H1HeritrixTemplate - No attribute insertion is done for H1 templates
14:19:24.188 [main] DEBUG dk.netarkivet.harvester.datamodel.H1HeritrixTemplate - In H1 templates we don't enable/disable deduplication.
14:19:24.242 [main] DEBUG dk.netarkivet.harvester.datamodel.H1HeritrixTemplate - WARC format selected to be used by Heritrix
14:19:24.267 [main] WARN dk.netarkivet.harvester.datamodel.H1HeritrixTemplate - No attribute insertion is done for H1 templates
14:19:24.270 [main] DEBUG dk.netarkivet.harvester.datamodel.H1HeritrixTemplate - In H1 templates we don't enable/disable deduplication.
14:19:24.701 [main] DEBUG dk.netarkivet.harvester.datamodel.H1HeritrixTemplate - WARC format selected to be used by Heritrix
14:19:24.738 [main] WARN dk.netarkivet.harvester.datamodel.H1HeritrixTemplate - No attribute insertion is done for H1 templates
14:19:24.739 [main] DEBUG dk.netarkivet.harvester.datamodel.H1HeritrixTemplate - In H1 templates we don't enable/disable deduplication.
14:19:24.747 [main] WARN dk.netarkivet.harvester.datamodel.Job - Job(null): actualStop (Thu Jan 01 01:00:00 CET 1970) is before actualStart: Thu Jan 01 01:00:00 CET 1970
14:19:24.804 [main] DEBUG dk.netarkivet.harvester.datamodel.H1HeritrixTemplate - WARC format selected to be used by Heritrix
14:19:24.833 [main] WARN dk.netarkivet.harvester.datamodel.H1HeritrixTemplate - No attribute insertion is done for H1 templates
14:19:24.837 [main] DEBUG dk.netarkivet.harvester.datamodel.H1HeritrixTemplate - In H1 templates we don't enable/disable deduplication.
14:19:24.896 [main] DEBUG dk.netarkivet.harvester.datamodel.H1HeritrixTemplate - WARC format selected to be used by Heritrix
14:19:24.929 [main] WARN dk.netarkivet.harvester.datamodel.H1HeritrixTemplate - No attribute insertion is done for H1 templates
14:19:24.930 [main] DEBUG dk.netarkivet.harvester.datamodel.H1HeritrixTemplate - In H1 templates we don't enable/disable deduplication.
14:19:24.987 [main] DEBUG dk.netarkivet.harvester.datamodel.H1HeritrixTemplate - WARC format selected to be used by Heritrix
14:19:25.024 [main] WARN dk.netarkivet.harvester.datamodel.H1HeritrixTemplate - No attribute insertion is done for H1 templates
14:19:25.025 [main] DEBUG dk.netarkivet.harvester.datamodel.H1HeritrixTemplate - In H1 templates we don't enable/disable deduplication.
14:19:25.095 [main] DEBUG dk.netarkivet.harvester.datamodel.H1HeritrixTemplate - WARC format selected to be used by Heritrix
14:19:25.124 [main] WARN dk.netarkivet.harvester.datamodel.H1HeritrixTemplate - No attribute insertion is done for H1 templates
14:19:25.128 [main] DEBUG dk.netarkivet.harvester.datamodel.H1HeritrixTemplate - In H1 templates we don't enable/disable deduplication.
14:19:25.190 [main] DEBUG dk.netarkivet.harvester.datamodel.H1HeritrixTemplate - WARC format selected to be used by Heritrix
14:19:25.225 [main] WARN dk.netarkivet.harvester.datamodel.H1HeritrixTemplate - No attribute insertion is done for H1 templates
14:19:25.226 [main] DEBUG dk.netarkivet.harvester.datamodel.H1HeritrixTemplate - In H1 templates we don't enable/disable deduplication.
14:19:25.296 [main] DEBUG dk.netarkivet.harvester.datamodel.Job - forceMaxBytesPerDomain must be either -1 or positive
Tests run: 34, Failures: 0, Errors: 0, Skipped: 0, Time elapsed: 3.788 sec - in dk.netarkivet.harvester.datamodel.JobTest
Running dk.netarkivet.harvester.datamodel.TimeUnitTest
Tests run: 1, Failures: 0, Errors: 0, Skipped: 0, Time elapsed: 0.006 sec - in dk.netarkivet.harvester.datamodel.TimeUnitTest
Running dk.netarkivet.harvester.datamodel.eav.TestEAV
Tests run: 1, Failures: 0, Errors: 0, Skipped: 0, Time elapsed: 0.011 sec - in dk.netarkivet.harvester.datamodel.eav.TestEAV

Results :

Tests run: 64, Failures: 0, Errors: 0, Skipped: 0

[JENKINS] Recording test results
[INFO] 
[INFO] --- maven-jgit-buildnumber-plugin:1.2.9:extract-buildnumber (git-buildnumber) @ harvester-core ---
[INFO] 
[INFO] --- maven-jar-plugin:2.4:jar (default-jar) @ harvester-core ---
[INFO] Building jar: /home/cibuild02/workspace/NetarchiveSuite-Full-Test-staging/harvester/harvester-core/target/harvester-core-5.4.3-SNAPSHOT.jar
[INFO] 
[INFO] --- maven-jar-plugin:2.4:test-jar (default) @ harvester-core ---
[INFO] Building jar: /home/cibuild02/workspace/NetarchiveSuite-Full-Test-staging/harvester/harvester-core/target/harvester-core-5.4.3-SNAPSHOT-tests.jar
[INFO] 
[INFO] >>> maven-source-plugin:2.2.1:jar (attach-sources) > generate-sources @ harvester-core >>>
[INFO] 
[INFO] --- jacoco-maven-plugin:0.7.9:prepare-agent (agent) @ harvester-core ---
[INFO] argLine set to -javaagent:/home/cibuild02/.m2/repository/org/jacoco/org.jacoco.agent/0.7.9/org.jacoco.agent-0.7.9-runtime.jar=destfile=/home/cibuild02/workspace/NetarchiveSuite-Full-Test-staging/harvester/harvester-core/../target/jacoco.exec,append=true
[WARNING] Failed to getClass for org.apache.maven.plugin.source.SourceJarMojo
[INFO] 
[INFO] <<< maven-source-plugin:2.2.1:jar (attach-sources) < generate-sources @ harvester-core <<<
[INFO] 
[INFO] --- maven-source-plugin:2.2.1:jar (attach-sources) @ harvester-core ---
[INFO] Building jar: /home/cibuild02/workspace/NetarchiveSuite-Full-Test-staging/harvester/harvester-core/target/harvester-core-5.4.3-SNAPSHOT-sources.jar
[INFO] 
[INFO] --- maven-javadoc-plugin:2.10.3:jar (attach-javadocs) @ harvester-core ---
[ERROR] Error fetching link: /home/cibuild02/workspace/NetarchiveSuite-Full-Test-staging/common/common-core/target/apidocs/package-list. Ignored it.
[ERROR] Error fetching link: /home/cibuild02/workspace/NetarchiveSuite-Full-Test-staging/common/common-test/target/apidocs/package-list. Ignored it.
[INFO] 
45 warnings
[WARNING] Javadoc Warnings
[WARNING] /home/cibuild02/workspace/NetarchiveSuite-Full-Test-staging/harvester/harvester-core/src/main/java/dk/netarkivet/harvester/HarvesterSettings.java:198: warning - Tag @link: reference not found: DefaultJobGenerator
[WARNING] /home/cibuild02/workspace/NetarchiveSuite-Full-Test-staging/harvester/harvester-core/src/main/java/dk/netarkivet/harvester/HarvesterSettings.java:198: warning - Tag @link: reference not found: FixedDomainConfigurationCountJobGenerator
[WARNING] /home/cibuild02/workspace/NetarchiveSuite-Full-Test-staging/harvester/harvester-core/src/main/java/dk/netarkivet/harvester/HarvesterSettings.java:183: warning - Tag @link: reference not found: FixedDomainConfigurationCountJobGenerator
[WARNING] /home/cibuild02/workspace/NetarchiveSuite-Full-Test-staging/harvester/harvester-core/src/main/java/dk/netarkivet/harvester/HarvesterSettings.java:168: warning - Tag @link: reference not found: FixedDomainConfigurationCountJobGenerator
[WARNING] /home/cibuild02/workspace/NetarchiveSuite-Full-Test-staging/harvester/harvester-core/src/main/java/dk/netarkivet/harvester/HarvesterSettings.java:175: warning - Tag @link: reference not found: FixedDomainConfigurationCountJobGenerator
[WARNING] /home/cibuild02/workspace/NetarchiveSuite-Full-Test-staging/harvester/harvester-core/src/main/java/dk/netarkivet/harvester/HarvesterSettings.java:330: warning - Tag @link: reference not found: JobDispatcher
[WARNING] /home/cibuild02/workspace/NetarchiveSuite-Full-Test-staging/harvester/harvester-core/src/main/java/dk/netarkivet/harvester/HarvesterSettings.java:168: warning - Tag @link: reference not found: FixedDomainConfigurationCountJobGenerator
[WARNING] /home/cibuild02/workspace/NetarchiveSuite-Full-Test-staging/harvester/harvester-core/src/main/java/dk/netarkivet/harvester/HarvesterSettings.java:175: warning - Tag @link: reference not found: FixedDomainConfigurationCountJobGenerator
[WARNING] /home/cibuild02/workspace/NetarchiveSuite-Full-Test-staging/harvester/harvester-core/src/main/java/dk/netarkivet/harvester/HarvesterSettings.java:183: warning - Tag @link: reference not found: FixedDomainConfigurationCountJobGenerator
[WARNING] /home/cibuild02/workspace/NetarchiveSuite-Full-Test-staging/harvester/harvester-core/src/main/java/dk/netarkivet/harvester/HarvesterSettings.java:198: warning - Tag @link: reference not found: DefaultJobGenerator
[WARNING] /home/cibuild02/workspace/NetarchiveSuite-Full-Test-staging/harvester/harvester-core/src/main/java/dk/netarkivet/harvester/HarvesterSettings.java:198: warning - Tag @link: reference not found: FixedDomainConfigurationCountJobGenerator
[WARNING] /home/cibuild02/workspace/NetarchiveSuite-Full-Test-staging/harvester/harvester-core/src/main/java/dk/netarkivet/harvester/HarvesterSettings.java:198: warning - Tag @link: reference not found: DefaultJobGenerator
[WARNING] /home/cibuild02/workspace/NetarchiveSuite-Full-Test-staging/harvester/harvester-core/src/main/java/dk/netarkivet/harvester/HarvesterSettings.java:330: warning - Tag @link: reference not found: JobDispatcher
[WARNING] /home/cibuild02/workspace/NetarchiveSuite-Full-Test-staging/harvester/harvester-core/src/main/java/dk/netarkivet/harvester/HarvesterSettings.java:363: warning - Tag @link: reference not found: TopTotalEnqueuesFilter
[WARNING] /home/cibuild02/workspace/NetarchiveSuite-Full-Test-staging/harvester/harvester-core/src/main/java/dk/netarkivet/harvester/HarvesterSettings.java:379: warning - Tag @see: reference not found: BnfHeritrixController
[WARNING] /home/cibuild02/workspace/NetarchiveSuite-Full-Test-staging/harvester/harvester-core/src/main/java/dk/netarkivet/harvester/HarvesterSettings.java:511: warning - Tag @see: reference not found: HarvestDocumentation#documentHarvest(dk.netarkivet.harvester.harvesting.IngestableFiles)
[WARNING] /home/cibuild02/workspace/NetarchiveSuite-Full-Test-staging/harvester/harvester-core/src/main/java/dk/netarkivet/harvester/HarvesterSettings.java:520: warning - Tag @see: reference not found: HarvestDocumentation#documentHarvest(dk.netarkivet.harvester.harvesting.IngestableFiles)
[WARNING] /home/cibuild02/workspace/NetarchiveSuite-Full-Test-staging/harvester/harvester-core/src/main/java/dk/netarkivet/harvester/HarvesterSettings.java:529: warning - Tag @see: reference not found: HarvestDocumentation#documentHarvest(dk.netarkivet.harvester.harvesting.IngestableFiles)
[WARNING] /home/cibuild02/workspace/NetarchiveSuite-Full-Test-staging/harvester/harvester-core/src/main/java/dk/netarkivet/harvester/tools/dummy/HarvestControllerApplication.java:10: warning - Tag @see: reference not found: HarvestControllerServer
[WARNING] /home/cibuild02/workspace/NetarchiveSuite-Full-Test-staging/harvester/harvester-core/src/main/java/dk/netarkivet/harvester/harvesting/metadata/MetadataFileWriter.java:203: warning - Tag @see: reference not found: org.archive.io.arc.ARCWriter#write(String uri, String contentType, String hostIP, long fetchBeginTimeStamp,
[WARNING] long recordLength, InputStream in)
[WARNING] /home/cibuild02/workspace/NetarchiveSuite-Full-Test-staging/harvester/harvester-core/src/main/java/dk/netarkivet/harvester/harvesting/metadata/MetadataFileWriter.java:203: warning - Tag @see: reference not found: org.archive.io.arc.ARCWriter#write(String uri, String contentType, String hostIP, long fetchBeginTimeStamp,
[WARNING] long recordLength, InputStream in)
[WARNING] /home/cibuild02/workspace/NetarchiveSuite-Full-Test-staging/harvester/harvester-core/src/main/java/dk/netarkivet/harvester/harvesting/metadata/MetadataFileWriter.java:203: warning - Tag @see: reference not found: org.archive.io.arc.ARCWriter#write(String uri, String contentType, String hostIP, long fetchBeginTimeStamp,
[WARNING] long recordLength, InputStream in)
[WARNING] /home/cibuild02/workspace/NetarchiveSuite-Full-Test-staging/harvester/harvester-core/src/main/java/dk/netarkivet/harvester/harvesting/monitor/HarvestMonitor.java:234: warning - @param argument "limit" is not a parameter name.
[WARNING] /home/cibuild02/workspace/NetarchiveSuite-Full-Test-staging/harvester/harvester-core/src/main/java/dk/netarkivet/harvester/harvesting/monitor/HarvestMonitor.java:253: warning - @param argument "limit" is not a parameter name.
[WARNING] /home/cibuild02/workspace/NetarchiveSuite-Full-Test-staging/harvester/harvester-core/src/main/java/dk/netarkivet/harvester/harvesting/report/LegacyHarvestReport.java:55: warning - @dsr is an unknown tag.
[WARNING] /home/cibuild02/workspace/NetarchiveSuite-Full-Test-staging/harvester/harvester-core/src/main/java/dk/netarkivet/harvester/harvesting/frontier/FullFrontierReport.java:392: warning - @param argument "contentsAsString" is not a parameter name.
[WARNING] /home/cibuild02/workspace/NetarchiveSuite-Full-Test-staging/harvester/harvester-core/src/main/java/dk/netarkivet/harvester/datamodel/PartialHarvest.java:293: warning - Tag @see: can't find addConfigurations(PageContext, I18n, String) in dk.netarkivet.harvester.webinterface.EventHarvestUtil
[WARNING] /home/cibuild02/workspace/NetarchiveSuite-Full-Test-staging/harvester/harvester-core/src/main/java/dk/netarkivet/harvester/datamodel/eav/EAV.java:105: warning - @return tag has no arguments.
[WARNING] /home/cibuild02/workspace/NetarchiveSuite-Full-Test-staging/harvester/harvester-core/src/main/java/dk/netarkivet/harvester/webinterface/DomainDefinition.java:421: warning - @return tag cannot be used in method with void return type.
[WARNING] /home/cibuild02/workspace/NetarchiveSuite-Full-Test-staging/harvester/harvester-core/src/main/java/dk/netarkivet/harvester/harvesting/frontier/FrontierReportLine.java:94: warning - Tag @see:illegal character: "58" in "https://webarchive.jira.com/wiki/display/Heritrix/Precedence+Feature+Notes"
[WARNING] /home/cibuild02/workspace/NetarchiveSuite-Full-Test-staging/harvester/harvester-core/src/main/java/dk/netarkivet/harvester/harvesting/frontier/FrontierReportLine.java:94: warning - Tag @see:illegal character: "47" in "https://webarchive.jira.com/wiki/display/Heritrix/Precedence+Feature+Notes"
[WARNING] /home/cibuild02/workspace/NetarchiveSuite-Full-Test-staging/harvester/harvester-core/src/main/java/dk/netarkivet/harvester/harvesting/frontier/FrontierReportLine.java:94: warning - Tag @see:illegal character: "47" in "https://webarchive.jira.com/wiki/display/Heritrix/Precedence+Feature+Notes"
[WARNING] /home/cibuild02/workspace/NetarchiveSuite-Full-Test-staging/harvester/harvester-core/src/main/java/dk/netarkivet/harvester/harvesting/frontier/FrontierReportLine.java:94: warning - Tag @see:illegal character: "47" in "https://webarchive.jira.com/wiki/display/Heritrix/Precedence+Feature+Notes"
[WARNING] /home/cibuild02/workspace/NetarchiveSuite-Full-Test-staging/harvester/harvester-core/src/main/java/dk/netarkivet/harvester/harvesting/frontier/FrontierReportLine.java:94: warning - Tag @see:illegal character: "47" in "https://webarchive.jira.com/wiki/display/Heritrix/Precedence+Feature+Notes"
[WARNING] /home/cibuild02/workspace/NetarchiveSuite-Full-Test-staging/harvester/harvester-core/src/main/java/dk/netarkivet/harvester/harvesting/frontier/FrontierReportLine.java:94: warning - Tag @see:illegal character: "47" in "https://webarchive.jira.com/wiki/display/Heritrix/Precedence+Feature+Notes"
[WARNING] /home/cibuild02/workspace/NetarchiveSuite-Full-Test-staging/harvester/harvester-core/src/main/java/dk/netarkivet/harvester/harvesting/frontier/FrontierReportLine.java:94: warning - Tag @see:illegal character: "47" in "https://webarchive.jira.com/wiki/display/Heritrix/Precedence+Feature+Notes"
[WARNING] /home/cibuild02/workspace/NetarchiveSuite-Full-Test-staging/harvester/harvester-core/src/main/java/dk/netarkivet/harvester/harvesting/frontier/FrontierReportLine.java:94: warning - Tag @see:illegal character: "43" in "https://webarchive.jira.com/wiki/display/Heritrix/Precedence+Feature+Notes"
[WARNING] /home/cibuild02/workspace/NetarchiveSuite-Full-Test-staging/harvester/harvester-core/src/main/java/dk/netarkivet/harvester/harvesting/frontier/FrontierReportLine.java:94: warning - Tag @see:illegal character: "43" in "https://webarchive.jira.com/wiki/display/Heritrix/Precedence+Feature+Notes"
[WARNING] /home/cibuild02/workspace/NetarchiveSuite-Full-Test-staging/harvester/harvester-core/src/main/java/dk/netarkivet/harvester/harvesting/frontier/FrontierReportLine.java:94: warning - Tag @see: reference not found: https://webarchive.jira.com/wiki/display/Heritrix/Precedence+Feature+Notes
[WARNING] /home/cibuild02/workspace/NetarchiveSuite-Full-Test-staging/harvester/harvester-core/src/main/java/dk/netarkivet/harvester/HarvesterSettings.java:198: warning - Tag @link: reference not found: DefaultJobGenerator
[WARNING] /home/cibuild02/workspace/NetarchiveSuite-Full-Test-staging/harvester/harvester-core/src/main/java/dk/netarkivet/harvester/HarvesterSettings.java:198: warning - Tag @link: reference not found: FixedDomainConfigurationCountJobGenerator
[WARNING] /home/cibuild02/workspace/NetarchiveSuite-Full-Test-staging/harvester/harvester-core/src/main/java/dk/netarkivet/harvester/HarvesterSettings.java:183: warning - Tag @link: reference not found: FixedDomainConfigurationCountJobGenerator
[WARNING] /home/cibuild02/workspace/NetarchiveSuite-Full-Test-staging/harvester/harvester-core/src/main/java/dk/netarkivet/harvester/HarvesterSettings.java:168: warning - Tag @link: reference not found: FixedDomainConfigurationCountJobGenerator
[WARNING] /home/cibuild02/workspace/NetarchiveSuite-Full-Test-staging/harvester/harvester-core/src/main/java/dk/netarkivet/harvester/HarvesterSettings.java:175: warning - Tag @link: reference not found: FixedDomainConfigurationCountJobGenerator
[WARNING] /home/cibuild02/workspace/NetarchiveSuite-Full-Test-staging/harvester/harvester-core/src/main/java/dk/netarkivet/harvester/HarvesterSettings.java:330: warning - Tag @link: reference not found: JobDispatcher
[INFO] Building jar: /home/cibuild02/workspace/NetarchiveSuite-Full-Test-staging/harvester/harvester-core/target/harvester-core-5.4.3-SNAPSHOT-javadoc.jar
[INFO] 
[INFO] --- maven-install-plugin:2.4:install (default-install) @ harvester-core ---
[INFO] Installing /home/cibuild02/workspace/NetarchiveSuite-Full-Test-staging/harvester/harvester-core/target/harvester-core-5.4.3-SNAPSHOT.jar to /home/cibuild02/.m2/repository/org/netarchivesuite/harvester-core/5.4.3-SNAPSHOT/harvester-core-5.4.3-SNAPSHOT.jar
[INFO] Installing /home/cibuild02/workspace/NetarchiveSuite-Full-Test-staging/harvester/harvester-core/pom.xml to /home/cibuild02/.m2/repository/org/netarchivesuite/harvester-core/5.4.3-SNAPSHOT/harvester-core-5.4.3-SNAPSHOT.pom
[INFO] Installing /home/cibuild02/workspace/NetarchiveSuite-Full-Test-staging/harvester/harvester-core/target/harvester-core-5.4.3-SNAPSHOT-tests.jar to /home/cibuild02/.m2/repository/org/netarchivesuite/harvester-core/5.4.3-SNAPSHOT/harvester-core-5.4.3-SNAPSHOT-tests.jar
[INFO] Installing /home/cibuild02/workspace/NetarchiveSuite-Full-Test-staging/harvester/harvester-core/target/harvester-core-5.4.3-SNAPSHOT-sources.jar to /home/cibuild02/.m2/repository/org/netarchivesuite/harvester-core/5.4.3-SNAPSHOT/harvester-core-5.4.3-SNAPSHOT-sources.jar
[INFO] Installing /home/cibuild02/workspace/NetarchiveSuite-Full-Test-staging/harvester/harvester-core/target/harvester-core-5.4.3-SNAPSHOT-javadoc.jar to /home/cibuild02/.m2/repository/org/netarchivesuite/harvester-core/5.4.3-SNAPSHOT/harvester-core-5.4.3-SNAPSHOT-javadoc.jar
[INFO] 
[INFO] --- maven-clean-plugin:2.5:clean (default-clean) @ harvester-core ---
[INFO] Deleting /home/cibuild02/workspace/NetarchiveSuite-Full-Test-staging/harvester/harvester-core/target
[JENKINS] Archiving disabled
[INFO]                                                                         
[INFO] ------------------------------------------------------------------------
[INFO] Building NetarchiveSuite - archive - test 5.4.3-SNAPSHOT
[INFO] ------------------------------------------------------------------------
[INFO] 
[INFO] --- maven-clean-plugin:2.5:clean (default-clean) @ archive-test ---
[INFO] 
[INFO] --- jacoco-maven-plugin:0.7.9:prepare-agent (agent) @ archive-test ---
[INFO] argLine set to -javaagent:/home/cibuild02/.m2/repository/org/jacoco/org.jacoco.agent/0.7.9/org.jacoco.agent-0.7.9-runtime.jar=destfile=/home/cibuild02/workspace/NetarchiveSuite-Full-Test-staging/archive/archive-test/../target/jacoco.exec,append=true
[INFO] 
[INFO] --- maven-resources-plugin:2.6:resources (default-resources) @ archive-test ---
[INFO] Using 'UTF-8' encoding to copy filtered resources.
[INFO] skip non existing resourceDirectory /home/cibuild02/workspace/NetarchiveSuite-Full-Test-staging/archive/archive-test/src/main/resources
[INFO] 
[INFO] --- maven-compiler-plugin:3.1:compile (default-compile) @ archive-test ---
[INFO] No sources to compile
[INFO] 
[INFO] --- maven-resources-plugin:2.6:testResources (default-testResources) @ archive-test ---
[INFO] Using 'UTF-8' encoding to copy filtered resources.
[INFO] Copying 1 resource
[INFO] Copying 296 resources
[INFO] 
[INFO] --- maven-compiler-plugin:3.1:testCompile (default-testCompile) @ archive-test ---
[INFO] Changes detected - recompiling the module!
[INFO] Compiling 78 source files to /home/cibuild02/workspace/NetarchiveSuite-Full-Test-staging/archive/archive-test/target/test-classes
[WARNING] /home/cibuild02/workspace/NetarchiveSuite-Full-Test-staging/archive/archive-test/src/test/java/dk/netarkivet/archive/arcrepository/ArcRepositoryTesterStoreChecksum.java: Some input files use or override a deprecated API.
[WARNING] /home/cibuild02/workspace/NetarchiveSuite-Full-Test-staging/archive/archive-test/src/test/java/dk/netarkivet/archive/arcrepository/ArcRepositoryTesterStoreChecksum.java: Recompile with -Xlint:deprecation for details.
[WARNING] /home/cibuild02/workspace/NetarchiveSuite-Full-Test-staging/archive/archive-test/src/test/java/dk/netarkivet/archive/arcrepository/bitpreservation/FileBasedActiveBitPreservationTester.java: Some input files use unchecked or unsafe operations.
[WARNING] /home/cibuild02/workspace/NetarchiveSuite-Full-Test-staging/archive/archive-test/src/test/java/dk/netarkivet/archive/arcrepository/bitpreservation/FileBasedActiveBitPreservationTester.java: Recompile with -Xlint:unchecked for details.
[INFO] 
[INFO] --- maven-surefire-plugin:2.17:test (default-test) @ archive-test ---
[INFO] Surefire report directory: /home/cibuild02/workspace/NetarchiveSuite-Full-Test-staging/archive/archive-test/target/surefire-reports

-------------------------------------------------------
 T E S T S
-------------------------------------------------------
Running dk.netarkivet.archive.distribute.ArchiveMessageHandlerTester
Tests run: 15, Failures: 0, Errors: 0, Skipped: 0, Time elapsed: 1.259 sec - in dk.netarkivet.archive.distribute.ArchiveMessageHandlerTester
Running dk.netarkivet.archive.distribute.ReplicaClientFactoryTester
Tests run: 2, Failures: 0, Errors: 0, Skipped: 0, Time elapsed: 0.023 sec - in dk.netarkivet.archive.distribute.ReplicaClientFactoryTester
Running dk.netarkivet.archive.tools.UploadTester
Tests run: 9, Failures: 0, Errors: 0, Skipped: 0, Time elapsed: 1.064 sec - in dk.netarkivet.archive.tools.UploadTester
Running dk.netarkivet.archive.tools.GetFileTester
Tests run: 3, Failures: 0, Errors: 0, Skipped: 0, Time elapsed: 0.17 sec - in dk.netarkivet.archive.tools.GetFileTester
Running dk.netarkivet.archive.tools.GetRecordTester
Tests run: 2, Failures: 0, Errors: 0, Skipped: 0, Time elapsed: 0.399 sec - in dk.netarkivet.archive.tools.GetRecordTester
Running dk.netarkivet.archive.tools.ReestablishAdminDatabaseTester
Tests run: 4, Failures: 0, Errors: 0, Skipped: 2, Time elapsed: 0.169 sec - in dk.netarkivet.archive.tools.ReestablishAdminDatabaseTester
Running dk.netarkivet.archive.tools.RunBatchTester
Tests run: 14, Failures: 0, Errors: 0, Skipped: 0, Time elapsed: 1.106 sec - in dk.netarkivet.archive.tools.RunBatchTester
Running dk.netarkivet.archive.checksum.distribute.FileChecksumServerTester
[WARNING-Notification] The record for file 'NetarchiveSuite-test1.arc' is being corrected at 'THREE'
Tests run: 4, Failures: 0, Errors: 0, Skipped: 0, Time elapsed: 0.121 sec - in dk.netarkivet.archive.checksum.distribute.FileChecksumServerTester
Running dk.netarkivet.archive.checksum.distribute.ChecksumClientTester
Tests run: 3, Failures: 0, Errors: 0, Skipped: 0, Time elapsed: 0.072 sec - in dk.netarkivet.archive.checksum.distribute.ChecksumClientTester
Running dk.netarkivet.archive.checksum.DatabaseChecksumTester
Tests run: 1, Failures: 0, Errors: 0, Skipped: 0, Time elapsed: 0.199 sec - in dk.netarkivet.archive.checksum.DatabaseChecksumTester
Running dk.netarkivet.archive.checksum.FileChecksumArchiveTester
Tests run: 4, Failures: 0, Errors: 0, Skipped: 0, Time elapsed: 0.08 sec - in dk.netarkivet.archive.checksum.FileChecksumArchiveTester
Running dk.netarkivet.archive.arcrepositoryadmin.DatabaseAdminTester
Tests run: 1, Failures: 0, Errors: 0, Skipped: 1, Time elapsed: 0.003 sec - in dk.netarkivet.archive.arcrepositoryadmin.DatabaseAdminTester
Running dk.netarkivet.archive.arcrepositoryadmin.FileListStatusTester
Tests run: 1, Failures: 0, Errors: 0, Skipped: 0, Time elapsed: 0.007 sec - in dk.netarkivet.archive.arcrepositoryadmin.FileListStatusTester
Running dk.netarkivet.archive.arcrepositoryadmin.ReadOnlyAdminDataTester
Tests run: 1, Failures: 0, Errors: 0, Skipped: 0, Time elapsed: 2.019 sec - in dk.netarkivet.archive.arcrepositoryadmin.ReadOnlyAdminDataTester
Running dk.netarkivet.archive.arcrepositoryadmin.AdminDataTester
Tests run: 12, Failures: 0, Errors: 0, Skipped: 0, Time elapsed: 0.182 sec - in dk.netarkivet.archive.arcrepositoryadmin.AdminDataTester
Running dk.netarkivet.archive.arcrepositoryadmin.ReplicaCacheDatabaseTester
[WARNING]:No bitarchive replica was found which contains the file 'TEST1'.
Tests run: 1, Failures: 0, Errors: 0, Skipped: 0, Time elapsed: 4.271 sec - in dk.netarkivet.archive.arcrepositoryadmin.ReplicaCacheDatabaseTester
Running dk.netarkivet.archive.arcrepositoryadmin.ChecksumStatusTester
Tests run: 1, Failures: 0, Errors: 0, Skipped: 0, Time elapsed: 0.002 sec - in dk.netarkivet.archive.arcrepositoryadmin.ChecksumStatusTester
Running dk.netarkivet.archive.arcrepositoryadmin.DBTester
Tests run: 3, Failures: 0, Errors: 0, Skipped: 0, Time elapsed: 0.136 sec - in dk.netarkivet.archive.arcrepositoryadmin.DBTester
Running dk.netarkivet.archive.ArchiveSettingsTest
Tests run: 1, Failures: 0, Errors: 0, Skipped: 0, Time elapsed: 0.001 sec - in dk.netarkivet.archive.ArchiveSettingsTest
Running dk.netarkivet.archive.bitarchive.BitarchiveTesterAdmin
Tests run: 4, Failures: 0, Errors: 0, Skipped: 0, Time elapsed: 0.091 sec - in dk.netarkivet.archive.bitarchive.BitarchiveTesterAdmin
Running dk.netarkivet.archive.bitarchive.BitarchiveARCFileTester
Tests run: 1, Failures: 0, Errors: 0, Skipped: 0, Time elapsed: 0.001 sec - in dk.netarkivet.archive.bitarchive.BitarchiveARCFileTester
Running dk.netarkivet.archive.bitarchive.BitarchiveTesterCTOR
Tests run: 2, Failures: 0, Errors: 0, Skipped: 0, Time elapsed: 0.029 sec - in dk.netarkivet.archive.bitarchive.BitarchiveTesterCTOR
Running dk.netarkivet.archive.bitarchive.BatchMessageTester
Tests run: 1, Failures: 0, Errors: 0, Skipped: 0, Time elapsed: 0.044 sec - in dk.netarkivet.archive.bitarchive.BatchMessageTester
Running dk.netarkivet.archive.bitarchive.BitarchiveTesterGet
Tests run: 9, Failures: 0, Errors: 0, Skipped: 0, Time elapsed: 0.169 sec - in dk.netarkivet.archive.bitarchive.BitarchiveTesterGet
Running dk.netarkivet.archive.bitarchive.BitarchiveTesterUpload
Tests run: 8, Failures: 0, Errors: 0, Skipped: 0, Time elapsed: 0.187 sec - in dk.netarkivet.archive.bitarchive.BitarchiveTesterUpload
Running dk.netarkivet.archive.bitarchive.BitarchiveAdminTesterONB
Tests run: 1, Failures: 0, Errors: 0, Skipped: 1, Time elapsed: 0.001 sec - in dk.netarkivet.archive.bitarchive.BitarchiveAdminTesterONB
Running dk.netarkivet.archive.bitarchive.BitarchiveTesterBatch
Tests run: 7, Failures: 0, Errors: 0, Skipped: 1, Time elapsed: 0.162 sec - in dk.netarkivet.archive.bitarchive.BitarchiveTesterBatch
Running dk.netarkivet.archive.bitarchive.BitarchiveTesterGetFile
Tests run: 2, Failures: 0, Errors: 0, Skipped: 0, Time elapsed: 0.025 sec - in dk.netarkivet.archive.bitarchive.BitarchiveTesterGetFile
Running dk.netarkivet.archive.bitarchive.BitarchiveMonitorTester
Tests run: 3, Failures: 0, Errors: 0, Skipped: 0, Time elapsed: 0.033 sec - in dk.netarkivet.archive.bitarchive.BitarchiveMonitorTester
Running dk.netarkivet.archive.bitarchive.BitarchiveTesterLog
Tests run: 4, Failures: 0, Errors: 0, Skipped: 0, Time elapsed: 0.103 sec - in dk.netarkivet.archive.bitarchive.BitarchiveTesterLog
Running dk.netarkivet.archive.bitarchive.BitarchiveAdminTester
Tests run: 11, Failures: 0, Errors: 0, Skipped: 3, Time elapsed: 0.128 sec - in dk.netarkivet.archive.bitarchive.BitarchiveAdminTester
Running dk.netarkivet.archive.webinterface.BatchGUITester
Tests run: 3, Failures: 0, Errors: 0, Skipped: 1, Time elapsed: 0.039 sec - in dk.netarkivet.archive.webinterface.BatchGUITester
Running dk.netarkivet.archive.webinterface.BitpreserveFileStatusTester
Tests run: 8, Failures: 0, Errors: 0, Skipped: 0, Time elapsed: 0.088 sec - in dk.netarkivet.archive.webinterface.BitpreserveFileStatusTester
Running dk.netarkivet.archive.arcrepository.LocalArcRepositoryClientTester
Tests run: 5, Failures: 0, Errors: 0, Skipped: 0, Time elapsed: 0.129 sec - in dk.netarkivet.archive.arcrepository.LocalArcRepositoryClientTester
Running dk.netarkivet.archive.arcrepository.ArcRepositoryTesterStore
Tests run: 12, Failures: 0, Errors: 0, Skipped: 3, Time elapsed: 0.207 sec - in dk.netarkivet.archive.arcrepository.ArcRepositoryTesterStore
Running dk.netarkivet.archive.arcrepository.distribute.JMSArcRepositoryClientTester
Tests run: 22, Failures: 0, Errors: 0, Skipped: 0, Time elapsed: 2.75 sec - in dk.netarkivet.archive.arcrepository.distribute.JMSArcRepositoryClientTester
Running dk.netarkivet.archive.arcrepository.distribute.StoreMessageTester
Tests run: 2, Failures: 0, Errors: 0, Skipped: 0, Time elapsed: 0.019 sec - in dk.netarkivet.archive.arcrepository.distribute.StoreMessageTester
Running dk.netarkivet.archive.arcrepository.ArcRepositoryTesterGet
Tests run: 1, Failures: 0, Errors: 0, Skipped: 1, Time elapsed: 0.006 sec - in dk.netarkivet.archive.arcrepository.ArcRepositoryTesterGet
Running dk.netarkivet.archive.arcrepository.ArcRepositoryTesterStoreChecksum
Tests run: 4, Failures: 0, Errors: 0, Skipped: 2, Time elapsed: 0.052 sec - in dk.netarkivet.archive.arcrepository.ArcRepositoryTesterStoreChecksum
Running dk.netarkivet.archive.arcrepository.bitpreservation.UtilityTester
Tests run: 1, Failures: 0, Errors: 0, Skipped: 0, Time elapsed: 0.002 sec - in dk.netarkivet.archive.arcrepository.bitpreservation.UtilityTester
Running dk.netarkivet.archive.arcrepository.bitpreservation.WorkFilesTester
Tests run: 1, Failures: 0, Errors: 0, Skipped: 0, Time elapsed: 0.028 sec - in dk.netarkivet.archive.arcrepository.bitpreservation.WorkFilesTester
Running dk.netarkivet.archive.arcrepository.bitpreservation.FileBasedActiveBitPreservationTester
Tests run: 7, Failures: 0, Errors: 0, Skipped: 2, Time elapsed: 0.17 sec - in dk.netarkivet.archive.arcrepository.bitpreservation.FileBasedActiveBitPreservationTester
Running dk.netarkivet.archive.arcrepository.bitpreservation.FileListJobTester
Tests run: 2, Failures: 0, Errors: 0, Skipped: 0, Time elapsed: 0.032 sec - in dk.netarkivet.archive.arcrepository.bitpreservation.FileListJobTester
Running dk.netarkivet.archive.arcrepository.bitpreservation.FilePreservationStateTester
Tests run: 5, Failures: 0, Errors: 0, Skipped: 0, Time elapsed: 0.016 sec - in dk.netarkivet.archive.arcrepository.bitpreservation.FilePreservationStateTester
Running dk.netarkivet.archive.arcrepository.bitpreservation.DatabasePreservationStateTester
Tests run: 2, Failures: 0, Errors: 0, Skipped: 0, Time elapsed: 0.003 sec - in dk.netarkivet.archive.arcrepository.bitpreservation.DatabasePreservationStateTester
Running dk.netarkivet.archive.arcrepository.bitpreservation.DatabaseBasedActiveBitPreservationTester
Tests run: 1, Failures: 0, Errors: 0, Skipped: 1, Time elapsed: 0 sec - in dk.netarkivet.archive.arcrepository.bitpreservation.DatabaseBasedActiveBitPreservationTester
Running dk.netarkivet.archive.arcrepository.ReplicaTester
Tests run: 6, Failures: 0, Errors: 0, Skipped: 0, Time elapsed: 0.005 sec - in dk.netarkivet.archive.arcrepository.ReplicaTester
Running dk.netarkivet.archive.arcrepository.ArcRepositoryTesterBatch
Tests run: 6, Failures: 0, Errors: 0, Skipped: 0, Time elapsed: 0.258 sec - in dk.netarkivet.archive.arcrepository.ArcRepositoryTesterBatch
Running dk.netarkivet.archive.arcrepository.ArcRepositoryTester
Tests run: 9, Failures: 0, Errors: 0, Skipped: 0, Time elapsed: 0.101 sec - in dk.netarkivet.archive.arcrepository.ArcRepositoryTester
Running dk.netarkivet.archive.arcrepository.TrivialArcRepositoryClientTester
Tests run: 1, Failures: 0, Errors: 0, Skipped: 0, Time elapsed: 0.028 sec - in dk.netarkivet.archive.arcrepository.TrivialArcRepositoryClientTester
Running dk.netarkivet.archive.arcrepository.ReplicaTypeTester
Tests run: 2, Failures: 0, Errors: 0, Skipped: 0, Time elapsed: 0.007 sec - in dk.netarkivet.archive.arcrepository.ReplicaTypeTester
Running dk.netarkivet.archive.arcrepository.ArcRepositoryDatabaseTester
Tests run: 1, Failures: 0, Errors: 0, Skipped: 1, Time elapsed: 0.001 sec - in dk.netarkivet.archive.arcrepository.ArcRepositoryDatabaseTester
Running dk.netarkivet.archive.arcrepository.ArcRepositoryTesterLog
Tests run: 1, Failures: 0, Errors: 0, Skipped: 0, Time elapsed: 0.081 sec - in dk.netarkivet.archive.arcrepository.ArcRepositoryTesterLog
Running dk.netarkivet.archive.arcrepository.BatchStatusTester
Tests run: 3, Failures: 0, Errors: 0, Skipped: 0, Time elapsed: 0.077 sec - in dk.netarkivet.archive.arcrepository.BatchStatusTester
Running dk.netarkivet.archive.arcrepository.ARCLookupTester
Tests run: 7, Failures: 0, Errors: 0, Skipped: 0, Time elapsed: 0.171 sec - in dk.netarkivet.archive.arcrepository.ARCLookupTester
Running dk.netarkivet.archive.arcrepository.BitarchiveRecordTester
Tests run: 5, Failures: 0, Errors: 0, Skipped: 0, Time elapsed: 0.15 sec - in dk.netarkivet.archive.arcrepository.BitarchiveRecordTester

Results :

Tests run: 252, Failures: 0, Errors: 0, Skipped: 19

[JENKINS] Recording test results
[INFO] 
[INFO] --- maven-jgit-buildnumber-plugin:1.2.9:extract-buildnumber (git-buildnumber) @ archive-test ---
[INFO] 
[INFO] --- maven-jar-plugin:2.4:jar (default-jar) @ archive-test ---
[WARNING] JAR will be empty - no content was marked for inclusion!
[INFO] Building jar: /home/cibuild02/workspace/NetarchiveSuite-Full-Test-staging/archive/archive-test/target/archive-test-5.4.3-SNAPSHOT.jar
[INFO] 
[INFO] >>> maven-source-plugin:2.2.1:jar (attach-sources) > generate-sources @ archive-test >>>
[INFO] 
[INFO] --- jacoco-maven-plugin:0.7.9:prepare-agent (agent) @ archive-test ---
[INFO] argLine set to -javaagent:/home/cibuild02/.m2/repository/org/jacoco/org.jacoco.agent/0.7.9/org.jacoco.agent-0.7.9-runtime.jar=destfile=/home/cibuild02/workspace/NetarchiveSuite-Full-Test-staging/archive/archive-test/../target/jacoco.exec,append=true
[WARNING] Failed to getClass for org.apache.maven.plugin.source.SourceJarMojo
[INFO] 
[INFO] <<< maven-source-plugin:2.2.1:jar (attach-sources) < generate-sources @ archive-test <<<
[INFO] 
[INFO] --- maven-source-plugin:2.2.1:jar (attach-sources) @ archive-test ---
[INFO] No sources in project. Archive not created.
[INFO] 
[INFO] --- maven-javadoc-plugin:2.10.3:jar (attach-javadocs) @ archive-test ---
[INFO] 
[INFO] --- maven-install-plugin:2.4:install (default-install) @ archive-test ---
[INFO] Installing /home/cibuild02/workspace/NetarchiveSuite-Full-Test-staging/archive/archive-test/target/archive-test-5.4.3-SNAPSHOT.jar to /home/cibuild02/.m2/repository/org/netarchivesuite/archive-test/5.4.3-SNAPSHOT/archive-test-5.4.3-SNAPSHOT.jar
[INFO] Installing /home/cibuild02/workspace/NetarchiveSuite-Full-Test-staging/archive/archive-test/pom.xml to /home/cibuild02/.m2/repository/org/netarchivesuite/archive-test/5.4.3-SNAPSHOT/archive-test-5.4.3-SNAPSHOT.pom
[INFO] 
[INFO] --- maven-clean-plugin:2.5:clean (default-clean) @ archive-test ---
[INFO] Deleting /home/cibuild02/workspace/NetarchiveSuite-Full-Test-staging/archive/archive-test/target
[JENKINS] Archiving disabled
[INFO]                                                                         
[INFO] ------------------------------------------------------------------------
[INFO] Building NetarchiveSuite - bitpreservation - webapp 5.4.3-SNAPSHOT
[INFO] ------------------------------------------------------------------------
[INFO] 
[INFO] --- maven-clean-plugin:2.5:clean (default-clean) @ bitpreservation-gui ---
[INFO] 
[INFO] --- maven-resources-plugin:2.6:resources (default-resources) @ bitpreservation-gui ---
[INFO] Using 'UTF-8' encoding to copy filtered resources.
[INFO] skip non existing resourceDirectory /home/cibuild02/workspace/NetarchiveSuite-Full-Test-staging/archive/bitpreservation-gui/src/main/resources
[INFO] 
[INFO] --- maven-compiler-plugin:3.1:compile (default-compile) @ bitpreservation-gui ---
[INFO] No sources to compile
[INFO] 
[INFO] --- maven-resources-plugin:2.6:testResources (default-testResources) @ bitpreservation-gui ---
[INFO] Using 'UTF-8' encoding to copy filtered resources.
[INFO] skip non existing resourceDirectory /home/cibuild02/workspace/NetarchiveSuite-Full-Test-staging/archive/bitpreservation-gui/src/test/resources
[INFO] 
[INFO] --- maven-compiler-plugin:3.1:testCompile (default-testCompile) @ bitpreservation-gui ---
[INFO] No sources to compile
[INFO] 
[INFO] --- maven-surefire-plugin:2.17:test (default-test) @ bitpreservation-gui ---
[INFO] No tests to run.
[JENKINS] Recording test results
[INFO] 
[INFO] --- maven-jgit-buildnumber-plugin:1.2.9:extract-buildnumber (git-buildnumber) @ bitpreservation-gui ---
[INFO] 
[INFO] --- maven-war-plugin:2.2:war (default-war) @ bitpreservation-gui ---
[INFO] Packaging webapp
[INFO] Assembling webapp [bitpreservation-gui] in [/home/cibuild02/workspace/NetarchiveSuite-Full-Test-staging/archive/bitpreservation-gui/target/BitPreservation]
[INFO] Processing war project
[INFO] Copying webapp resources [/home/cibuild02/workspace/NetarchiveSuite-Full-Test-staging/archive/bitpreservation-gui/src/main/webapp]
[INFO] Webapp assembled in [92 msecs]
[INFO] Building war: /home/cibuild02/workspace/NetarchiveSuite-Full-Test-staging/archive/bitpreservation-gui/target/BitPreservation.war
[INFO] WEB-INF/web.xml already added, skipping
[INFO] 
[INFO] >>> maven-source-plugin:2.2.1:jar (attach-sources) > generate-sources @ bitpreservation-gui >>>
[WARNING] Failed to getClass for org.apache.maven.plugin.source.SourceJarMojo
[INFO] 
[INFO] <<< maven-source-plugin:2.2.1:jar (attach-sources) < generate-sources @ bitpreservation-gui <<<
[INFO] 
[INFO] --- maven-source-plugin:2.2.1:jar (attach-sources) @ bitpreservation-gui ---
[INFO] No sources in project. Archive not created.
[INFO] 
[INFO] --- maven-javadoc-plugin:2.10.3:jar (attach-javadocs) @ bitpreservation-gui ---
[INFO] 
[INFO] --- maven-install-plugin:2.4:install (default-install) @ bitpreservation-gui ---
[INFO] Installing /home/cibuild02/workspace/NetarchiveSuite-Full-Test-staging/archive/bitpreservation-gui/target/BitPreservation.war to /home/cibuild02/.m2/repository/org/netarchivesuite/bitpreservation-gui/5.4.3-SNAPSHOT/bitpreservation-gui-5.4.3-SNAPSHOT.war
[INFO] Installing /home/cibuild02/workspace/NetarchiveSuite-Full-Test-staging/archive/bitpreservation-gui/pom.xml to /home/cibuild02/.m2/repository/org/netarchivesuite/bitpreservation-gui/5.4.3-SNAPSHOT/bitpreservation-gui-5.4.3-SNAPSHOT.pom
[INFO] 
[INFO] --- maven-clean-plugin:2.5:clean (default-clean) @ bitpreservation-gui ---
[INFO] Deleting /home/cibuild02/workspace/NetarchiveSuite-Full-Test-staging/archive/bitpreservation-gui/target
[JENKINS] Archiving disabled
[INFO]                                                                         
[INFO] ------------------------------------------------------------------------
[INFO] Building NetarchiveSuite - Harvest Scheduler 5.4.3-SNAPSHOT
[INFO] ------------------------------------------------------------------------
[INFO] 
[INFO] --- maven-clean-plugin:2.5:clean (default-clean) @ harvest-scheduler ---
[INFO] Deleting /home/cibuild02/workspace/NetarchiveSuite-Full-Test-staging/harvester/harvest-scheduler/target
[INFO] 
[INFO] --- jacoco-maven-plugin:0.7.9:prepare-agent (agent) @ harvest-scheduler ---
[INFO] argLine set to -javaagent:/home/cibuild02/.m2/repository/org/jacoco/org.jacoco.agent/0.7.9/org.jacoco.agent-0.7.9-runtime.jar=destfile=/home/cibuild02/workspace/NetarchiveSuite-Full-Test-staging/harvester/harvest-scheduler/../target/jacoco.exec,append=true
[INFO] 
[INFO] --- maven-resources-plugin:2.6:resources (default-resources) @ harvest-scheduler ---
[INFO] Using 'UTF-8' encoding to copy filtered resources.
[INFO] skip non existing resourceDirectory /home/cibuild02/workspace/NetarchiveSuite-Full-Test-staging/harvester/harvest-scheduler/src/main/resources
[INFO] 
[INFO] --- maven-compiler-plugin:3.1:compile (default-compile) @ harvest-scheduler ---
[INFO] Changes detected - recompiling the module!
[INFO] Compiling 14 source files to /home/cibuild02/workspace/NetarchiveSuite-Full-Test-staging/harvester/harvest-scheduler/target/classes
[INFO] 
[INFO] --- maven-resources-plugin:2.6:testResources (default-testResources) @ harvest-scheduler ---
[INFO] Using 'UTF-8' encoding to copy filtered resources.
[INFO] skip non existing resourceDirectory /home/cibuild02/workspace/NetarchiveSuite-Full-Test-staging/harvester/harvest-scheduler/src/test/resources
[INFO] 
[INFO] --- maven-compiler-plugin:3.1:testCompile (default-testCompile) @ harvest-scheduler ---
[INFO] Changes detected - recompiling the module!
[INFO] Compiling 5 source files to /home/cibuild02/workspace/NetarchiveSuite-Full-Test-staging/harvester/harvest-scheduler/target/test-classes
[INFO] 
[INFO] --- maven-surefire-plugin:2.17:test (default-test) @ harvest-scheduler ---
[INFO] Surefire report directory: /home/cibuild02/workspace/NetarchiveSuite-Full-Test-staging/harvester/harvest-scheduler/target/surefire-reports

-------------------------------------------------------
 T E S T S
-------------------------------------------------------
Running dk.netarkivet.harvester.scheduler.JobDispatcherTest
14:20:04.770 [main] INFO dk.netarkivet.harvester.scheduler.JobDispatcher - Creating JobDispatcher
14:20:05.073 [main] DEBUG dk.netarkivet.harvester.scheduler.JobDispatcher - Submitting new FOCUSED job 1
14:20:05.123 [main] INFO dk.netarkivet.harvester.scheduler.JobDispatcher - Added duplicateReductionMetadataEntry metadataEntry for job 1 
14:20:05.157 [main] INFO dk.netarkivet.harvester.scheduler.JobDispatcher - As we're using WARC as archiveFormat WarcInfoMetadata is now added to the template
The list of loaded data settings is empty. Is this OK?14:20:05.229 [main] DEBUG dk.netarkivet.common.utils.Settings - Value found in classpath data: ONE,TWO,THREE
14:20:05.263 [main] DEBUG dk.netarkivet.harvester.scheduler.JobDispatcher - Send crawl request: NO ID: To DEV_COMMON_JOB_PARTIAL_FOCUSED ReplyTo DEV_COMMON_ERROR OK Job: Mock for Job, hashCode: 808297264, metadata: [URL= metadata://netarkivet.dk/crawl/setup/duplicatereductionjobs?majorversion=1&minorversion=0&harvestid=9&harvestnum=0&jobid=1 ; mimetype= text/plain ; data= 1]
14:20:05.265 [main] INFO dk.netarkivet.harvester.scheduler.JobDispatcher - Job #1 submitted
14:20:05.294 [main] INFO dk.netarkivet.harvester.scheduler.JobDispatcher - Creating JobDispatcher
14:20:05.363 [main] DEBUG dk.netarkivet.harvester.scheduler.JobDispatcher - Submitting new FOCUSED job 1
14:20:05.369 [main] INFO dk.netarkivet.harvester.scheduler.JobDispatcher - As we're using WARC as archiveFormat WarcInfoMetadata is now added to the template
14:20:05.383 [main] DEBUG dk.netarkivet.harvester.scheduler.JobDispatcher - Send crawl request: NO ID: To DEV_COMMON_JOB_PARTIAL_FOCUSED ReplyTo DEV_COMMON_ERROR OK Job: Mock for Job, hashCode: 533053618, metadata: []
14:20:05.386 [main] INFO dk.netarkivet.harvester.scheduler.JobDispatcher - Job #1 submitted
14:20:05.434 [main] DEBUG dk.netarkivet.harvester.scheduler.JobDispatcher - Submitting new SNAPSHOT job 2
14:20:05.442 [main] INFO dk.netarkivet.harvester.scheduler.JobDispatcher - As we're using WARC as archiveFormat WarcInfoMetadata is now added to the template
14:20:05.454 [main] DEBUG dk.netarkivet.harvester.scheduler.JobDispatcher - Send crawl request: NO ID: To DEV_COMMON_JOB_SNAPSHOT_SNAPSHOT ReplyTo DEV_COMMON_ERROR OK Job: Mock for Job, hashCode: 1455066764, metadata: []
14:20:05.457 [main] INFO dk.netarkivet.harvester.scheduler.JobDispatcher - Job #2 submitted
14:20:05.461 [main] INFO dk.netarkivet.harvester.scheduler.JobDispatcher - Creating JobDispatcher
14:20:05.491 [main] DEBUG dk.netarkivet.harvester.scheduler.JobDispatcher - Submitting new FOCUSED job 1
14:20:05.496 [main] INFO dk.netarkivet.harvester.scheduler.JobDispatcher - As we're using WARC as archiveFormat WarcInfoMetadata is now added to the template
14:20:05.508 [main] DEBUG dk.netarkivet.harvester.scheduler.JobDispatcher - Send crawl request: NO ID: To DEV_COMMON_JOB_PARTIAL_FOCUSED ReplyTo DEV_COMMON_ERROR OK Job: Mock for Job, hashCode: 342862272, metadata: []
14:20:05.513 [main] INFO dk.netarkivet.harvester.scheduler.JobDispatcher - Job #1 submitted
14:20:05.523 [main] INFO dk.netarkivet.harvester.scheduler.JobDispatcher - Creating JobDispatcher
14:20:05.550 [main] DEBUG dk.netarkivet.harvester.scheduler.JobDispatcher - Submitting new FOCUSED job 1
14:20:05.563 [main] INFO dk.netarkivet.harvester.scheduler.JobDispatcher - Added alias metadataEntry for job 1 
14:20:05.572 [main] INFO dk.netarkivet.harvester.scheduler.JobDispatcher - As we're using WARC as archiveFormat WarcInfoMetadata is now added to the template
14:20:05.586 [main] DEBUG dk.netarkivet.harvester.scheduler.JobDispatcher - Send crawl request: NO ID: To DEV_COMMON_JOB_PARTIAL_FOCUSED ReplyTo DEV_COMMON_ERROR OK Job: Mock for Job, hashCode: 620095976, metadata: [URL= metadata://netarkivet.dk/crawl/setup/aliases?majorversion=1&minorversion=0&harvestid=9&harvestnum=0&jobid=1 ; mimetype= text/plain ; data= netatarkivalias.dk is an alias for netarkiv.dk
]
14:20:05.586 [main] INFO dk.netarkivet.harvester.scheduler.JobDispatcher - Job #1 submitted
14:20:05.590 [main] INFO dk.netarkivet.harvester.scheduler.JobDispatcher - Creating JobDispatcher
Tests run: 5, Failures: 0, Errors: 0, Skipped: 0, Time elapsed: 2.64 sec - in dk.netarkivet.harvester.scheduler.JobDispatcherTest
Running dk.netarkivet.harvester.scheduler.HarvesterStatusReceiverTest
14:20:05.678 [main] INFO dk.netarkivet.harvester.scheduler.HarvesterStatusReceiver - Reregistering the harvester 'Test' to channel 'FOCUSED'
14:20:05.680 [main] INFO dk.netarkivet.harvester.scheduler.HarvestChannelRegistry - Harvester Test registered on channel FOCUSED
14:20:05.684 [main] INFO dk.netarkivet.harvester.scheduler.HarvestChannelRegistry - HarvestChannelRegistry status:
	- FOCUSED { Test }
14:20:05.717 [main] WARN dk.netarkivet.harvester.distribute.HarvesterMessageHandler - Error processing message 'TestObjectMessage: NO ID: To DEV_COMMON_HARVESTMON ReplyTo DEV_COMMON_ERROR OK'
dk.netarkivet.common.exceptions.PermissionDenied: 'dk.netarkivet.harvester.scheduler.HarvesterStatusReceiver@632dc41' provides no handling for NO ID: To DEV_COMMON_HARVESTMON ReplyTo DEV_COMMON_ERROR OK of type dk.netarkivet.harvester.harvesting.distribute.CrawlProgressMessage and should not be invoked!
	at dk.netarkivet.harvester.distribute.HarvesterMessageHandler.deny(HarvesterMessageHandler.java:83)
	at dk.netarkivet.harvester.distribute.HarvesterMessageHandler.visit(HarvesterMessageHandler.java:119)
	at dk.netarkivet.harvester.harvesting.distribute.CrawlProgressMessage.accept(CrawlProgressMessage.java:338)
	at dk.netarkivet.harvester.distribute.HarvesterMessageHandler.onMessage(HarvesterMessageHandler.java:69)
	at dk.netarkivet.harvester.scheduler.HarvesterStatusReceiverTest.testInvalidMessageType(HarvesterStatusReceiverTest.java:66)
	at sun.reflect.NativeMethodAccessorImpl.invoke0(Native Method)
	at sun.reflect.NativeMethodAccessorImpl.invoke(NativeMethodAccessorImpl.java:62)
	at sun.reflect.DelegatingMethodAccessorImpl.invoke(DelegatingMethodAccessorImpl.java:43)
	at java.lang.reflect.Method.invoke(Method.java:498)
	at org.junit.runners.model.FrameworkMethod$1.runReflectiveCall(FrameworkMethod.java:47)
	at org.junit.internal.runners.model.ReflectiveCallable.run(ReflectiveCallable.java:12)
	at org.junit.runners.model.FrameworkMethod.invokeExplosively(FrameworkMethod.java:44)
	at org.junit.internal.runners.statements.InvokeMethod.evaluate(InvokeMethod.java:17)
	at org.junit.internal.runners.statements.RunBefores.evaluate(RunBefores.java:26)
	at org.junit.runners.ParentRunner.runLeaf(ParentRunner.java:271)
	at org.junit.runners.BlockJUnit4ClassRunner.runChild(BlockJUnit4ClassRunner.java:70)
	at org.junit.runners.BlockJUnit4ClassRunner.runChild(BlockJUnit4ClassRunner.java:50)
	at org.junit.runners.ParentRunner$3.run(ParentRunner.java:238)
	at org.junit.runners.ParentRunner$1.schedule(ParentRunner.java:63)
	at org.junit.runners.ParentRunner.runChildren(ParentRunner.java:236)
	at org.junit.runners.ParentRunner.access$000(ParentRunner.java:53)
	at org.junit.runners.ParentRunner$2.evaluate(ParentRunner.java:229)
	at org.junit.runners.ParentRunner.run(ParentRunner.java:309)
	at org.apache.maven.surefire.junit4.JUnit4Provider.execute(JUnit4Provider.java:264)
	at org.apache.maven.surefire.junit4.JUnit4Provider.executeTestSet(JUnit4Provider.java:153)
	at org.apache.maven.surefire.junit4.JUnit4Provider.invoke(JUnit4Provider.java:124)
	at org.apache.maven.surefire.booter.ForkedBooter.invokeProviderInSameClassLoader(ForkedBooter.java:200)
	at org.apache.maven.surefire.booter.ForkedBooter.runSuitesInProcess(ForkedBooter.java:153)
	at org.apache.maven.surefire.booter.ForkedBooter.main(ForkedBooter.java:103)
Tests run: 2, Failures: 0, Errors: 0, Skipped: 0, Time elapsed: 0.126 sec - in dk.netarkivet.harvester.scheduler.HarvesterStatusReceiverTest
Running dk.netarkivet.harvester.scheduler.JobSupervisorTest
14:20:05.736 [main] INFO dk.netarkivet.harvester.scheduler.JobSupervisor - 0 jobs has been resubmitted.
14:20:05.741 [main] WARN dk.netarkivet.harvester.scheduler.JobSupervisor -  Job 1 has exceeded its timeout of 0 minutes. Changing status to FAILED.
14:20:05.742 [main] WARN dk.netarkivet.harvester.scheduler.JobSupervisor - Changed 1 jobs from STARTED to FAILED
14:20:05.753 [main] INFO dk.netarkivet.harvester.scheduler.JobSupervisor - Resubmitting old job 1 as 0
14:20:05.753 [main] INFO dk.netarkivet.harvester.scheduler.JobSupervisor - Resubmitting old job 3 as 0
14:20:05.754 [main] INFO dk.netarkivet.harvester.scheduler.JobSupervisor - 2 jobs has been resubmitted.
Tests run: 4, Failures: 0, Errors: 0, Skipped: 0, Time elapsed: 0.037 sec - in dk.netarkivet.harvester.scheduler.JobSupervisorTest
Running dk.netarkivet.harvester.scheduler.HarvestSchedulerMonitorServerTest
14:20:05.835 [main] WARN dk.netarkivet.harvester.scheduler.HarvestSchedulerMonitorServer - Received unexpected CrawlStatusMessage for job 1 with new status FAILED, current state is SUBMITTED
14:20:05.836 [main] WARN dk.netarkivet.harvester.scheduler.HarvestSchedulerMonitorServer - Job 1 failed: HarvestErrors = Some harvesterrors
HarvestErrorDetails = Some harvestErrorDetails
UploadErrors = Some uploadErrors
UploadErrorDetails = Some uploadErrorDetails
14:20:05.847 [main] WARN dk.netarkivet.harvester.scheduler.HarvestSchedulerMonitorServer - Received unexpected CrawlStatusMessage for job 1 with new status FAILED, current state is RESUBMITTED
14:20:05.853 [main] WARN dk.netarkivet.harvester.scheduler.HarvestSchedulerMonitorServer - Job 1 failed: HarvestErrors = Some harvesterrors
HarvestErrorDetails = Some harvestErrorDetails
UploadErrors = Some uploadErrors
UploadErrorDetails = Some uploadErrorDetails
14:20:05.857 [main] WARN dk.netarkivet.harvester.scheduler.HarvestSchedulerMonitorServer - Job 1 failed: HarvestErrors = Some harvesterrors
HarvestErrorDetails = Some harvestErrorDetails
UploadErrors = Some uploadErrors
UploadErrorDetails = Some uploadErrorDetails
14:20:05.866 [main] WARN dk.netarkivet.harvester.scheduler.HarvestSchedulerMonitorServer - Received unexpected CrawlStatusMessage for job 1 with new status FAILED, current state is DONE. Marking job as DONE. Reported harvestErrors on job: Some harvesterrors
14:20:05.880 [main] INFO dk.netarkivet.harvester.scheduler.HarvestSchedulerMonitorServer - Job #1 succesfully completed
14:20:05.891 [main] INFO dk.netarkivet.harvester.scheduler.HarvestSchedulerMonitorServer - Job #1 succesfully completed
14:20:05.896 [main] INFO dk.netarkivet.harvester.scheduler.HarvestSchedulerMonitorServer - Job #1 has been started by the harvester.
14:20:05.916 [main] INFO dk.netarkivet.harvester.scheduler.HarvestSchedulerMonitorServer - Job #1 succesfully completed
14:20:05.923 [main] WARN dk.netarkivet.harvester.scheduler.HarvestSchedulerMonitorServer - Job 1 failed: HarvestErrors = null
HarvestErrorDetails = null
UploadErrors = null
UploadErrorDetails = null
14:20:05.926 [main] WARN dk.netarkivet.harvester.scheduler.HarvestSchedulerMonitorServer - Received new status 'Started' for job 1 with current status DONE, ignoring.
14:20:05.934 [main] WARN dk.netarkivet.harvester.scheduler.HarvestSchedulerMonitorServer - Received unexpected CrawlStatusMessage for job 1 with new status DONE, current state is NEW
14:20:05.938 [main] INFO dk.netarkivet.harvester.scheduler.HarvestSchedulerMonitorServer - Job #1 succesfully completed
14:20:05.942 [main] WARN dk.netarkivet.harvester.scheduler.HarvestSchedulerMonitorServer - Received new status 'Started' for job 1 with current status STARTED, ignoring.
14:20:05.948 [main] WARN dk.netarkivet.harvester.scheduler.HarvestSchedulerMonitorServer - Received new status 'Started' for job 1 with current status FAILED, ignoring.
14:20:05.959 [main] WARN dk.netarkivet.harvester.scheduler.HarvestSchedulerMonitorServer - Received new status 'Started' for unsubmitted job 1
14:20:05.959 [main] INFO dk.netarkivet.harvester.scheduler.HarvestSchedulerMonitorServer - Job #1 has been started by the harvester.
14:20:05.963 [main] WARN dk.netarkivet.harvester.scheduler.HarvestSchedulerMonitorServer - Received unexpected CrawlStatusMessage for job 1 with new status DONE, current state is SUBMITTED
14:20:05.964 [main] INFO dk.netarkivet.harvester.scheduler.HarvestSchedulerMonitorServer - Job #1 succesfully completed
14:20:05.974 [main] WARN dk.netarkivet.harvester.scheduler.HarvestSchedulerMonitorServer - Received unexpected CrawlStatusMessage for job 1 with new status DONE, current state is SUBMITTED
14:20:05.975 [main] INFO dk.netarkivet.harvester.scheduler.HarvestSchedulerMonitorServer - Job #1 succesfully completed
14:20:05.978 [main] WARN dk.netarkivet.harvester.scheduler.HarvestSchedulerMonitorServer - Received unexpected CrawlStatusMessage for job 1 with new status DONE, current state is RESUBMITTED
14:20:05.984 [main] INFO dk.netarkivet.harvester.scheduler.HarvestSchedulerMonitorServer - Job #1 succesfully completed
14:20:05.987 [main] WARN dk.netarkivet.harvester.scheduler.HarvestSchedulerMonitorServer - Received unexpected CrawlStatusMessage for job 1 with new status FAILED, current state is NEW
14:20:05.989 [main] WARN dk.netarkivet.harvester.scheduler.HarvestSchedulerMonitorServer - Job 1 failed: HarvestErrors = Some harvesterrors
HarvestErrorDetails = Some harvestErrorDetails
UploadErrors = Some uploadErrors
UploadErrorDetails = Some uploadErrorDetails
Tests run: 18, Failures: 0, Errors: 0, Skipped: 0, Time elapsed: 0.233 sec - in dk.netarkivet.harvester.scheduler.HarvestSchedulerMonitorServerTest

Results :

Tests run: 29, Failures: 0, Errors: 0, Skipped: 0

[JENKINS] Recording test results
[INFO] 
[INFO] --- maven-jgit-buildnumber-plugin:1.2.9:extract-buildnumber (git-buildnumber) @ harvest-scheduler ---
[INFO] 
[INFO] --- maven-jar-plugin:2.4:jar (default-jar) @ harvest-scheduler ---
[INFO] Building jar: /home/cibuild02/workspace/NetarchiveSuite-Full-Test-staging/harvester/harvest-scheduler/target/harvest-scheduler-5.4.3-SNAPSHOT.jar
[INFO] 
[INFO] >>> maven-source-plugin:2.2.1:jar (attach-sources) > generate-sources @ harvest-scheduler >>>
[INFO] 
[INFO] --- jacoco-maven-plugin:0.7.9:prepare-agent (agent) @ harvest-scheduler ---
[INFO] argLine set to -javaagent:/home/cibuild02/.m2/repository/org/jacoco/org.jacoco.agent/0.7.9/org.jacoco.agent-0.7.9-runtime.jar=destfile=/home/cibuild02/workspace/NetarchiveSuite-Full-Test-staging/harvester/harvest-scheduler/../target/jacoco.exec,append=true
[WARNING] Failed to getClass for org.apache.maven.plugin.source.SourceJarMojo
[INFO] 
[INFO] <<< maven-source-plugin:2.2.1:jar (attach-sources) < generate-sources @ harvest-scheduler <<<
[INFO] 
[INFO] --- maven-source-plugin:2.2.1:jar (attach-sources) @ harvest-scheduler ---
[INFO] Building jar: /home/cibuild02/workspace/NetarchiveSuite-Full-Test-staging/harvester/harvest-scheduler/target/harvest-scheduler-5.4.3-SNAPSHOT-sources.jar
[INFO] 
[INFO] --- maven-javadoc-plugin:2.10.3:jar (attach-javadocs) @ harvest-scheduler ---
[INFO] The goal 'org.apache.maven.plugins:maven-javadoc-plugin:2.10.3:javadoc' has not been previously called for the module: 'org.netarchivesuite:harvester-core:jar:5.4.3-SNAPSHOT'. Trying to invoke it...
[WARNING] Creating fake javadoc directory to prevent repeated invocations: /home/cibuild02/workspace/NetarchiveSuite-Full-Test-staging/harvester/harvester-core/target/apidocs
[ERROR] Error fetching link: /home/cibuild02/workspace/NetarchiveSuite-Full-Test-staging/common/common-core/target/apidocs/package-list. Ignored it.
[ERROR] Error fetching link: /home/cibuild02/workspace/NetarchiveSuite-Full-Test-staging/common/common-test/target/apidocs/package-list. Ignored it.
[ERROR] Error fetching link: /home/cibuild02/workspace/NetarchiveSuite-Full-Test-staging/harvester/harvester-core/target/apidocs/package-list. Ignored it.
[INFO] Building jar: /home/cibuild02/workspace/NetarchiveSuite-Full-Test-staging/harvester/harvest-scheduler/target/harvest-scheduler-5.4.3-SNAPSHOT-javadoc.jar
[INFO] 
[INFO] --- maven-install-plugin:2.4:install (default-install) @ harvest-scheduler ---
[INFO] Installing /home/cibuild02/workspace/NetarchiveSuite-Full-Test-staging/harvester/harvest-scheduler/target/harvest-scheduler-5.4.3-SNAPSHOT.jar to /home/cibuild02/.m2/repository/org/netarchivesuite/harvest-scheduler/5.4.3-SNAPSHOT/harvest-scheduler-5.4.3-SNAPSHOT.jar
[INFO] Installing /home/cibuild02/workspace/NetarchiveSuite-Full-Test-staging/harvester/harvest-scheduler/pom.xml to /home/cibuild02/.m2/repository/org/netarchivesuite/harvest-scheduler/5.4.3-SNAPSHOT/harvest-scheduler-5.4.3-SNAPSHOT.pom
[INFO] Installing /home/cibuild02/workspace/NetarchiveSuite-Full-Test-staging/harvester/harvest-scheduler/target/harvest-scheduler-5.4.3-SNAPSHOT-sources.jar to /home/cibuild02/.m2/repository/org/netarchivesuite/harvest-scheduler/5.4.3-SNAPSHOT/harvest-scheduler-5.4.3-SNAPSHOT-sources.jar
[INFO] Installing /home/cibuild02/workspace/NetarchiveSuite-Full-Test-staging/harvester/harvest-scheduler/target/harvest-scheduler-5.4.3-SNAPSHOT-javadoc.jar to /home/cibuild02/.m2/repository/org/netarchivesuite/harvest-scheduler/5.4.3-SNAPSHOT/harvest-scheduler-5.4.3-SNAPSHOT-javadoc.jar
[INFO] 
[INFO] --- maven-clean-plugin:2.5:clean (default-clean) @ harvest-scheduler ---
[INFO] Deleting /home/cibuild02/workspace/NetarchiveSuite-Full-Test-staging/harvester/harvest-scheduler/target
[JENKINS] Archiving disabled
[INFO]                                                                         
[INFO] ------------------------------------------------------------------------
[INFO] Building NetarchiveSuite - monitor 5.4.3-SNAPSHOT
[INFO] ------------------------------------------------------------------------
[INFO] 
[INFO] --- maven-clean-plugin:2.5:clean (default-clean) @ monitor ---
[INFO] 
[INFO] --- maven-jgit-buildnumber-plugin:1.2.9:extract-buildnumber (git-buildnumber) @ monitor ---
[INFO] 
[INFO] >>> maven-source-plugin:2.2.1:jar (attach-sources) > generate-sources @ monitor >>>
[WARNING] Failed to getClass for org.apache.maven.plugin.source.SourceJarMojo
[INFO] 
[INFO] <<< maven-source-plugin:2.2.1:jar (attach-sources) < generate-sources @ monitor <<<
[INFO] 
[INFO] --- maven-source-plugin:2.2.1:jar (attach-sources) @ monitor ---
[INFO] 
[INFO] --- maven-javadoc-plugin:2.10.3:jar (attach-javadocs) @ monitor ---
[INFO] Not executing Javadoc as the project is not a Java classpath-capable package
[INFO] 
[INFO] --- maven-install-plugin:2.4:install (default-install) @ monitor ---
[INFO] Installing /home/cibuild02/workspace/NetarchiveSuite-Full-Test-staging/monitor/pom.xml to /home/cibuild02/.m2/repository/org/netarchivesuite/monitor/5.4.3-SNAPSHOT/monitor-5.4.3-SNAPSHOT.pom
[INFO] 
[INFO] --- maven-clean-plugin:2.5:clean (default-clean) @ monitor ---
[JENKINS] Archiving disabled
[INFO]                                                                         
[INFO] ------------------------------------------------------------------------
[INFO] Building NetarchiveSuite - monitor - core 5.4.3-SNAPSHOT
[INFO] ------------------------------------------------------------------------
[INFO] 
[INFO] --- maven-clean-plugin:2.5:clean (default-clean) @ monitor-core ---
[INFO] Deleting /home/cibuild02/workspace/NetarchiveSuite-Full-Test-staging/monitor/monitor-core/target
[INFO] 
[INFO] --- jacoco-maven-plugin:0.7.9:prepare-agent (agent) @ monitor-core ---
[INFO] argLine set to -javaagent:/home/cibuild02/.m2/repository/org/jacoco/org.jacoco.agent/0.7.9/org.jacoco.agent-0.7.9-runtime.jar=destfile=/home/cibuild02/workspace/NetarchiveSuite-Full-Test-staging/monitor/monitor-core/../target/jacoco.exec,append=true
[INFO] 
[INFO] --- maven-resources-plugin:2.6:resources (default-resources) @ monitor-core ---
[INFO] Using 'UTF-8' encoding to copy filtered resources.
[INFO] Copying 7 resources
[INFO] 
[INFO] --- maven-compiler-plugin:3.1:compile (default-compile) @ monitor-core ---
[INFO] Changes detected - recompiling the module!
[INFO] Compiling 23 source files to /home/cibuild02/workspace/NetarchiveSuite-Full-Test-staging/monitor/monitor-core/target/classes
[WARNING] /home/cibuild02/workspace/NetarchiveSuite-Full-Test-staging/monitor/monitor-core/src/main/java/dk/netarkivet/monitor/webinterface/JMXSummaryUtils.java: /home/cibuild02/workspace/NetarchiveSuite-Full-Test-staging/monitor/monitor-core/src/main/java/dk/netarkivet/monitor/webinterface/JMXSummaryUtils.java uses or overrides a deprecated API.
[WARNING] /home/cibuild02/workspace/NetarchiveSuite-Full-Test-staging/monitor/monitor-core/src/main/java/dk/netarkivet/monitor/webinterface/JMXSummaryUtils.java: Recompile with -Xlint:deprecation for details.
[INFO] 
[INFO] --- maven-resources-plugin:2.6:testResources (default-testResources) @ monitor-core ---
[INFO] Using 'UTF-8' encoding to copy filtered resources.
[INFO] Copying 2 resources
[INFO] 
[INFO] --- maven-compiler-plugin:3.1:testCompile (default-testCompile) @ monitor-core ---
[INFO] Changes detected - recompiling the module!
[INFO] Compiling 6 source files to /home/cibuild02/workspace/NetarchiveSuite-Full-Test-staging/monitor/monitor-core/target/test-classes
[WARNING] /home/cibuild02/workspace/NetarchiveSuite-Full-Test-staging/monitor/monitor-core/src/test/java/dk/netarkivet/monitor/jmx/JMXUtilsTester.java:[30,33] com.sun.jndi.rmi.registry.RegistryContextFactory is internal proprietary API and may be removed in a future release
[WARNING] /home/cibuild02/workspace/NetarchiveSuite-Full-Test-staging/monitor/monitor-core/src/test/java/dk/netarkivet/monitor/jmx/JMXUtilsTester.java:[72,63] com.sun.jndi.rmi.registry.RegistryContextFactory is internal proprietary API and may be removed in a future release
[WARNING] /home/cibuild02/workspace/NetarchiveSuite-Full-Test-staging/monitor/monitor-core/src/test/java/dk/netarkivet/monitor/jmx/JMXUtilsTester.java:[74,23] com.sun.jndi.rmi.registry.RegistryContextFactory is internal proprietary API and may be removed in a future release
[INFO] 
[INFO] --- maven-surefire-plugin:2.17:test (default-test) @ monitor-core ---
[INFO] Surefire report directory: /home/cibuild02/workspace/NetarchiveSuite-Full-Test-staging/monitor/monitor-core/target/surefire-reports

-------------------------------------------------------
 T E S T S
-------------------------------------------------------
Running dk.netarkivet.monitor.logging.TestCachingSLF4JAppender
Tests run: 1, Failures: 0, Errors: 0, Skipped: 0, Time elapsed: 1.373 sec - in dk.netarkivet.monitor.logging.TestCachingSLF4JAppender
Running dk.netarkivet.monitor.jmx.JMXUtilsTester
Set property 'java.naming.factory.initial' to: com.sun.jndi.rmi.registry.RegistryContextFactory
Tests run: 2, Failures: 0, Errors: 0, Skipped: 0, Time elapsed: 0.209 sec - in dk.netarkivet.monitor.jmx.JMXUtilsTester
Running dk.netarkivet.monitor.jmx.CachingProxyFactoryConnectionTest
Tests run: 2, Failures: 0, Errors: 0, Skipped: 0, Time elapsed: 0.007 sec - in dk.netarkivet.monitor.jmx.CachingProxyFactoryConnectionTest
Running dk.netarkivet.monitor.jmx.CachingProxyConnectionFactoryTester
Tests run: 1, Failures: 0, Errors: 0, Skipped: 0, Time elapsed: 0.002 sec - in dk.netarkivet.monitor.jmx.CachingProxyConnectionFactoryTester
Running dk.netarkivet.monitor.MonitorSettingsTester
Tests run: 1, Failures: 0, Errors: 0, Skipped: 0, Time elapsed: 0.001 sec - in dk.netarkivet.monitor.MonitorSettingsTester
Running dk.netarkivet.monitor.registry.MonitorRegistryServerTester
Tests run: 2, Failures: 0, Errors: 0, Skipped: 2, Time elapsed: 0.002 sec - in dk.netarkivet.monitor.registry.MonitorRegistryServerTester

Results :

Tests run: 9, Failures: 0, Errors: 0, Skipped: 2

[JENKINS] Recording test results
[INFO] 
[INFO] --- maven-jgit-buildnumber-plugin:1.2.9:extract-buildnumber (git-buildnumber) @ monitor-core ---
[INFO] 
[INFO] --- maven-jar-plugin:2.4:jar (default-jar) @ monitor-core ---
[INFO] Building jar: /home/cibuild02/workspace/NetarchiveSuite-Full-Test-staging/monitor/monitor-core/target/monitor-core-5.4.3-SNAPSHOT.jar
[INFO] 
[INFO] >>> maven-source-plugin:2.2.1:jar (attach-sources) > generate-sources @ monitor-core >>>
[INFO] 
[INFO] --- jacoco-maven-plugin:0.7.9:prepare-agent (agent) @ monitor-core ---
[INFO] argLine set to -javaagent:/home/cibuild02/.m2/repository/org/jacoco/org.jacoco.agent/0.7.9/org.jacoco.agent-0.7.9-runtime.jar=destfile=/home/cibuild02/workspace/NetarchiveSuite-Full-Test-staging/monitor/monitor-core/../target/jacoco.exec,append=true
[WARNING] Failed to getClass for org.apache.maven.plugin.source.SourceJarMojo
[INFO] 
[INFO] <<< maven-source-plugin:2.2.1:jar (attach-sources) < generate-sources @ monitor-core <<<
[INFO] 
[INFO] --- maven-source-plugin:2.2.1:jar (attach-sources) @ monitor-core ---
[INFO] Building jar: /home/cibuild02/workspace/NetarchiveSuite-Full-Test-staging/monitor/monitor-core/target/monitor-core-5.4.3-SNAPSHOT-sources.jar
[INFO] 
[INFO] --- maven-javadoc-plugin:2.10.3:jar (attach-javadocs) @ monitor-core ---
[ERROR] Error fetching link: /home/cibuild02/workspace/NetarchiveSuite-Full-Test-staging/common/netarchivesuite-test-utils/target/apidocs/package-list. Ignored it.
[ERROR] Error fetching link: /home/cibuild02/workspace/NetarchiveSuite-Full-Test-staging/common/common-core/target/apidocs/package-list. Ignored it.
[INFO] Building jar: /home/cibuild02/workspace/NetarchiveSuite-Full-Test-staging/monitor/monitor-core/target/monitor-core-5.4.3-SNAPSHOT-javadoc.jar
[INFO] 
[INFO] --- maven-install-plugin:2.4:install (default-install) @ monitor-core ---
[INFO] Installing /home/cibuild02/workspace/NetarchiveSuite-Full-Test-staging/monitor/monitor-core/target/monitor-core-5.4.3-SNAPSHOT.jar to /home/cibuild02/.m2/repository/org/netarchivesuite/monitor-core/5.4.3-SNAPSHOT/monitor-core-5.4.3-SNAPSHOT.jar
[INFO] Installing /home/cibuild02/workspace/NetarchiveSuite-Full-Test-staging/monitor/monitor-core/pom.xml to /home/cibuild02/.m2/repository/org/netarchivesuite/monitor-core/5.4.3-SNAPSHOT/monitor-core-5.4.3-SNAPSHOT.pom
[INFO] Installing /home/cibuild02/workspace/NetarchiveSuite-Full-Test-staging/monitor/monitor-core/target/monitor-core-5.4.3-SNAPSHOT-sources.jar to /home/cibuild02/.m2/repository/org/netarchivesuite/monitor-core/5.4.3-SNAPSHOT/monitor-core-5.4.3-SNAPSHOT-sources.jar
[INFO] Installing /home/cibuild02/workspace/NetarchiveSuite-Full-Test-staging/monitor/monitor-core/target/monitor-core-5.4.3-SNAPSHOT-javadoc.jar to /home/cibuild02/.m2/repository/org/netarchivesuite/monitor-core/5.4.3-SNAPSHOT/monitor-core-5.4.3-SNAPSHOT-javadoc.jar
[INFO] 
[INFO] --- maven-clean-plugin:2.5:clean (default-clean) @ monitor-core ---
[INFO] Deleting /home/cibuild02/workspace/NetarchiveSuite-Full-Test-staging/monitor/monitor-core/target
[JENKINS] Archiving disabled
[INFO]                                                                         
[INFO] ------------------------------------------------------------------------
[INFO] Building NetarchiveSuite - wayback 5.4.3-SNAPSHOT
[INFO] ------------------------------------------------------------------------
[INFO] 
[INFO] --- maven-clean-plugin:2.5:clean (default-clean) @ wayback ---
[INFO] Deleting /home/cibuild02/workspace/NetarchiveSuite-Full-Test-staging/wayback/target
[INFO] 
[INFO] --- maven-jgit-buildnumber-plugin:1.2.9:extract-buildnumber (git-buildnumber) @ wayback ---
[INFO] 
[INFO] >>> maven-source-plugin:2.2.1:jar (attach-sources) > generate-sources @ wayback >>>
[WARNING] Failed to getClass for org.apache.maven.plugin.source.SourceJarMojo
[INFO] 
[INFO] <<< maven-source-plugin:2.2.1:jar (attach-sources) < generate-sources @ wayback <<<
[INFO] 
[INFO] --- maven-source-plugin:2.2.1:jar (attach-sources) @ wayback ---
[INFO] 
[INFO] --- maven-javadoc-plugin:2.10.3:jar (attach-javadocs) @ wayback ---
[INFO] Not executing Javadoc as the project is not a Java classpath-capable package
[INFO] 
[INFO] --- maven-install-plugin:2.4:install (default-install) @ wayback ---
[INFO] Installing /home/cibuild02/workspace/NetarchiveSuite-Full-Test-staging/wayback/pom.xml to /home/cibuild02/.m2/repository/org/netarchivesuite/wayback/5.4.3-SNAPSHOT/wayback-5.4.3-SNAPSHOT.pom
[INFO] 
[INFO] --- maven-clean-plugin:2.5:clean (default-clean) @ wayback ---
[JENKINS] Archiving disabled
[INFO]                                                                         
[INFO] ------------------------------------------------------------------------
[INFO] Building NetarchiveSuite - wayback - indexer 5.4.3-SNAPSHOT
[INFO] ------------------------------------------------------------------------
[INFO] 
[INFO] --- maven-clean-plugin:2.5:clean (default-clean) @ wayback-indexer ---
[INFO] Deleting /home/cibuild02/workspace/NetarchiveSuite-Full-Test-staging/wayback/wayback-indexer/target
[INFO] 
[INFO] --- jacoco-maven-plugin:0.7.9:prepare-agent (agent) @ wayback-indexer ---
[INFO] argLine set to -javaagent:/home/cibuild02/.m2/repository/org/jacoco/org.jacoco.agent/0.7.9/org.jacoco.agent-0.7.9-runtime.jar=destfile=/home/cibuild02/workspace/NetarchiveSuite-Full-Test-staging/wayback/wayback-indexer/../target/jacoco.exec,append=true
[INFO] 
[INFO] --- maven-resources-plugin:2.6:resources (default-resources) @ wayback-indexer ---
[INFO] Using 'UTF-8' encoding to copy filtered resources.
[INFO] Copying 1 resource
[INFO] 
[INFO] --- maven-compiler-plugin:3.1:compile (default-compile) @ wayback-indexer ---
[INFO] Changes detected - recompiling the module!
[INFO] Compiling 21 source files to /home/cibuild02/workspace/NetarchiveSuite-Full-Test-staging/wayback/wayback-indexer/target/classes
[INFO] 
[INFO] --- maven-resources-plugin:2.6:testResources (default-testResources) @ wayback-indexer ---
[INFO] Using 'UTF-8' encoding to copy filtered resources.
[INFO] Copying 1 resource
[INFO] 
[INFO] --- maven-compiler-plugin:3.1:testCompile (default-testCompile) @ wayback-indexer ---
[INFO] Changes detected - recompiling the module!
[INFO] Compiling 2 source files to /home/cibuild02/workspace/NetarchiveSuite-Full-Test-staging/wayback/wayback-indexer/target/test-classes
[INFO] 
[INFO] --- maven-surefire-plugin:2.17:test (default-test) @ wayback-indexer ---
[INFO] Surefire report directory: /home/cibuild02/workspace/NetarchiveSuite-Full-Test-staging/wayback/wayback-indexer/target/surefire-reports

-------------------------------------------------------
 T E S T S
-------------------------------------------------------
Running dk.netarkivet.wayback.UrlCanonicalizerFactoryTest
Tests run: 1, Failures: 0, Errors: 0, Skipped: 0, Time elapsed: 1.345 sec - in dk.netarkivet.wayback.UrlCanonicalizerFactoryTest
Running dk.netarkivet.wayback.indexer.HibernateUtilTest
Tests run: 1, Failures: 0, Errors: 0, Skipped: 0, Time elapsed: 4.713 sec - in dk.netarkivet.wayback.indexer.HibernateUtilTest

Results :

Tests run: 2, Failures: 0, Errors: 0, Skipped: 0

[JENKINS] Recording test results
[INFO] 
[INFO] --- maven-jgit-buildnumber-plugin:1.2.9:extract-buildnumber (git-buildnumber) @ wayback-indexer ---
[INFO] 
[INFO] --- maven-jar-plugin:2.4:jar (default-jar) @ wayback-indexer ---
[INFO] Building jar: /home/cibuild02/workspace/NetarchiveSuite-Full-Test-staging/wayback/wayback-indexer/target/wayback-indexer-5.4.3-SNAPSHOT.jar
[INFO] 
[INFO] >>> maven-source-plugin:2.2.1:jar (attach-sources) > generate-sources @ wayback-indexer >>>
[INFO] 
[INFO] --- jacoco-maven-plugin:0.7.9:prepare-agent (agent) @ wayback-indexer ---
[INFO] argLine set to -javaagent:/home/cibuild02/.m2/repository/org/jacoco/org.jacoco.agent/0.7.9/org.jacoco.agent-0.7.9-runtime.jar=destfile=/home/cibuild02/workspace/NetarchiveSuite-Full-Test-staging/wayback/wayback-indexer/../target/jacoco.exec,append=true
[WARNING] Failed to getClass for org.apache.maven.plugin.source.SourceJarMojo
[INFO] 
[INFO] <<< maven-source-plugin:2.2.1:jar (attach-sources) < generate-sources @ wayback-indexer <<<
[INFO] 
[INFO] --- maven-source-plugin:2.2.1:jar (attach-sources) @ wayback-indexer ---
[INFO] Building jar: /home/cibuild02/workspace/NetarchiveSuite-Full-Test-staging/wayback/wayback-indexer/target/wayback-indexer-5.4.3-SNAPSHOT-sources.jar
[INFO] 
[INFO] --- maven-javadoc-plugin:2.10.3:jar (attach-javadocs) @ wayback-indexer ---
[ERROR] Error fetching link: /home/cibuild02/workspace/NetarchiveSuite-Full-Test-staging/common/common-core/target/apidocs/package-list. Ignored it.
[ERROR] Error fetching link: /home/cibuild02/workspace/NetarchiveSuite-Full-Test-staging/common/common-test/target/apidocs/package-list. Ignored it.
[INFO] Building jar: /home/cibuild02/workspace/NetarchiveSuite-Full-Test-staging/wayback/wayback-indexer/target/wayback-indexer-5.4.3-SNAPSHOT-javadoc.jar
[INFO] 
[INFO] --- maven-install-plugin:2.4:install (default-install) @ wayback-indexer ---
[INFO] Installing /home/cibuild02/workspace/NetarchiveSuite-Full-Test-staging/wayback/wayback-indexer/target/wayback-indexer-5.4.3-SNAPSHOT.jar to /home/cibuild02/.m2/repository/org/netarchivesuite/wayback-indexer/5.4.3-SNAPSHOT/wayback-indexer-5.4.3-SNAPSHOT.jar
[INFO] Installing /home/cibuild02/workspace/NetarchiveSuite-Full-Test-staging/wayback/wayback-indexer/pom.xml to /home/cibuild02/.m2/repository/org/netarchivesuite/wayback-indexer/5.4.3-SNAPSHOT/wayback-indexer-5.4.3-SNAPSHOT.pom
[INFO] Installing /home/cibuild02/workspace/NetarchiveSuite-Full-Test-staging/wayback/wayback-indexer/target/wayback-indexer-5.4.3-SNAPSHOT-sources.jar to /home/cibuild02/.m2/repository/org/netarchivesuite/wayback-indexer/5.4.3-SNAPSHOT/wayback-indexer-5.4.3-SNAPSHOT-sources.jar
[INFO] Installing /home/cibuild02/workspace/NetarchiveSuite-Full-Test-staging/wayback/wayback-indexer/target/wayback-indexer-5.4.3-SNAPSHOT-javadoc.jar to /home/cibuild02/.m2/repository/org/netarchivesuite/wayback-indexer/5.4.3-SNAPSHOT/wayback-indexer-5.4.3-SNAPSHOT-javadoc.jar
[INFO] 
[INFO] --- maven-clean-plugin:2.5:clean (default-clean) @ wayback-indexer ---
[INFO] Deleting /home/cibuild02/workspace/NetarchiveSuite-Full-Test-staging/wayback/wayback-indexer/target
[JENKINS] Archiving disabled
[INFO]                                                                         
[INFO] ------------------------------------------------------------------------
[INFO] Building NetarchiveSuite - deploy 5.4.3-SNAPSHOT
[INFO] ------------------------------------------------------------------------
[INFO] 
[INFO] --- maven-clean-plugin:2.5:clean (default-clean) @ deploy ---
[INFO] Deleting /home/cibuild02/workspace/NetarchiveSuite-Full-Test-staging/deploy/target
[INFO] 
[INFO] --- maven-jgit-buildnumber-plugin:1.2.9:extract-buildnumber (git-buildnumber) @ deploy ---
[INFO] 
[INFO] >>> maven-source-plugin:2.2.1:jar (attach-sources) > generate-sources @ deploy >>>
[WARNING] Failed to getClass for org.apache.maven.plugin.source.SourceJarMojo
[INFO] 
[INFO] <<< maven-source-plugin:2.2.1:jar (attach-sources) < generate-sources @ deploy <<<
[INFO] 
[INFO] --- maven-source-plugin:2.2.1:jar (attach-sources) @ deploy ---
[INFO] 
[INFO] --- maven-javadoc-plugin:2.10.3:jar (attach-javadocs) @ deploy ---
[INFO] Not executing Javadoc as the project is not a Java classpath-capable package
[INFO] 
[INFO] --- maven-install-plugin:2.4:install (default-install) @ deploy ---
[INFO] Installing /home/cibuild02/workspace/NetarchiveSuite-Full-Test-staging/deploy/pom.xml to /home/cibuild02/.m2/repository/org/netarchivesuite/deploy/5.4.3-SNAPSHOT/deploy-5.4.3-SNAPSHOT.pom
[INFO] 
[INFO] --- maven-clean-plugin:2.5:clean (default-clean) @ deploy ---
[JENKINS] Archiving disabled
[INFO]                                                                         
[INFO] ------------------------------------------------------------------------
[INFO] Building NetarchiveSuite - deploy - core 5.4.3-SNAPSHOT
[INFO] ------------------------------------------------------------------------
[INFO] 
[INFO] --- maven-clean-plugin:2.5:clean (default-clean) @ deploy-core ---
[INFO] 
[INFO] --- jacoco-maven-plugin:0.7.9:prepare-agent (agent) @ deploy-core ---
[INFO] argLine set to -javaagent:/home/cibuild02/.m2/repository/org/jacoco/org.jacoco.agent/0.7.9/org.jacoco.agent-0.7.9-runtime.jar=destfile=/home/cibuild02/workspace/NetarchiveSuite-Full-Test-staging/deploy/deploy-core/../target/jacoco.exec,append=true
[INFO] 
[INFO] --- maven-resources-plugin:2.6:resources (default-resources) @ deploy-core ---
[INFO] Using 'UTF-8' encoding to copy filtered resources.
[INFO] Copying 1 resource
[INFO] 
[INFO] --- maven-compiler-plugin:3.1:compile (default-compile) @ deploy-core ---
[INFO] Changes detected - recompiling the module!
[INFO] Compiling 16 source files to /home/cibuild02/workspace/NetarchiveSuite-Full-Test-staging/deploy/deploy-core/target/classes
[INFO] 
[INFO] --- maven-resources-plugin:2.6:testResources (default-testResources) @ deploy-core ---
[INFO] Using 'UTF-8' encoding to copy filtered resources.
[INFO] Copying 8 resources
[INFO] 
[INFO] --- maven-compiler-plugin:3.1:testCompile (default-testCompile) @ deploy-core ---
[INFO] Changes detected - recompiling the module!
[INFO] Compiling 3 source files to /home/cibuild02/workspace/NetarchiveSuite-Full-Test-staging/deploy/deploy-core/target/test-classes
[INFO] 
[INFO] --- maven-surefire-plugin:2.17:test (default-test) @ deploy-core ---
[INFO] Surefire report directory: /home/cibuild02/workspace/NetarchiveSuite-Full-Test-staging/deploy/deploy-core/target/surefire-reports

-------------------------------------------------------
 T E S T S
-------------------------------------------------------
Running dk.netarkivet.deploy.TestTemplate
Tests run: 1, Failures: 0, Errors: 0, Skipped: 0, Time elapsed: 0.209 sec - in dk.netarkivet.deploy.TestTemplate
Running dk.netarkivet.deploy.TestScripts
Will read source files using encoding 'UTF-8' (defaulted)
Machine 'kb-test-adm-001.kb.dk' configured with encoding 'UTF-8' (defaulted)
Machine 'kb-test-bar-010.bitarkiv.kb.dk' configured with encoding 'UTF-8' (defaulted)
Machine 'kb-test-bar-011.bitarkiv.kb.dk' configured with encoding 'UTF-8' (defaulted)
Machine 'kb-test-har-001.kb.dk' configured with encoding 'UTF-8' (defaulted)
Machine 'kb-test-har-002.kb.dk' configured with encoding 'UTF-8' (defaulted)
Machine 'kb-test-acs-001.kb.dk' configured with encoding 'UTF-8' (defaulted)
Machine 'sb-test-har-001.statsbiblioteket.dk' configured with encoding 'UTF-8' (defaulted)
Machine 'sb-test-bar-001.statsbiblioteket.dk' configured with encoding 'UTF-8' (defaulted)
Machine 'sb-test-acs-001.statsbiblioteket.dk' configured with encoding 'UTF-8' (defaulted)
Warning: A NetarchiveSuite file already exists. It will be overridden. /home/cibuild02/workspace/NetarchiveSuite-Full-Test-staging/deploy/deploy-core/nas.zip
Tests run: 1, Failures: 0, Errors: 0, Skipped: 0, Time elapsed: 1.71 sec - in dk.netarkivet.deploy.TestScripts

Results :

Tests run: 2, Failures: 0, Errors: 0, Skipped: 0

[JENKINS] Recording test results
[INFO] 
[INFO] --- maven-jgit-buildnumber-plugin:1.2.9:extract-buildnumber (git-buildnumber) @ deploy-core ---
[INFO] 
[INFO] --- maven-jar-plugin:2.4:jar (default-jar) @ deploy-core ---
[INFO] Building jar: /home/cibuild02/workspace/NetarchiveSuite-Full-Test-staging/deploy/deploy-core/target/deploy-core-5.4.3-SNAPSHOT.jar
[INFO] 
[INFO] >>> maven-source-plugin:2.2.1:jar (attach-sources) > generate-sources @ deploy-core >>>
[INFO] 
[INFO] --- jacoco-maven-plugin:0.7.9:prepare-agent (agent) @ deploy-core ---
[INFO] argLine set to -javaagent:/home/cibuild02/.m2/repository/org/jacoco/org.jacoco.agent/0.7.9/org.jacoco.agent-0.7.9-runtime.jar=destfile=/home/cibuild02/workspace/NetarchiveSuite-Full-Test-staging/deploy/deploy-core/../target/jacoco.exec,append=true
[WARNING] Failed to getClass for org.apache.maven.plugin.source.SourceJarMojo
[INFO] 
[INFO] <<< maven-source-plugin:2.2.1:jar (attach-sources) < generate-sources @ deploy-core <<<
[INFO] 
[INFO] --- maven-source-plugin:2.2.1:jar (attach-sources) @ deploy-core ---
[INFO] Building jar: /home/cibuild02/workspace/NetarchiveSuite-Full-Test-staging/deploy/deploy-core/target/deploy-core-5.4.3-SNAPSHOT-sources.jar
[INFO] 
[INFO] --- maven-javadoc-plugin:2.10.3:jar (attach-javadocs) @ deploy-core ---
[INFO] The goal 'org.apache.maven.plugins:maven-javadoc-plugin:2.10.3:javadoc' has not been previously called for the module: 'org.netarchivesuite:archive-core:jar:5.4.3-SNAPSHOT'. Trying to invoke it...
[ERROR] MavenInvocationException: Error when invoking Maven, consult the invoker log file: /home/cibuild02/workspace/NetarchiveSuite-Full-Test-staging/deploy/deploy-core/target/invoker/maven-javadoc-plugin2045686142.txt
[WARNING] Creating fake javadoc directory to prevent repeated invocations: /home/cibuild02/workspace/NetarchiveSuite-Full-Test-staging/archive/archive-core/target/apidocs
[INFO] The goal 'org.apache.maven.plugins:maven-javadoc-plugin:2.10.3:javadoc' has not been previously called for the module: 'org.netarchivesuite:harvest-scheduler:jar:5.4.3-SNAPSHOT'. Trying to invoke it...
channel stopped
Build was aborted
Aborted by Colin Rosenthal (csr)
Warning: you have no plugins providing access control for builds, so falling back to legacy behavior of permitting any downstream builds to be triggered
Finished: ABORTED