UnstableConsole Output

Started by an SCM change
Building remotely on ParallelNode in workspace /home/cibuild01/workspace/JWAT
[JWAT] $ hg showconfig paths.default
[JWAT] $ hg pull --rev default
pulling from https://bitbucket.org/nclarkekb/jwat
no changes found
[JWAT] $ hg update --clean --rev default
2 files updated, 0 files merged, 0 files removed, 0 files unresolved
[JWAT] $ hg --config extensions.purge= clean --all
[JWAT] $ hg log --rev . --template {node}
[JWAT] $ hg log --rev . --template {rev}
[JWAT] $ hg log --rev 85d002ba5ce25e1d2c6462ac291c730b17b918aa
changeset:   269:85d002ba5ce2
user:        nclarkekb
date:        Thu Jun 22 00:52:56 2017 +0200
summary:     CR-JWAS-33: Follow-up on review.

[JWAT] $ hg log --template "<changeset node='{node}' author='{author|xmlescape}' rev='{rev}' date='{date}'><msg>{desc|xmlescape}</msg><added>{file_adds|stringify|xmlescape}</added><deleted>{file_dels|stringify|xmlescape}</deleted><files>{files|stringify|xmlescape}</files><parents>{parents}</parents></changeset>\n" --rev default:0 --follow --prune 85d002ba5ce25e1d2c6462ac291c730b17b918aa --encoding UTF-8 --encodingmode replace
Parsing POMs
Established TCP socket on 44246
maven32-agent.jar already up to date
maven32-interceptor.jar already up to date
maven3-interceptor-commons.jar already up to date
[JWAT] $ /home/cibuild01/tools/hudson.model.JDK/Java8/bin/java -cp /home/cibuild01/maven32-agent.jar:/home/cibuild01/tools/hudson.tasks.Maven_MavenInstallation/Maven3/boot/plexus-classworlds-2.5.2.jar:/home/cibuild01/tools/hudson.tasks.Maven_MavenInstallation/Maven3/conf/logging jenkins.maven3.agent.Maven32Main /home/cibuild01/tools/hudson.tasks.Maven_MavenInstallation/Maven3 /home/cibuild01/slave.jar /home/cibuild01/maven32-interceptor.jar /home/cibuild01/maven3-interceptor-commons.jar 44246
<===[JENKINS REMOTING CAPACITY]===>channel started
Executing Maven:  -B -f /home/cibuild01/workspace/JWAT/pom.xml install
[INFO] Scanning for projects...
[INFO] ------------------------------------------------------------------------
[INFO] Reactor Build Order:
[INFO] 
[INFO] jwat
[INFO] jwat-common
[INFO] jwat-archive-common
[INFO] jwat-gzip
[INFO] jwat-arc
[INFO] jwat-warc
[INFO] jwat-archive
[INFO] jwat-distribution
[INFO]                                                                         
[INFO] ------------------------------------------------------------------------
[INFO] Building jwat 1.1.0-SNAPSHOT
[INFO] ------------------------------------------------------------------------
[INFO] 
[INFO] --- maven-enforcer-plugin:1.0:enforce (enforce-maven) @ jwat ---
[INFO] 
[INFO] --- maven-site-plugin:3.4:attach-descriptor (attach-descriptor) @ jwat ---
[INFO] 
[INFO] --- maven-source-plugin:2.4:jar-no-fork (attach-sources) @ jwat ---
[INFO] 
[INFO] --- maven-javadoc-plugin:2.10.3:jar (attach-javadocs) @ jwat ---
[INFO] Not executing Javadoc as the project is not a Java classpath-capable package
[INFO] 
[INFO] --- maven-install-plugin:2.4:install (default-install) @ jwat ---
[INFO] Installing /home/cibuild01/workspace/JWAT/pom.xml to /home/cibuild01/.m2/repository/org/jwat/jwat/1.1.0-SNAPSHOT/jwat-1.1.0-SNAPSHOT.pom
[JENKINS] Archiving disabled
[INFO]                                                                         
[INFO] ------------------------------------------------------------------------
[INFO] Building jwat-common 1.1.0-SNAPSHOT
[INFO] ------------------------------------------------------------------------
[INFO] 
[INFO] --- maven-enforcer-plugin:1.0:enforce (enforce-maven) @ jwat-common ---
[INFO] 
[INFO] --- maven-resources-plugin:2.6:resources (default-resources) @ jwat-common ---
[INFO] Using 'UTF-8' encoding to copy filtered resources.
[INFO] skip non existing resourceDirectory /home/cibuild01/workspace/JWAT/jwat-common/src/main/resources
[INFO] 
[INFO] --- maven-compiler-plugin:3.3:compile (default-compile) @ jwat-common ---
[INFO] Changes detected - recompiling the module!
[INFO] Compiling 38 source files to /home/cibuild01/workspace/JWAT/jwat-common/target/classes
[INFO] 
[INFO] --- maven-resources-plugin:2.6:testResources (default-testResources) @ jwat-common ---
[INFO] Using 'UTF-8' encoding to copy filtered resources.
[INFO] Copying 1 resource
[INFO] 
[INFO] --- maven-compiler-plugin:3.3:testCompile (default-testCompile) @ jwat-common ---
[INFO] Changes detected - recompiling the module!
[INFO] Compiling 47 source files to /home/cibuild01/workspace/JWAT/jwat-common/target/test-classes
[INFO] 
[INFO] --- maven-surefire-plugin:2.12.4:test (default-test) @ jwat-common ---
[INFO] Surefire report directory: /home/cibuild01/workspace/JWAT/jwat-common/target/surefire-reports

-------------------------------------------------------
 T E S T S
-------------------------------------------------------
Running org.jwat.common.TestScheme
Tests run: 1, Failures: 0, Errors: 0, Skipped: 0, Time elapsed: 0.151 sec
Running org.jwat.common.TestHttpHeader
Tests run: 1, Failures: 0, Errors: 0, Skipped: 0, Time elapsed: 0.006 sec
Running org.jwat.common.TestDiagnosisType
Tests run: 1, Failures: 0, Errors: 0, Skipped: 0, Time elapsed: 0 sec
Running org.jwat.common.TestANVLRecord
Tests run: 1, Failures: 0, Errors: 0, Skipped: 0, Time elapsed: 0 sec
Running org.jwat.common.TestPayload
Tests run: 4, Failures: 0, Errors: 0, Skipped: 0, Time elapsed: 0.456 sec
Running org.jwat.common.TestHeaderLineReader_HeaderLineReader
Tests run: 5, Failures: 0, Errors: 0, Skipped: 0, Time elapsed: 0.041 sec
Running org.jwat.common.TestBase32
Tests run: 2, Failures: 0, Errors: 0, Skipped: 0, Time elapsed: 1.33 sec
Running org.jwat.common.TestMaxLengthRecordingInputStream
Tests run: 1, Failures: 0, Errors: 0, Skipped: 0, Time elapsed: 0.577 sec
Running org.jwat.common.TestHeaderLine
Tests run: 1, Failures: 0, Errors: 0, Skipped: 0, Time elapsed: 2.882 sec
Running org.jwat.common.TestUri
Tests run: 2, Failures: 0, Errors: 0, Skipped: 0, Time elapsed: 0.117 sec
Running org.jwat.common.TestHttpHeader_Response
Tests run: 3, Failures: 0, Errors: 0, Skipped: 0, Time elapsed: 0.309 sec
Running org.jwat.common.TestNewlineParser
Tests run: 2, Failures: 0, Errors: 0, Skipped: 0, Time elapsed: 0.011 sec
Running org.jwat.common.TestHeaderLineReader
Tests run: 1, Failures: 0, Errors: 0, Skipped: 0, Time elapsed: 0.011 sec
Running org.jwat.common.TestDiagnosis
Tests run: 2, Failures: 0, Errors: 0, Skipped: 0, Time elapsed: 0.016 sec
Running org.jwat.common.TestMaxLengthRecordingInputStreamUnderflow
Tests run: 1, Failures: 0, Errors: 0, Skipped: 0, Time elapsed: 0.009 sec
Running org.jwat.common.TestRandomAccessFileStreams
Tests run: 1, Failures: 0, Errors: 0, Skipped: 0, Time elapsed: 0.318 sec
Running org.jwat.common.TestUtf8
Tests run: 3, Failures: 0, Errors: 0, Skipped: 0, Time elapsed: 0.587 sec
Running org.jwat.common.TestHttpHeader_IsValidMethods
Tests run: 2, Failures: 0, Errors: 0, Skipped: 0, Time elapsed: 0.007 sec
Running org.jwat.common.TestUriProfile
Tests run: 1, Failures: 0, Errors: 0, Skipped: 0, Time elapsed: 0.006 sec
Running org.jwat.common.TestByteArrayIOStream
Tests run: 4, Failures: 0, Errors: 0, Skipped: 0, Time elapsed: 0.033 sec
Running org.jwat.common.TestDigest
Tests run: 2, Failures: 0, Errors: 0, Skipped: 0, Time elapsed: 0.008 sec
Running org.jwat.common.TestBase64
Tests run: 2, Failures: 0, Errors: 0, Skipped: 0, Time elapsed: 0.578 sec
Running org.jwat.common.TestPayloadHttpResponse
Tests run: 2, Failures: 0, Errors: 0, Skipped: 0, Time elapsed: 0.312 sec
Running org.jwat.common.TestFixedLengthInputStream
Tests run: 1, Failures: 0, Errors: 0, Skipped: 0, Time elapsed: 0.406 sec
Running org.jwat.common.TestQuotedPrintable
Tests run: 1, Failures: 0, Errors: 0, Skipped: 0, Time elapsed: 0.007 sec
Running org.jwat.common.Test_Skip
Tests run: 1, Failures: 0, Errors: 0, Skipped: 0, Time elapsed: 0.006 sec
Running org.jwat.common.TestEncodedWords
Tests run: 1, Failures: 0, Errors: 0, Skipped: 0, Time elapsed: 0.039 sec
Running org.jwat.common.Test_StreamsInStreams
Tests run: 1, Failures: 0, Errors: 0, Skipped: 0, Time elapsed: 0.179 sec
Running org.jwat.common.TestContentType
Tests run: 2, Failures: 0, Errors: 0, Skipped: 0, Time elapsed: 0.009 sec
Running org.jwat.common.Test_AdditionalReadMethods
Tests run: 4, Failures: 0, Errors: 0, Skipped: 0, Time elapsed: 8.544 sec
Running org.jwat.common.TestCharCountingStringReader
Tests run: 1, Failures: 0, Errors: 0, Skipped: 0, Time elapsed: 0.432 sec
Running org.jwat.common.TestByteCountingPushbackInputStream
Tests run: 1, Failures: 0, Errors: 0, Skipped: 0, Time elapsed: 0.59 sec
Running org.jwat.common.TestByteArrayOutputStreamWithUnread
Tests run: 1, Failures: 0, Errors: 0, Skipped: 0, Time elapsed: 0.424 sec
Running org.jwat.common.TestBase16
Tests run: 1, Failures: 0, Errors: 0, Skipped: 0, Time elapsed: 0.335 sec
Running org.jwat.common.TestByteCountingPushbackInputStreamPeek
Tests run: 1, Failures: 0, Errors: 0, Skipped: 0, Time elapsed: 0.006 sec
Running org.jwat.common.TestArrayUtils
Tests run: 5, Failures: 0, Errors: 0, Skipped: 0, Time elapsed: 0.021 sec
Running org.jwat.common.TestInputStreamNoSkip
Tests run: 1, Failures: 0, Errors: 0, Skipped: 0, Time elapsed: 0.035 sec
Running org.jwat.common.TestIPAddressParser
Tests run: 1, Failures: 0, Errors: 0, Skipped: 0, Time elapsed: 0.029 sec
Running org.jwat.common.TestFieldValidator
Tests run: 1, Failures: 0, Errors: 0, Skipped: 0, Time elapsed: 0.004 sec
Running org.jwat.common.TestHttpHeader_Request
Tests run: 3, Failures: 0, Errors: 0, Skipped: 0, Time elapsed: 0.556 sec
Running org.jwat.common.TestByteCountingInputStream
Tests run: 1, Failures: 0, Errors: 0, Skipped: 0, Time elapsed: 0.587 sec
Running org.jwat.common.TestISO8859_1
Tests run: 2, Failures: 0, Errors: 0, Skipped: 0, Time elapsed: 0.066 sec
Running org.jwat.common.TestDigestInputStream
Tests run: 1, Failures: 0, Errors: 0, Skipped: 0, Time elapsed: 0.455 sec
Running org.jwat.common.TestHeaderLineReader_LineReader
Tests run: 3, Failures: 0, Errors: 0, Skipped: 0, Time elapsed: 0.017 sec
Running org.jwat.common.TestBase2
Tests run: 1, Failures: 0, Errors: 0, Skipped: 0, Time elapsed: 0.468 sec

Results :

Tests run: 80, Failures: 0, Errors: 0, Skipped: 0

[JENKINS] Recording test results
log4j:WARN No appenders could be found for logger (org.apache.commons.beanutils.converters.BooleanConverter).
log4j:WARN Please initialize the log4j system properly.
[INFO] 
[INFO] --- maven-jar-plugin:2.4:jar (default-jar) @ jwat-common ---
[INFO] Building jar: /home/cibuild01/workspace/JWAT/jwat-common/target/jwat-common-1.1.0-SNAPSHOT.jar
[INFO] 
[INFO] --- maven-site-plugin:3.4:attach-descriptor (attach-descriptor) @ jwat-common ---
[INFO] 
[INFO] --- maven-source-plugin:2.4:jar-no-fork (attach-sources) @ jwat-common ---
[INFO] Building jar: /home/cibuild01/workspace/JWAT/jwat-common/target/jwat-common-1.1.0-SNAPSHOT-sources.jar
[INFO] 
[INFO] --- maven-javadoc-plugin:2.10.3:jar (attach-javadocs) @ jwat-common ---
[INFO] Building jar: /home/cibuild01/workspace/JWAT/jwat-common/target/jwat-common-1.1.0-SNAPSHOT-javadoc.jar
[INFO] 
[INFO] --- maven-install-plugin:2.4:install (default-install) @ jwat-common ---
[INFO] Installing /home/cibuild01/workspace/JWAT/jwat-common/target/jwat-common-1.1.0-SNAPSHOT.jar to /home/cibuild01/.m2/repository/org/jwat/jwat-common/1.1.0-SNAPSHOT/jwat-common-1.1.0-SNAPSHOT.jar
[INFO] Installing /home/cibuild01/workspace/JWAT/jwat-common/pom.xml to /home/cibuild01/.m2/repository/org/jwat/jwat-common/1.1.0-SNAPSHOT/jwat-common-1.1.0-SNAPSHOT.pom
[INFO] Installing /home/cibuild01/workspace/JWAT/jwat-common/target/jwat-common-1.1.0-SNAPSHOT-sources.jar to /home/cibuild01/.m2/repository/org/jwat/jwat-common/1.1.0-SNAPSHOT/jwat-common-1.1.0-SNAPSHOT-sources.jar
[INFO] Installing /home/cibuild01/workspace/JWAT/jwat-common/target/jwat-common-1.1.0-SNAPSHOT-javadoc.jar to /home/cibuild01/.m2/repository/org/jwat/jwat-common/1.1.0-SNAPSHOT/jwat-common-1.1.0-SNAPSHOT-javadoc.jar
[JENKINS] Archiving disabled
[INFO]                                                                         
[INFO] ------------------------------------------------------------------------
[INFO] Building jwat-archive-common 1.1.0-SNAPSHOT
[INFO] ------------------------------------------------------------------------
[INFO] 
[INFO] --- maven-enforcer-plugin:1.0:enforce (enforce-maven) @ jwat-archive-common ---
[INFO] 
[INFO] --- maven-resources-plugin:2.6:resources (default-resources) @ jwat-archive-common ---
[INFO] Using 'UTF-8' encoding to copy filtered resources.
[INFO] skip non existing resourceDirectory /home/cibuild01/workspace/JWAT/jwat-archive-common/src/main/resources
[INFO] 
[INFO] --- maven-compiler-plugin:3.3:compile (default-compile) @ jwat-archive-common ---
[INFO] Changes detected - recompiling the module!
[INFO] Compiling 1 source file to /home/cibuild01/workspace/JWAT/jwat-archive-common/target/classes
[INFO] 
[INFO] --- maven-resources-plugin:2.6:testResources (default-testResources) @ jwat-archive-common ---
[INFO] Using 'UTF-8' encoding to copy filtered resources.
[INFO] skip non existing resourceDirectory /home/cibuild01/workspace/JWAT/jwat-archive-common/src/test/resources
[INFO] 
[INFO] --- maven-compiler-plugin:3.3:testCompile (default-testCompile) @ jwat-archive-common ---
[INFO] Changes detected - recompiling the module!
[INFO] Compiling 1 source file to /home/cibuild01/workspace/JWAT/jwat-archive-common/target/test-classes
[INFO] 
[INFO] --- maven-surefire-plugin:2.12.4:test (default-test) @ jwat-archive-common ---
[INFO] Surefire report directory: /home/cibuild01/workspace/JWAT/jwat-archive-common/target/surefire-reports

-------------------------------------------------------
 T E S T S
-------------------------------------------------------
Running org.jwat.archive.common.TestReaderFactoryAbstract
Tests run: 3, Failures: 0, Errors: 0, Skipped: 0, Time elapsed: 0.146 sec

Results :

Tests run: 3, Failures: 0, Errors: 0, Skipped: 0

[JENKINS] Recording test results
[INFO] 
[INFO] --- maven-jar-plugin:2.4:jar (default-jar) @ jwat-archive-common ---
[INFO] Building jar: /home/cibuild01/workspace/JWAT/jwat-archive-common/target/jwat-archive-common-1.1.0-SNAPSHOT.jar
[INFO] 
[INFO] --- maven-site-plugin:3.4:attach-descriptor (attach-descriptor) @ jwat-archive-common ---
[INFO] 
[INFO] --- maven-source-plugin:2.4:jar-no-fork (attach-sources) @ jwat-archive-common ---
[INFO] Building jar: /home/cibuild01/workspace/JWAT/jwat-archive-common/target/jwat-archive-common-1.1.0-SNAPSHOT-sources.jar
[INFO] 
[INFO] --- maven-javadoc-plugin:2.10.3:jar (attach-javadocs) @ jwat-archive-common ---
[INFO] Building jar: /home/cibuild01/workspace/JWAT/jwat-archive-common/target/jwat-archive-common-1.1.0-SNAPSHOT-javadoc.jar
[INFO] 
[INFO] --- maven-install-plugin:2.4:install (default-install) @ jwat-archive-common ---
[INFO] Installing /home/cibuild01/workspace/JWAT/jwat-archive-common/target/jwat-archive-common-1.1.0-SNAPSHOT.jar to /home/cibuild01/.m2/repository/org/jwat/jwat-archive-common/1.1.0-SNAPSHOT/jwat-archive-common-1.1.0-SNAPSHOT.jar
[INFO] Installing /home/cibuild01/workspace/JWAT/jwat-archive-common/pom.xml to /home/cibuild01/.m2/repository/org/jwat/jwat-archive-common/1.1.0-SNAPSHOT/jwat-archive-common-1.1.0-SNAPSHOT.pom
[INFO] Installing /home/cibuild01/workspace/JWAT/jwat-archive-common/target/jwat-archive-common-1.1.0-SNAPSHOT-sources.jar to /home/cibuild01/.m2/repository/org/jwat/jwat-archive-common/1.1.0-SNAPSHOT/jwat-archive-common-1.1.0-SNAPSHOT-sources.jar
[INFO] Installing /home/cibuild01/workspace/JWAT/jwat-archive-common/target/jwat-archive-common-1.1.0-SNAPSHOT-javadoc.jar to /home/cibuild01/.m2/repository/org/jwat/jwat-archive-common/1.1.0-SNAPSHOT/jwat-archive-common-1.1.0-SNAPSHOT-javadoc.jar
[JENKINS] Archiving disabled
[INFO]                                                                         
[INFO] ------------------------------------------------------------------------
[INFO] Building jwat-gzip 1.1.0-SNAPSHOT
[INFO] ------------------------------------------------------------------------
[INFO] 
[INFO] --- maven-enforcer-plugin:1.0:enforce (enforce-maven) @ jwat-gzip ---
[INFO] 
[INFO] --- maven-resources-plugin:2.6:resources (default-resources) @ jwat-gzip ---
[INFO] Using 'UTF-8' encoding to copy filtered resources.
[INFO] skip non existing resourceDirectory /home/cibuild01/workspace/JWAT/jwat-gzip/src/main/resources
[INFO] 
[INFO] --- maven-compiler-plugin:3.3:compile (default-compile) @ jwat-gzip ---
[INFO] Changes detected - recompiling the module!
[INFO] Compiling 5 source files to /home/cibuild01/workspace/JWAT/jwat-gzip/target/classes
[INFO] 
[INFO] --- maven-resources-plugin:2.6:testResources (default-testResources) @ jwat-gzip ---
[INFO] Using 'UTF-8' encoding to copy filtered resources.
[INFO] Copying 8 resources
[INFO] 
[INFO] --- maven-compiler-plugin:3.3:testCompile (default-testCompile) @ jwat-gzip ---
[INFO] Changes detected - recompiling the module!
[INFO] Compiling 17 source files to /home/cibuild01/workspace/JWAT/jwat-gzip/target/test-classes
[INFO] 
[INFO] --- maven-surefire-plugin:2.12.4:test (default-test) @ jwat-gzip ---
[INFO] Surefire report directory: /home/cibuild01/workspace/JWAT/jwat-gzip/target/surefire-reports

-------------------------------------------------------
 T E S T S
-------------------------------------------------------
Running org.jwat.gzip.Test_Params
Tests run: 1, Failures: 0, Errors: 0, Skipped: 0, Time elapsed: 0.252 sec
Running org.jwat.gzip.TestGzipReader_IsMagic
Tests run: 2, Failures: 0, Errors: 0, Skipped: 0, Time elapsed: 0.011 sec
Running org.jwat.gzip.TestGzipReader_InvalidFiles
Tests run: 3, Failures: 0, Errors: 0, Skipped: 0, Time elapsed: 0.03 sec
Running org.jwat.gzip.TestGzipReader
Tests run: 2, Failures: 0, Errors: 0, Skipped: 0, Time elapsed: 0.416 sec
Running org.jwat.gzip.Test_Encoding
Tests run: 1, Failures: 0, Errors: 0, Skipped: 0, Time elapsed: 0.039 sec
Running org.jwat.gzip.TestGzipReader_InputStreamReadSkip
Tests run: 1, Failures: 0, Errors: 0, Skipped: 0, Time elapsed: 3.707 sec
Running org.jwat.gzip.TestGzipException
Tests run: 2, Failures: 0, Errors: 0, Skipped: 0, Time elapsed: 0.066 sec
Running org.jwat.gzip.TestGzipExtraData
Tests run: 1, Failures: 0, Errors: 0, Skipped: 0, Time elapsed: 0.105 sec
Running org.jwat.gzip.TestGzipReader_InputStream
Tests run: 1, Failures: 0, Errors: 0, Skipped: 0, Time elapsed: 0.385 sec
Running org.jwat.gzip.TestGzipReader_InputStreamSkippingClose
Tests run: 1, Failures: 0, Errors: 0, Skipped: 0, Time elapsed: 0.206 sec
Running org.jwat.gzip.TestGzipWriter
Tests run: 1, Failures: 0, Errors: 0, Skipped: 0, Time elapsed: 0.928 sec
Running org.jwat.gzip.Test_Flagged
Tests run: 2, Failures: 0, Errors: 0, Skipped: 0, Time elapsed: 0.031 sec
Running org.jwat.gzip.TestGzipWriter_Cloning
Tests run: 1, Failures: 0, Errors: 0, Skipped: 0, Time elapsed: 1.031 sec

Results :

Tests run: 19, Failures: 0, Errors: 0, Skipped: 0

[JENKINS] Recording test results
[INFO] 
[INFO] --- maven-jar-plugin:2.4:jar (default-jar) @ jwat-gzip ---
[INFO] Building jar: /home/cibuild01/workspace/JWAT/jwat-gzip/target/jwat-gzip-1.1.0-SNAPSHOT.jar
[INFO] 
[INFO] --- maven-site-plugin:3.4:attach-descriptor (attach-descriptor) @ jwat-gzip ---
[INFO] 
[INFO] --- maven-source-plugin:2.4:jar-no-fork (attach-sources) @ jwat-gzip ---
[INFO] Building jar: /home/cibuild01/workspace/JWAT/jwat-gzip/target/jwat-gzip-1.1.0-SNAPSHOT-sources.jar
[INFO] 
[INFO] --- maven-javadoc-plugin:2.10.3:jar (attach-javadocs) @ jwat-gzip ---
[INFO] Building jar: /home/cibuild01/workspace/JWAT/jwat-gzip/target/jwat-gzip-1.1.0-SNAPSHOT-javadoc.jar
[INFO] 
[INFO] --- maven-install-plugin:2.4:install (default-install) @ jwat-gzip ---
[INFO] Installing /home/cibuild01/workspace/JWAT/jwat-gzip/target/jwat-gzip-1.1.0-SNAPSHOT.jar to /home/cibuild01/.m2/repository/org/jwat/jwat-gzip/1.1.0-SNAPSHOT/jwat-gzip-1.1.0-SNAPSHOT.jar
[INFO] Installing /home/cibuild01/workspace/JWAT/jwat-gzip/pom.xml to /home/cibuild01/.m2/repository/org/jwat/jwat-gzip/1.1.0-SNAPSHOT/jwat-gzip-1.1.0-SNAPSHOT.pom
[INFO] Installing /home/cibuild01/workspace/JWAT/jwat-gzip/target/jwat-gzip-1.1.0-SNAPSHOT-sources.jar to /home/cibuild01/.m2/repository/org/jwat/jwat-gzip/1.1.0-SNAPSHOT/jwat-gzip-1.1.0-SNAPSHOT-sources.jar
[INFO] Installing /home/cibuild01/workspace/JWAT/jwat-gzip/target/jwat-gzip-1.1.0-SNAPSHOT-javadoc.jar to /home/cibuild01/.m2/repository/org/jwat/jwat-gzip/1.1.0-SNAPSHOT/jwat-gzip-1.1.0-SNAPSHOT-javadoc.jar
[JENKINS] Archiving disabled
[INFO]                                                                         
[INFO] ------------------------------------------------------------------------
[INFO] Building jwat-arc 1.1.0-SNAPSHOT
[INFO] ------------------------------------------------------------------------
[INFO] 
[INFO] --- maven-enforcer-plugin:1.0:enforce (enforce-maven) @ jwat-arc ---
[INFO] 
[INFO] --- maven-resources-plugin:2.6:resources (default-resources) @ jwat-arc ---
[INFO] Using 'UTF-8' encoding to copy filtered resources.
[INFO] skip non existing resourceDirectory /home/cibuild01/workspace/JWAT/jwat-arc/src/main/resources
[INFO] 
[INFO] --- maven-compiler-plugin:3.3:compile (default-compile) @ jwat-arc ---
[INFO] Changes detected - recompiling the module!
[INFO] Compiling 22 source files to /home/cibuild01/workspace/JWAT/jwat-arc/target/classes
[INFO] 
[INFO] --- maven-resources-plugin:2.6:testResources (default-testResources) @ jwat-arc ---
[INFO] Using 'UTF-8' encoding to copy filtered resources.
[INFO] Copying 8 resources
[INFO] 
[INFO] --- maven-compiler-plugin:3.3:testCompile (default-testCompile) @ jwat-arc ---
[INFO] Changes detected - recompiling the module!
[INFO] Compiling 28 source files to /home/cibuild01/workspace/JWAT/jwat-arc/target/test-classes
[INFO] 
[INFO] --- maven-surefire-plugin:2.12.4:test (default-test) @ jwat-arc ---
[INFO] Surefire report directory: /home/cibuild01/workspace/JWAT/jwat-arc/target/surefire-reports

-------------------------------------------------------
 T E S T S
-------------------------------------------------------
Running org.jwat.arc.TestArc_UriProfile
Tests run: 1, Failures: 0, Errors: 0, Skipped: 0, Time elapsed: 0.182 sec
Running org.jwat.arc.TestArcReader_NextAndIterRecord
Tests run: 5, Failures: 0, Errors: 0, Skipped: 0, Time elapsed: 1.184 sec
Running org.jwat.arc.TestArcWriter
Tests run: 2, Failures: 1, Errors: 0, Skipped: 0, Time elapsed: 0.068 sec <<< FAILURE!
test_arcwriter_compressed(org.jwat.arc.TestArcWriter)  Time elapsed: 0.034 sec  <<< FAILURE!
arrays first differed at element [4]; expected:<-66> but was:<-65>
	at org.junit.internal.ComparisonCriteria.arrayEquals(ComparisonCriteria.java:55)
	at org.junit.Assert.internalArrayEquals(Assert.java:532)
	at org.junit.Assert.assertArrayEquals(Assert.java:341)
	at org.junit.Assert.assertArrayEquals(Assert.java:352)
	at org.jwat.arc.TestArcWriter.test_arc_writer_empty_fields_compressed(TestArcWriter.java:554)
	at org.jwat.arc.TestArcWriter.test_arcwriter_compressed(TestArcWriter.java:40)
	at sun.reflect.NativeMethodAccessorImpl.invoke0(Native Method)
	at sun.reflect.NativeMethodAccessorImpl.invoke(NativeMethodAccessorImpl.java:62)
	at sun.reflect.DelegatingMethodAccessorImpl.invoke(DelegatingMethodAccessorImpl.java:43)
	at java.lang.reflect.Method.invoke(Method.java:498)
	at org.junit.runners.model.FrameworkMethod$1.runReflectiveCall(FrameworkMethod.java:50)
	at org.junit.internal.runners.model.ReflectiveCallable.run(ReflectiveCallable.java:12)
	at org.junit.runners.model.FrameworkMethod.invokeExplosively(FrameworkMethod.java:47)
	at org.junit.internal.runners.statements.InvokeMethod.evaluate(InvokeMethod.java:17)
	at org.junit.runners.ParentRunner.runLeaf(ParentRunner.java:325)
	at org.junit.runners.BlockJUnit4ClassRunner.runChild(BlockJUnit4ClassRunner.java:78)
	at org.junit.runners.BlockJUnit4ClassRunner.runChild(BlockJUnit4ClassRunner.java:57)
	at org.junit.runners.ParentRunner$3.run(ParentRunner.java:290)
	at org.junit.runners.ParentRunner$1.schedule(ParentRunner.java:71)
	at org.junit.runners.ParentRunner.runChildren(ParentRunner.java:288)
	at org.junit.runners.ParentRunner.access$000(ParentRunner.java:58)
	at org.junit.runners.ParentRunner$2.evaluate(ParentRunner.java:268)
	at org.junit.runners.ParentRunner.run(ParentRunner.java:363)
	at org.apache.maven.surefire.junit4.JUnit4Provider.execute(JUnit4Provider.java:252)
	at org.apache.maven.surefire.junit4.JUnit4Provider.executeTestSet(JUnit4Provider.java:141)
	at org.apache.maven.surefire.junit4.JUnit4Provider.invoke(JUnit4Provider.java:112)
	at sun.reflect.NativeMethodAccessorImpl.invoke0(Native Method)
	at sun.reflect.NativeMethodAccessorImpl.invoke(NativeMethodAccessorImpl.java:62)
	at sun.reflect.DelegatingMethodAccessorImpl.invoke(DelegatingMethodAccessorImpl.java:43)
	at java.lang.reflect.Method.invoke(Method.java:498)
	at org.apache.maven.surefire.util.ReflectionUtils.invokeMethodWithArray(ReflectionUtils.java:189)
	at org.apache.maven.surefire.booter.ProviderFactory$ProviderProxy.invoke(ProviderFactory.java:165)
	at org.apache.maven.surefire.booter.ProviderFactory.invokeProvider(ProviderFactory.java:85)
	at org.apache.maven.surefire.booter.ForkedBooter.runSuitesInProcess(ForkedBooter.java:115)
	at org.apache.maven.surefire.booter.ForkedBooter.main(ForkedBooter.java:75)
Caused by: java.lang.AssertionError: expected:<-66> but was:<-65>
	at org.junit.Assert.fail(Assert.java:88)
	at org.junit.Assert.failNotEquals(Assert.java:834)
	at org.junit.Assert.assertEquals(Assert.java:118)
	at org.junit.Assert.assertEquals(Assert.java:144)
	at org.junit.internal.ExactComparisonCriteria.assertElementsEqual(ExactComparisonCriteria.java:8)
	at org.junit.internal.ComparisonCriteria.arrayEquals(ComparisonCriteria.java:53)
	... 34 more

Running org.jwat.arc.TestArcRecordBase
Tests run: 3, Failures: 0, Errors: 0, Skipped: 0, Time elapsed: 0.015 sec
Running org.jwat.arc.TestArcFileWriter
Tests run: 1, Failures: 0, Errors: 0, Skipped: 0, Time elapsed: 1.214 sec
Running org.jwat.arc.TestArcFileNamingDefault
Tests run: 1, Failures: 0, Errors: 0, Skipped: 0, Time elapsed: 0.013 sec
Running org.jwat.arc.TestArcReaders_Params
Tests run: 1, Failures: 0, Errors: 0, Skipped: 0, Time elapsed: 0.264 sec
Running org.jwat.arc.TestArcHeader
Tests run: 1, Failures: 0, Errors: 0, Skipped: 0, Time elapsed: 0.011 sec
Running org.jwat.arc.TestArcWriter_States
Tests run: 2, Failures: 0, Errors: 0, Skipped: 0, Time elapsed: 0.014 sec
Running org.jwat.arc.TestArcDateParser
Tests run: 1, Failures: 0, Errors: 0, Skipped: 0, Time elapsed: 0.006 sec
Running org.jwat.arc.TestArcWriter_ArchiveLength
Tests run: 2, Failures: 0, Errors: 0, Skipped: 0, Time elapsed: 0.033 sec
Running org.jwat.arc.TestArcReader_Digest
Tests run: 6, Failures: 0, Errors: 0, Skipped: 0, Time elapsed: 3.478 sec
Running org.jwat.arc.TestArcRecord
Tests run: 1, Failures: 0, Errors: 0, Skipped: 0, Time elapsed: 0.02 sec
Running org.jwat.arc.TestArcWriters_Params
Tests run: 1, Failures: 0, Errors: 0, Skipped: 0, Time elapsed: 0.002 sec
Running org.jwat.arc.TestArcFieldParsers
Tests run: 3, Failures: 0, Errors: 0, Skipped: 0, Time elapsed: 0.016 sec
Running org.jwat.arc.TestArcVersionBlock
Tests run: 2, Failures: 0, Errors: 0, Skipped: 0, Time elapsed: 0.01 sec
Running org.jwat.arc.TestArcFileNamingSingleFile
Tests run: 1, Failures: 0, Errors: 0, Skipped: 0, Time elapsed: 0.003 sec
Running org.jwat.arc.TestArcVersionHeader
Tests run: 1, Failures: 0, Errors: 0, Skipped: 0, Time elapsed: 0.003 sec
Running org.jwat.arc.TestArcVersion
Tests run: 1, Failures: 0, Errors: 0, Skipped: 0, Time elapsed: 0.006 sec
Running org.jwat.arc.TestArcReader
Tests run: 4, Failures: 0, Errors: 0, Skipped: 0, Time elapsed: 0.008 sec
Running org.jwat.arc.TestArcReaderUncompressed
Tests run: 6, Failures: 0, Errors: 0, Skipped: 0, Time elapsed: 1.636 sec
Running org.jwat.arc.TestArcFileWriterConfig
Tests run: 1, Failures: 0, Errors: 0, Skipped: 0, Time elapsed: 0.005 sec
Running org.jwat.arc.TestArcReaderFactory_IsMagic
Tests run: 1, Failures: 0, Errors: 0, Skipped: 0, Time elapsed: 0.002 sec
Running org.jwat.arc.TestArcReaderFactory
Tests run: 2, Failures: 0, Errors: 0, Skipped: 0, Time elapsed: 0.311 sec
Running org.jwat.arc.TestArcReaderCompressed
Tests run: 6, Failures: 0, Errors: 0, Skipped: 0, Time elapsed: 2.116 sec

Results :

Failed tests:   test_arcwriter_compressed(org.jwat.arc.TestArcWriter): arrays first differed at element [4]; expected:<-66> but was:<-65>

Tests run: 56, Failures: 1, Errors: 0, Skipped: 0

[ERROR] There are test failures.

Please refer to /home/cibuild01/workspace/JWAT/jwat-arc/target/surefire-reports for the individual test results.
[JENKINS] Recording test results
[INFO] 
[INFO] --- maven-jar-plugin:2.4:jar (default-jar) @ jwat-arc ---
[INFO] Building jar: /home/cibuild01/workspace/JWAT/jwat-arc/target/jwat-arc-1.1.0-SNAPSHOT.jar
[INFO] 
[INFO] --- maven-site-plugin:3.4:attach-descriptor (attach-descriptor) @ jwat-arc ---
[INFO] 
[INFO] --- maven-source-plugin:2.4:jar-no-fork (attach-sources) @ jwat-arc ---
[INFO] Building jar: /home/cibuild01/workspace/JWAT/jwat-arc/target/jwat-arc-1.1.0-SNAPSHOT-sources.jar
[INFO] 
[INFO] --- maven-javadoc-plugin:2.10.3:jar (attach-javadocs) @ jwat-arc ---
[INFO] Building jar: /home/cibuild01/workspace/JWAT/jwat-arc/target/jwat-arc-1.1.0-SNAPSHOT-javadoc.jar
[INFO] 
[INFO] --- maven-install-plugin:2.4:install (default-install) @ jwat-arc ---
[INFO] Installing /home/cibuild01/workspace/JWAT/jwat-arc/target/jwat-arc-1.1.0-SNAPSHOT.jar to /home/cibuild01/.m2/repository/org/jwat/jwat-arc/1.1.0-SNAPSHOT/jwat-arc-1.1.0-SNAPSHOT.jar
[INFO] Installing /home/cibuild01/workspace/JWAT/jwat-arc/pom.xml to /home/cibuild01/.m2/repository/org/jwat/jwat-arc/1.1.0-SNAPSHOT/jwat-arc-1.1.0-SNAPSHOT.pom
[INFO] Installing /home/cibuild01/workspace/JWAT/jwat-arc/target/jwat-arc-1.1.0-SNAPSHOT-sources.jar to /home/cibuild01/.m2/repository/org/jwat/jwat-arc/1.1.0-SNAPSHOT/jwat-arc-1.1.0-SNAPSHOT-sources.jar
[INFO] Installing /home/cibuild01/workspace/JWAT/jwat-arc/target/jwat-arc-1.1.0-SNAPSHOT-javadoc.jar to /home/cibuild01/.m2/repository/org/jwat/jwat-arc/1.1.0-SNAPSHOT/jwat-arc-1.1.0-SNAPSHOT-javadoc.jar
[JENKINS] Archiving disabled
[INFO]                                                                         
[INFO] ------------------------------------------------------------------------
[INFO] Building jwat-warc 1.1.0-SNAPSHOT
[INFO] ------------------------------------------------------------------------
[INFO] 
[INFO] --- maven-enforcer-plugin:1.0:enforce (enforce-maven) @ jwat-warc ---
[INFO] 
[INFO] --- maven-resources-plugin:2.6:resources (default-resources) @ jwat-warc ---
[INFO] Using 'UTF-8' encoding to copy filtered resources.
[INFO] skip non existing resourceDirectory /home/cibuild01/workspace/JWAT/jwat-warc/src/main/resources
[INFO] 
[INFO] --- maven-compiler-plugin:3.3:compile (default-compile) @ jwat-warc ---
[INFO] Changes detected - recompiling the module!
[INFO] Compiling 20 source files to /home/cibuild01/workspace/JWAT/jwat-warc/target/classes
[INFO] 
[INFO] --- maven-resources-plugin:2.6:testResources (default-testResources) @ jwat-warc ---
[INFO] Using 'UTF-8' encoding to copy filtered resources.
[INFO] Copying 26 resources
[INFO] 
[INFO] --- maven-compiler-plugin:3.3:testCompile (default-testCompile) @ jwat-warc ---
[INFO] Changes detected - recompiling the module!
[INFO] Compiling 45 source files to /home/cibuild01/workspace/JWAT/jwat-warc/target/test-classes
[INFO] 
[INFO] --- maven-surefire-plugin:2.12.4:test (default-test) @ jwat-warc ---
[INFO] Surefire report directory: /home/cibuild01/workspace/JWAT/jwat-warc/target/surefire-reports

-------------------------------------------------------
 T E S T S
-------------------------------------------------------
Running org.jwat.warc.TestWarcHeaderVersion
Tests run: 1, Failures: 0, Errors: 0, Skipped: 0, Time elapsed: 0.195 sec
Running org.jwat.warc.TestWarcRecordIerator
Tests run: 4, Failures: 0, Errors: 0, Skipped: 0, Time elapsed: 4.216 sec
Running org.jwat.warc.TestWarcWriterFactory
Tests run: 8, Failures: 0, Errors: 0, Skipped: 0, Time elapsed: 5.403 sec
Running org.jwat.warc.TestWarcConstants
Tests run: 1, Failures: 0, Errors: 0, Skipped: 0, Time elapsed: 0 sec
Running org.jwat.warc.TestWarcReaderCompressed
Tests run: 6, Failures: 0, Errors: 0, Skipped: 0, Time elapsed: 3.109 sec
Running org.jwat.warc.TestWarcRecord
Tests run: 3, Failures: 0, Errors: 0, Skipped: 0, Time elapsed: 0.041 sec
Running org.jwat.warc.TestWarcHeaderFieldPolicy
Tests run: 1, Failures: 0, Errors: 0, Skipped: 0, Time elapsed: 0.013 sec
Running org.jwat.warc.TestWarcReaderUncompressed
Tests run: 6, Failures: 0, Errors: 0, Skipped: 0, Time elapsed: 3.715 sec
Running org.jwat.warc.TestWarcReaderFactory
Tests run: 4, Failures: 0, Errors: 0, Skipped: 0, Time elapsed: 1.482 sec
Running org.jwat.warc.TestWarc_DuplicateFields
Tests run: 2, Failures: 0, Errors: 0, Skipped: 0, Time elapsed: 0.013 sec
Running org.jwat.warc.TestWarcReader_Diagnosis
Tests run: 3, Failures: 0, Errors: 0, Skipped: 0, Time elapsed: 0.007 sec
Running org.jwat.warc.TestWarcReader
Tests run: 2, Failures: 0, Errors: 0, Skipped: 0, Time elapsed: 0.007 sec
Running org.jwat.warc.TestWarcWriters_Params
Tests run: 1, Failures: 0, Errors: 0, Skipped: 0, Time elapsed: 0.006 sec
Running org.jwat.warc.TestWarc_Params
Tests run: 1, Failures: 0, Errors: 0, Skipped: 0, Time elapsed: 0.008 sec
Running org.jwat.warc.TestWarc_MissingHeadersAll
Tests run: 5, Failures: 0, Errors: 0, Skipped: 0, Time elapsed: 0.017 sec
Running org.jwat.warc.TestWarc_BadEncodingHeader
Tests run: 1, Failures: 0, Errors: 0, Skipped: 1, Time elapsed: 0.018 sec
Running org.jwat.warc.TestWarcHeaderAddDatatyped
Tests run: 1, Failures: 0, Errors: 0, Skipped: 0, Time elapsed: 0.037 sec
Running org.jwat.warc.TestWarcReaderFactory_IsWarc
Tests run: 1, Failures: 0, Errors: 0, Skipped: 0, Time elapsed: 0.003 sec
Running org.jwat.warc.TestWarc_SegmentNumber
Tests run: 2, Failures: 0, Errors: 0, Skipped: 0, Time elapsed: 0.011 sec
Running org.jwat.warc.TestWarc_Utf8
Tests run: 1, Failures: 0, Errors: 0, Skipped: 0, Time elapsed: 0.009 sec
Running org.jwat.warc.TestWarcWriter_States
Tests run: 2, Failures: 0, Errors: 0, Skipped: 0, Time elapsed: 0.011 sec
Running org.jwat.warc.TestWarcFileWriter
Tests run: 1, Failures: 0, Errors: 0, Skipped: 0, Time elapsed: 1.355 sec
Running org.jwat.warc.TestWarc_ContentTypeRecommended
Tests run: 3, Failures: 0, Errors: 0, Skipped: 0, Time elapsed: 0.01 sec
Running org.jwat.warc.TestWarc_Fields
Tests run: 3, Failures: 0, Errors: 0, Skipped: 0, Time elapsed: 0.01 sec
Running org.jwat.warc.TestWarcWriter_ContentLength
Tests run: 2, Failures: 0, Errors: 0, Skipped: 0, Time elapsed: 0.015 sec
Running org.jwat.warc.TestWarcFileWriterConfig
Tests run: 1, Failures: 0, Errors: 0, Skipped: 0, Time elapsed: 0.002 sec
Running org.jwat.warc.TestWarcRecordDigests
Tests run: 4, Failures: 0, Errors: 0, Skipped: 0, Time elapsed: 0.276 sec
Running org.jwat.warc.TestWarcFileNamingSingleFile
Tests run: 1, Failures: 0, Errors: 0, Skipped: 0, Time elapsed: 0.009 sec
Running org.jwat.warc.TestWarcFileNamingDefault
Tests run: 1, Failures: 0, Errors: 0, Skipped: 0, Time elapsed: 0.008 sec
Running org.jwat.warc.TestWarc_UriProfile
Tests run: 1, Failures: 0, Errors: 0, Skipped: 0, Time elapsed: 0.005 sec
Running org.jwat.warc.TestWarcHeader
Tests run: 1, Failures: 0, Errors: 0, Skipped: 0, Time elapsed: 0.01 sec
Running org.jwat.warc.TestWarc_DigestFields
Tests run: 1, Failures: 0, Errors: 0, Skipped: 0, Time elapsed: 0.009 sec
Running org.jwat.warc.TestWarc_RecordTypeDigestCheck
Tests run: 1, Failures: 0, Errors: 0, Skipped: 0, Time elapsed: 0.023 sec
Running org.jwat.warc.TestWarcReaders_Params
Tests run: 1, Failures: 0, Errors: 0, Skipped: 0, Time elapsed: 0.007 sec
Running org.jwat.warc.TestWarc_NonWarcHeaders
Tests run: 1, Failures: 0, Errors: 0, Skipped: 0, Time elapsed: 0.004 sec
Running org.jwat.warc.TestWarc_UpperLowerCase
Tests run: 1, Failures: 0, Errors: 0, Skipped: 0, Time elapsed: 0.007 sec
Running org.jwat.warc.TestWarcWriter_Headers
Tests run: 2, Failures: 0, Errors: 0, Skipped: 0, Time elapsed: 0.021 sec
Running org.jwat.warc.TestWarcFieldParsers
Tests run: 3, Failures: 0, Errors: 0, Skipped: 0, Time elapsed: 0.01 sec
Running org.jwat.warc.TestWarcConcurrentTo
Tests run: 1, Failures: 0, Errors: 0, Skipped: 0, Time elapsed: 0.006 sec
Running org.jwat.warc.TestWarcWriter_Payload
Tests run: 2, Failures: 0, Errors: 0, Skipped: 0, Time elapsed: 2.614 sec

Results :

Tests run: 87, Failures: 0, Errors: 0, Skipped: 1

[JENKINS] Recording test results
[INFO] 
[INFO] --- maven-jar-plugin:2.4:jar (default-jar) @ jwat-warc ---
[INFO] Building jar: /home/cibuild01/workspace/JWAT/jwat-warc/target/jwat-warc-1.1.0-SNAPSHOT.jar
[INFO] 
[INFO] --- maven-site-plugin:3.4:attach-descriptor (attach-descriptor) @ jwat-warc ---
[INFO] 
[INFO] --- maven-source-plugin:2.4:jar-no-fork (attach-sources) @ jwat-warc ---
[INFO] Building jar: /home/cibuild01/workspace/JWAT/jwat-warc/target/jwat-warc-1.1.0-SNAPSHOT-sources.jar
[INFO] 
[INFO] --- maven-javadoc-plugin:2.10.3:jar (attach-javadocs) @ jwat-warc ---
[INFO] Building jar: /home/cibuild01/workspace/JWAT/jwat-warc/target/jwat-warc-1.1.0-SNAPSHOT-javadoc.jar
[INFO] 
[INFO] --- maven-install-plugin:2.4:install (default-install) @ jwat-warc ---
[INFO] Installing /home/cibuild01/workspace/JWAT/jwat-warc/target/jwat-warc-1.1.0-SNAPSHOT.jar to /home/cibuild01/.m2/repository/org/jwat/jwat-warc/1.1.0-SNAPSHOT/jwat-warc-1.1.0-SNAPSHOT.jar
[INFO] Installing /home/cibuild01/workspace/JWAT/jwat-warc/pom.xml to /home/cibuild01/.m2/repository/org/jwat/jwat-warc/1.1.0-SNAPSHOT/jwat-warc-1.1.0-SNAPSHOT.pom
[INFO] Installing /home/cibuild01/workspace/JWAT/jwat-warc/target/jwat-warc-1.1.0-SNAPSHOT-sources.jar to /home/cibuild01/.m2/repository/org/jwat/jwat-warc/1.1.0-SNAPSHOT/jwat-warc-1.1.0-SNAPSHOT-sources.jar
[INFO] Installing /home/cibuild01/workspace/JWAT/jwat-warc/target/jwat-warc-1.1.0-SNAPSHOT-javadoc.jar to /home/cibuild01/.m2/repository/org/jwat/jwat-warc/1.1.0-SNAPSHOT/jwat-warc-1.1.0-SNAPSHOT-javadoc.jar
[JENKINS] Archiving disabled
[INFO]                                                                         
[INFO] ------------------------------------------------------------------------
[INFO] Building jwat-archive 1.1.0-SNAPSHOT
[INFO] ------------------------------------------------------------------------
[INFO] 
[INFO] --- maven-enforcer-plugin:1.0:enforce (enforce-maven) @ jwat-archive ---
[INFO] 
[INFO] --- maven-resources-plugin:2.6:resources (default-resources) @ jwat-archive ---
[INFO] Using 'UTF-8' encoding to copy filtered resources.
[INFO] skip non existing resourceDirectory /home/cibuild01/workspace/JWAT/jwat-archive/src/main/resources
[INFO] 
[INFO] --- maven-compiler-plugin:3.3:compile (default-compile) @ jwat-archive ---
[INFO] Changes detected - recompiling the module!
[INFO] Compiling 6 source files to /home/cibuild01/workspace/JWAT/jwat-archive/target/classes
[INFO] 
[INFO] --- maven-resources-plugin:2.6:testResources (default-testResources) @ jwat-archive ---
[INFO] Using 'UTF-8' encoding to copy filtered resources.
[INFO] skip non existing resourceDirectory /home/cibuild01/workspace/JWAT/jwat-archive/src/test/resources
[INFO] Copying 8 resources
[INFO] Copying 26 resources
[INFO] 
[INFO] --- maven-compiler-plugin:3.3:testCompile (default-testCompile) @ jwat-archive ---
[INFO] Changes detected - recompiling the module!
[INFO] Compiling 2 source files to /home/cibuild01/workspace/JWAT/jwat-archive/target/test-classes
[INFO] 
[INFO] --- maven-surefire-plugin:2.12.4:test (default-test) @ jwat-archive ---
[INFO] Surefire report directory: /home/cibuild01/workspace/JWAT/jwat-archive/target/surefire-reports

-------------------------------------------------------
 T E S T S
-------------------------------------------------------
Running org.jwat.archive.TestManagedPayloadManager
Tests run: 1, Failures: 0, Errors: 0, Skipped: 0, Time elapsed: 0.166 sec
Running org.jwat.archive.TestManagedPayload
Tests run: 2, Failures: 0, Errors: 0, Skipped: 0, Time elapsed: 2.835 sec

Results :

Tests run: 3, Failures: 0, Errors: 0, Skipped: 0

[JENKINS] Recording test results
[INFO] 
[INFO] --- maven-jar-plugin:2.4:jar (default-jar) @ jwat-archive ---
[INFO] Building jar: /home/cibuild01/workspace/JWAT/jwat-archive/target/jwat-archive-1.1.0-SNAPSHOT.jar
[INFO] 
[INFO] --- maven-site-plugin:3.4:attach-descriptor (attach-descriptor) @ jwat-archive ---
[INFO] 
[INFO] --- maven-source-plugin:2.4:jar-no-fork (attach-sources) @ jwat-archive ---
[INFO] Building jar: /home/cibuild01/workspace/JWAT/jwat-archive/target/jwat-archive-1.1.0-SNAPSHOT-sources.jar
[INFO] 
[INFO] --- maven-javadoc-plugin:2.10.3:jar (attach-javadocs) @ jwat-archive ---
[INFO] Building jar: /home/cibuild01/workspace/JWAT/jwat-archive/target/jwat-archive-1.1.0-SNAPSHOT-javadoc.jar
[INFO] 
[INFO] --- maven-install-plugin:2.4:install (default-install) @ jwat-archive ---
[INFO] Installing /home/cibuild01/workspace/JWAT/jwat-archive/target/jwat-archive-1.1.0-SNAPSHOT.jar to /home/cibuild01/.m2/repository/org/jwat/jwat-archive/1.1.0-SNAPSHOT/jwat-archive-1.1.0-SNAPSHOT.jar
[INFO] Installing /home/cibuild01/workspace/JWAT/jwat-archive/pom.xml to /home/cibuild01/.m2/repository/org/jwat/jwat-archive/1.1.0-SNAPSHOT/jwat-archive-1.1.0-SNAPSHOT.pom
[INFO] Installing /home/cibuild01/workspace/JWAT/jwat-archive/target/jwat-archive-1.1.0-SNAPSHOT-sources.jar to /home/cibuild01/.m2/repository/org/jwat/jwat-archive/1.1.0-SNAPSHOT/jwat-archive-1.1.0-SNAPSHOT-sources.jar
[INFO] Installing /home/cibuild01/workspace/JWAT/jwat-archive/target/jwat-archive-1.1.0-SNAPSHOT-javadoc.jar to /home/cibuild01/.m2/repository/org/jwat/jwat-archive/1.1.0-SNAPSHOT/jwat-archive-1.1.0-SNAPSHOT-javadoc.jar
[JENKINS] Archiving disabled
[INFO]                                                                         
[INFO] ------------------------------------------------------------------------
[INFO] Building jwat-distribution 1.1.0-SNAPSHOT
[INFO] ------------------------------------------------------------------------
[INFO] 
[INFO] --- maven-enforcer-plugin:1.0:enforce (enforce-maven) @ jwat-distribution ---
[INFO] 
[INFO] --- maven-resources-plugin:2.6:resources (default-resources) @ jwat-distribution ---
[INFO] Using 'UTF-8' encoding to copy filtered resources.
[INFO] skip non existing resourceDirectory /home/cibuild01/workspace/JWAT/jwat-distribution/src/main/resources
[INFO] 
[INFO] --- maven-compiler-plugin:3.3:compile (default-compile) @ jwat-distribution ---
[INFO] No sources to compile
[INFO] 
[INFO] --- maven-resources-plugin:2.6:testResources (default-testResources) @ jwat-distribution ---
[INFO] Using 'UTF-8' encoding to copy filtered resources.
[INFO] skip non existing resourceDirectory /home/cibuild01/workspace/JWAT/jwat-distribution/src/test/resources
[INFO] 
[INFO] --- maven-compiler-plugin:3.3:testCompile (default-testCompile) @ jwat-distribution ---
[INFO] No sources to compile
[INFO] 
[INFO] --- maven-surefire-plugin:2.12.4:test (default-test) @ jwat-distribution ---
[INFO] No tests to run.
[JENKINS] Recording test results
[INFO] 
[INFO] --- maven-jar-plugin:2.4:jar (default-jar) @ jwat-distribution ---
[WARNING] JAR will be empty - no content was marked for inclusion!
[INFO] Building jar: /home/cibuild01/workspace/JWAT/jwat-distribution/target/jwat-distribution-1.1.0-SNAPSHOT.jar
[INFO] 
[INFO] --- maven-site-plugin:3.4:attach-descriptor (attach-descriptor) @ jwat-distribution ---
[INFO] 
[INFO] --- maven-assembly-plugin:2.2.2:single (distro-assembly) @ jwat-distribution ---
[INFO] Reading assembly descriptor: src/main/assembly/bin.xml
[INFO] Building zip: /home/cibuild01/workspace/JWAT/jwat-distribution/target/jwat-distribution-1.1.0-SNAPSHOT-bin.zip
[INFO] Building tar : /home/cibuild01/workspace/JWAT/jwat-distribution/target/jwat-distribution-1.1.0-SNAPSHOT-bin.tar.gz
[INFO] 
[INFO] --- maven-source-plugin:2.4:jar-no-fork (attach-sources) @ jwat-distribution ---
[INFO] No sources in project. Archive not created.
[INFO] 
[INFO] --- maven-javadoc-plugin:2.10.3:jar (attach-javadocs) @ jwat-distribution ---
[INFO] 
[INFO] --- maven-install-plugin:2.4:install (default-install) @ jwat-distribution ---
[INFO] Installing /home/cibuild01/workspace/JWAT/jwat-distribution/target/jwat-distribution-1.1.0-SNAPSHOT.jar to /home/cibuild01/.m2/repository/org/jwat/jwat-distribution/1.1.0-SNAPSHOT/jwat-distribution-1.1.0-SNAPSHOT.jar
[INFO] Installing /home/cibuild01/workspace/JWAT/jwat-distribution/pom.xml to /home/cibuild01/.m2/repository/org/jwat/jwat-distribution/1.1.0-SNAPSHOT/jwat-distribution-1.1.0-SNAPSHOT.pom
[INFO] Installing /home/cibuild01/workspace/JWAT/jwat-distribution/target/jwat-distribution-1.1.0-SNAPSHOT-bin.zip to /home/cibuild01/.m2/repository/org/jwat/jwat-distribution/1.1.0-SNAPSHOT/jwat-distribution-1.1.0-SNAPSHOT-bin.zip
[INFO] Installing /home/cibuild01/workspace/JWAT/jwat-distribution/target/jwat-distribution-1.1.0-SNAPSHOT-bin.tar.gz to /home/cibuild01/.m2/repository/org/jwat/jwat-distribution/1.1.0-SNAPSHOT/jwat-distribution-1.1.0-SNAPSHOT-bin.tar.gz
[JENKINS] Archiving disabled
[JENKINS] Archiving disabled
[JENKINS] Archiving disabled
[JENKINS] Archiving disabled
[JENKINS] Archiving disabled
[JENKINS] Archiving disabled
[JENKINS] Archiving disabled
[JENKINS] Archiving disabled
[JENKINS] Archiving disabled
[INFO] ------------------------------------------------------------------------
[INFO] Reactor Summary:
[INFO] 
[INFO] jwat ............................................... SUCCESS [  6.422 s]
[INFO] jwat-common ........................................ SUCCESS [ 39.750 s]
[INFO] jwat-archive-common ................................ SUCCESS [  3.394 s]
[INFO] jwat-gzip .......................................... SUCCESS [ 12.693 s]
[INFO] jwat-arc ........................................... SUCCESS [ 17.986 s]
[INFO] jwat-warc .......................................... SUCCESS [ 30.968 s]
[INFO] jwat-archive ....................................... SUCCESS [  6.885 s]
[INFO] jwat-distribution .................................. SUCCESS [  2.141 s]
[INFO] ------------------------------------------------------------------------
[INFO] BUILD SUCCESS
[INFO] ------------------------------------------------------------------------
[INFO] Total time: 02:04 min
[INFO] Finished at: 2017-06-23T01:04:22+02:00
[INFO] Final Memory: 37M/96M
[INFO] ------------------------------------------------------------------------
An attempt to send an e-mail to empty list of recipients, ignored.
channel stopped
Started indexing related Jira issue keys
Successfully indexed related Jira issue keys
Failed to send e-mail to nclarkekb because no e-mail address is known, and no default e-mail domain is configured
An attempt to send an e-mail to empty list of recipients, ignored.
Finished: UNSTABLE