SuccessConsole Output

[INFO]                                                                         
[INFO] ------------------------------------------------------------------------
[INFO] Building Bitrepository Reference Pillar 1.10-SNAPSHOT
[INFO] ------------------------------------------------------------------------
[INFO] 
[INFO] --- maven-clean-plugin:3.1.0:clean (default-clean) @ bitrepository-reference-pillar ---
[INFO] Deleting /home/cibuild01/workspace/Bitrepository-reference-test/bitrepository-reference-pillar/target
[INFO] 
[INFO] --- maven-enforcer-plugin:3.0.0-M3:enforce (enforce-maven) @ bitrepository-reference-pillar ---
[INFO] 
[INFO] --- jacoco-maven-plugin:0.8.5:prepare-agent (default) @ bitrepository-reference-pillar ---
[INFO] argLine set to -javaagent:/home/cibuild01/.m2/repository/org/jacoco/org.jacoco.agent/0.8.5/org.jacoco.agent-0.8.5-runtime.jar=destfile=/home/cibuild01/workspace/Bitrepository-reference-test/bitrepository-reference-pillar/target/jacoco.exec
[INFO] 
[INFO] --- maven-dependency-plugin:3.1.2:unpack-dependencies (unpack-shared-sqlscripts) @ bitrepository-reference-pillar ---
[INFO] Unpacking /home/cibuild01/workspace/Bitrepository-reference-test/bitrepository-service/target/bitrepository-service-1.10-SNAPSHOT.jar to /home/cibuild01/workspace/Bitrepository-reference-test/bitrepository-reference-pillar/target/classes with includes "**/*.sql" and excludes ""
[INFO] 
[INFO] --- maven-resources-plugin:3.1.0:resources (default-resources) @ bitrepository-reference-pillar ---
[INFO] Using 'UTF-8' encoding to copy filtered resources.
[INFO] Copying 13 resources
[INFO] 
[INFO] --- maven-compiler-plugin:3.8.1:compile (default-compile) @ bitrepository-reference-pillar ---
[INFO] Changes detected - recompiling the module!
[INFO] Compiling 44 source files to /home/cibuild01/workspace/Bitrepository-reference-test/bitrepository-reference-pillar/target/classes
[WARNING] /home/cibuild01/workspace/Bitrepository-reference-test/bitrepository-reference-pillar/src/main/java/org/bitrepository/pillar/store/checksumdatabase/ChecksumExtractor.java:[236,25] explicit call to close() on an auto-closeable resource
[WARNING] /home/cibuild01/workspace/Bitrepository-reference-test/bitrepository-reference-pillar/src/main/java/org/bitrepository/pillar/store/checksumdatabase/ChecksumExtractor.java:[304,25] explicit call to close() on an auto-closeable resource
[WARNING] /home/cibuild01/workspace/Bitrepository-reference-test/bitrepository-reference-pillar/src/main/java/org/bitrepository/pillar/store/checksumdatabase/ChecksumExtractor.java:[347,25] explicit call to close() on an auto-closeable resource
[INFO] 
[INFO] --- forbiddenapis:2.7:check (default) @ bitrepository-reference-pillar ---
[INFO] Scanning for classes to check...
[INFO] Reading bundled API signatures: jdk-unsafe-1.8
[INFO] Reading bundled API signatures: jdk-deprecated-1.8
[INFO] Reading bundled API signatures: jdk-non-portable
[INFO] Reading bundled API signatures: jdk-reflection
[INFO] Loading classes to check...
[INFO] Scanning classes for violations...
[INFO] Scanned 44 class file(s) for forbidden API invocations (in 0.16s), 0 error(s).
[INFO] 
[INFO] --- forbiddenapis:2.7:testCheck (default) @ bitrepository-reference-pillar ---
[INFO] Scanning for classes to check...
[WARNING] Classes directory does not exist, forbiddenapis check skipped: /home/cibuild01/workspace/Bitrepository-reference-test/bitrepository-reference-pillar/target/test-classes
[INFO] 
[INFO] --- maven-resources-plugin:3.1.0:testResources (default-testResources) @ bitrepository-reference-pillar ---
[INFO] Using 'UTF-8' encoding to copy filtered resources.
[INFO] Copying 13 resources
[INFO] 
[INFO] --- maven-compiler-plugin:3.8.1:testCompile (default-testCompile) @ bitrepository-reference-pillar ---
[INFO] Changes detected - recompiling the module!
[INFO] Compiling 73 source files to /home/cibuild01/workspace/Bitrepository-reference-test/bitrepository-reference-pillar/target/test-classes
[INFO] 
[INFO] --- maven-surefire-plugin:3.0.0-M4:test (default-test) @ bitrepository-reference-pillar ---
[INFO] 
[INFO] -------------------------------------------------------
[INFO]  T E S T S
[INFO] -------------------------------------------------------
[INFO] Running TestSuite
Starting test project Reference Pillar Test
  Suite: Surefire suite
    Starting testcase ArchiveDirectoryTest
      Test starting: testArchiveDirectoryExistingFile
        Description: Test the ArchiveDirectory when the file exists
        Step: Setup
        Step: Validate the existence of the file
        Step: Delete the file.
      Test success: testArchiveDirectoryExistingFile
      Test starting: testArchiveDirectoryExistingFolderFile
        Description: Test the ArchiveDirectory when the file exists
        Step: Setup
        Step: Validate the existence of the file
        Step: Delete the file.
      Test success: testArchiveDirectoryExistingFolderFile
      Test starting: testArchiveDirectoryMissingFile
        Description: Test the ArchiveDirectory when the file is missing.
        Step: Setup
        Step: Validate the existence of the file
        Step: Delete the file.
      Test success: testArchiveDirectoryMissingFile
      Test starting: testArchiveDirectoryMissingFolderFile
        Description: Test the ArchiveDirectory when the file is missing.
        Step: Setup
        Step: Validate the existence of the file
        Step: Delete the file.
      Test success: testArchiveDirectoryMissingFolderFile
      Test starting: testArchiveDirectoryMoveFileToArchive
        Description: Testing the error scenarios when moving a file from tmp to archive for the ArchiveDirectory.
        Step: Setup
        Step: Moving file from tmp to archive
        Step: Create file in both tmp and archive.
        Step: Moving file from tmp to archive
        Step: Remove the file from archive and try again
      Test success: testArchiveDirectoryMoveFileToArchive
      Test starting: testArchiveDirectoryMoveFolderFileToArchive
        Description: Testing the error scenarios when moving a file from tmp to archive for the ArchiveDirectory.
        Step: Setup
        Step: Moving file from tmp to archive
        Step: Create file in both tmp and archive.
        Step: Moving file from tmp to archive
        Step: Remove the file from archive and try again
      Test success: testArchiveDirectoryMoveFolderFileToArchive
      Test starting: testArchiveDirectoryNewFile
        Description: Testing the ArchiveDirectory handling of a new file.
        Step: Setup
        Step: Retrieve tmp file
        Step: Request a new file for the tmp dir
        Step: Retrieve tmp file
        Step: Request another new file with the same name
        Step: Move the file from tmp to archive
      Test success: testArchiveDirectoryNewFile
      Test starting: testArchiveDirectoryNewFolderFile
        Description: Testing the ArchiveDirectory handling of a new file.
        Step: Setup
        Step: Retrieve tmp file
        Step: Request a new file for the tmp dir
        Step: Retrieve tmp file
        Step: Request another new file with the same name
        Step: Move the file from tmp to archive
      Test success: testArchiveDirectoryNewFolderFile
      Test starting: testArchiveDirectoryRemoveFile
        Description: Testing the error scenarios when removing files from the archive.
        Step: Setup
        Step: Remove nonexisting file from archive
        Step: Remove nonexisting file from tmp
        Step: Create file in both tmp, archive and retain directories.
        Step: Remove the file from archive and tmp
      Test success: testArchiveDirectoryRemoveFile
      Test starting: testArchiveDirectoryRemoveFolderFile
        Description: Testing the error scenarios when removing files from the archive.
        Step: Setup
        Step: Remove nonexisting file from archive
        Step: Remove nonexisting file from tmp
        Step: Create file in both tmp, archive and retain directories.
        Step: Remove the file from archive and tmp
      Test success: testArchiveDirectoryRemoveFolderFile
    Starting testcase ChecksumEntryTest
      Test starting: testExtendedTestCase
        Description: Test the ChecksumEntry
        Step: Create a ChecksumEntry
      Test success: testExtendedTestCase
    Starting testcase ChecksumPillarModelTest
      Test starting: testPillarModelBasicFunctionality
        Description: Test the basic functions of the full reference pillar model.
        Step: Check the pillar id in the pillar model
        Step: Ask whether it can handle a file of size 0
        Step: Ask whether it can handle a file of maximum size
        Step: Check the ChecksumPillarSpec
        Step: Checkum whether the checksum pillar should download
      Test success: testPillarModelBasicFunctionality
      Test starting: testPillarModelHasFile
        Description: Test that the file exists, when placed in the archive and cache
        Step: Setup
        Step: Check whether file exists and retrieve it.
        Step: Check whether file exists.
        Step: Ask for the checksum data for the file with different checksum specs
        Step: Ask for the checksum entry for the file with different checksum specs
        Step: Ask for the checksum for the file with different checksum specs
        Step: Check extraction of checksum result set
        Step: Check retrieval of non-default checksum
        Step: Check retrieval of non-default checksum result set
        Step: Test retrieval of single checksum result set
      Test success: testPillarModelHasFile
      Test starting: testPillarModelNoFile
        Description: Test that the file exists, when placed in the archive and cache
        Step: Setup
        Step: Check whether file exists and try to retrieve it.
        Step: Verify that anexceptions are thrown when verifying file existance.
      Test success: testPillarModelNoFile
    Starting testcase GetAuditTrailsTest
        Added fixture: Initialize a new Pillar.
      Test starting: checksumPillarGetAuditTrailsMaximumNumberOfResults
        Description: Tests the GetAuditTrails functionality of the pillar for the successful scenario, where a limited number of audit trails are requested.
        Step: Set up constants and variables.
        Step: Send the request for the limited amount of audit trails to the pillar.
          Result: Received message on TEST-TOPIC-checksumPillarGetAuditTrailsMaximumNumberOfResults-cibuild01 : org.bitrepository.bitrepositorymessages.GetAuditTrailsProgressResponse@4b05a9b1[correlationID=48f745e0-399a-4859-b354-1686d61fe0ec, collectionID=TwoPillarCollection, destination=TEST-TOPIC-checksumPillarGetAuditTrailsMaximumNumberOfResults-cibuild01, replyTo=TEST-TOPIC-Pillar-checksumPillarGetAuditTrailsMaximumNumberOfResults-cibuild01-contributor, from=Pillar-checksumPillarGetAuditTrailsMaximumNumberOfResults, to=Pillar-checksumPillarGetAuditTrailsMaximumNumberOfResults, version=31, minVersion=24, responseInfo=org.bitrepository.bitrepositoryelements.ResponseInfo@296b758[responseCode=OPERATION_ACCEPTED_PROGRESS, responseText=Starting to extract the requested audit trails.], contributor=Pillar-checksumPillarGetAuditTrailsMaximumNumberOfResults, resultAddress=<null>(default)]
          Result: Received message on TEST-TOPIC-checksumPillarGetAuditTrailsMaximumNumberOfResults-cibuild01 : org.bitrepository.bitrepositorymessages.GetAuditTrailsFinalResponse@37b04a2a[correlationID=48f745e0-399a-4859-b354-1686d61fe0ec, collectionID=TwoPillarCollection, destination=TEST-TOPIC-checksumPillarGetAuditTrailsMaximumNumberOfResults-cibuild01, replyTo=TEST-TOPIC-Pillar-checksumPillarGetAuditTrailsMaximumNumberOfResults-cibuild01-contributor, from=Pillar-checksumPillarGetAuditTrailsMaximumNumberOfResults, to=Pillar-checksumPillarGetAuditTrailsMaximumNumberOfResults, version=31, minVersion=24, responseInfo=org.bitrepository.bitrepositoryelements.ResponseInfo@3b910a4b[responseCode=OPERATION_COMPLETED, responseText=<null>(default)], contributor=Pillar-checksumPillarGetAuditTrailsMaximumNumberOfResults, resultingAuditTrails=org.bitrepository.bitrepositoryelements.ResultingAuditTrails@2ae92511[resultAddress=<null>(default), auditTrailEvents=org.bitrepository.bitrepositoryelements.AuditTrailEvents@582ce329[auditTrailEvent={org.bitrepository.bitrepositoryelements.AuditTrailEvent@6df8131c[sequenceNumber=1, fileID=fileID1599207545521, reportingComponent=MOCK-AUDIT-MANAGER, actorOnFile=ACTOR, actionOnFile=CHECKSUM_CALCULATED, actionDateTime=2020-09-04T10:19:05.529+02:00, info=InFo, operationID=operationID, certificateID=certificateid, auditTrailInformation=auditTrails],org.bitrepository.bitrepositoryelements.AuditTrailEvent@5e888fba[sequenceNumber=2, fileID=fileID1599207545521, reportingComponent=MOCK-AUDIT-MANAGER, actorOnFile=ACTOR, actionOnFile=DELETE_FILE, actionDateTime=2020-09-04T10:19:05.529+02:00, info=InFo, operationID=operationID, certificateID=certificateid, auditTrailInformation=auditTrails],org.bitrepository.bitrepositoryelements.AuditTrailEvent@3d2af8d7[sequenceNumber=3, fileID=fileID1599207545521, reportingComponent=MOCK-AUDIT-MANAGER, actorOnFile=ACTOR, actionOnFile=FAILURE, actionDateTime=2020-09-04T10:19:05.529+02:00, info=InFo, operationID=operationID, certificateID=certificateid, auditTrailInformation=auditTrails],org.bitrepository.bitrepositoryelements.AuditTrailEvent@22071f0[sequenceNumber=4, fileID=fileID1599207545521, reportingComponent=MOCK-AUDIT-MANAGER, actorOnFile=ACTOR, actionOnFile=FILE_MOVED, actionDateTime=2020-09-04T10:19:05.530+02:00, info=InFo, operationID=operationID, certificateID=certificateid, auditTrailInformation=auditTrails],org.bitrepository.bitrepositoryelements.AuditTrailEvent@2fedf25b[sequenceNumber=5, fileID=fileID1599207545521, reportingComponent=MOCK-AUDIT-MANAGER, actorOnFile=ACTOR, actionOnFile=GET_CHECKSUMS, actionDateTime=2020-09-04T10:19:05.530+02:00, info=InFo, operationID=operationID, certificateID=certificateid, auditTrailInformation=auditTrails]}]], partialResult=true]
        Step: Validate the final response
      Test success: checksumPillarGetAuditTrailsMaximumNumberOfResults
        Added fixture: Initialize a new Pillar.
      Test starting: checksumPillarGetAuditTrailsSpecificRequests
        Description: Tests the GetAuditTrails functionality of the pillar for the successful scenario, where a specific audit trail are requested.
        Step: Set up constants and variables.
        Step: Send the identification request
          Result: Received message on TEST-TOPIC-checksumPillarGetAuditTrailsSpecificRequests-cibuild01 : org.bitrepository.bitrepositorymessages.IdentifyContributorsForGetAuditTrailsResponse@3dcf26b5[correlationID=34a6a811-d3a1-4b0c-9dcb-f39829e8720f, collectionID=TwoPillarCollection, destination=TEST-TOPIC-checksumPillarGetAuditTrailsSpecificRequests-cibuild01, replyTo=TEST-TOPIC-Pillar-checksumPillarGetAuditTrailsSpecificRequests-cibuild01-contributor, from=Pillar-checksumPillarGetAuditTrailsSpecificRequests, to=Pillar-checksumPillarGetAuditTrailsSpecificRequests, version=31, minVersion=24, responseInfo=org.bitrepository.bitrepositoryelements.ResponseInfo@1a9ba6c2[responseCode=IDENTIFICATION_POSITIVE, responseText=<null>(default)]]
        Step: Retrieve and validate the response.
        Step: Make and send the request for the actual GetAuditTrails operation
          Result: Received message on TEST-TOPIC-checksumPillarGetAuditTrailsSpecificRequests-cibuild01 : org.bitrepository.bitrepositorymessages.GetAuditTrailsProgressResponse@24a4e9c0[correlationID=34a6a811-d3a1-4b0c-9dcb-f39829e8720f, collectionID=TwoPillarCollection, destination=TEST-TOPIC-checksumPillarGetAuditTrailsSpecificRequests-cibuild01, replyTo=TEST-TOPIC-Pillar-checksumPillarGetAuditTrailsSpecificRequests-cibuild01-contributor, from=Pillar-checksumPillarGetAuditTrailsSpecificRequests, to=Pillar-checksumPillarGetAuditTrailsSpecificRequests, version=31, minVersion=24, responseInfo=org.bitrepository.bitrepositoryelements.ResponseInfo@609a996f[responseCode=OPERATION_ACCEPTED_PROGRESS, responseText=Starting to extract the requested audit trails.], contributor=Pillar-checksumPillarGetAuditTrailsSpecificRequests, resultAddress=<null>(default)]
          Result: Received message on TEST-TOPIC-checksumPillarGetAuditTrailsSpecificRequests-cibuild01 : org.bitrepository.bitrepositorymessages.GetAuditTrailsFinalResponse@27f09e08[correlationID=34a6a811-d3a1-4b0c-9dcb-f39829e8720f, collectionID=TwoPillarCollection, destination=TEST-TOPIC-checksumPillarGetAuditTrailsSpecificRequests-cibuild01, replyTo=TEST-TOPIC-Pillar-checksumPillarGetAuditTrailsSpecificRequests-cibuild01-contributor, from=Pillar-checksumPillarGetAuditTrailsSpecificRequests, to=Pillar-checksumPillarGetAuditTrailsSpecificRequests, version=31, minVersion=24, responseInfo=org.bitrepository.bitrepositoryelements.ResponseInfo@2984edab[responseCode=OPERATION_COMPLETED, responseText=<null>(default)], contributor=Pillar-checksumPillarGetAuditTrailsSpecificRequests, resultingAuditTrails=org.bitrepository.bitrepositoryelements.ResultingAuditTrails@2a6dfbb2[resultAddress=<null>(default), auditTrailEvents=org.bitrepository.bitrepositoryelements.AuditTrailEvents@1e085e71[auditTrailEvent={org.bitrepository.bitrepositoryelements.AuditTrailEvent@3dab9366[sequenceNumber=1, fileID=fileID1599207545810, reportingComponent=MOCK-AUDIT-MANAGER, actorOnFile=ACTOR, actionOnFile=OTHER, actionDateTime=2020-09-04T10:19:05.810+02:00, info=InFo, operationID=operationID, certificateID=certificateid, auditTrailInformation=auditTrails]}]], partialResult=false]
        Step: Receive and validate the progress response.
        Step: Receive and validate the final response
        Step: Make another request, where both ingested audit trails is requested
          Result: Received message on TEST-TOPIC-checksumPillarGetAuditTrailsSpecificRequests-cibuild01 : org.bitrepository.bitrepositorymessages.GetAuditTrailsProgressResponse@33ccc8cd[correlationID=34a6a811-d3a1-4b0c-9dcb-f39829e8720f, collectionID=TwoPillarCollection, destination=TEST-TOPIC-checksumPillarGetAuditTrailsSpecificRequests-cibuild01, replyTo=TEST-TOPIC-Pillar-checksumPillarGetAuditTrailsSpecificRequests-cibuild01-contributor, from=Pillar-checksumPillarGetAuditTrailsSpecificRequests, to=Pillar-checksumPillarGetAuditTrailsSpecificRequests, version=31, minVersion=24, responseInfo=org.bitrepository.bitrepositoryelements.ResponseInfo@76b9056d[responseCode=OPERATION_ACCEPTED_PROGRESS, responseText=Starting to extract the requested audit trails.], contributor=Pillar-checksumPillarGetAuditTrailsSpecificRequests, resultAddress=<null>(default)]
          Result: Received message on TEST-TOPIC-checksumPillarGetAuditTrailsSpecificRequests-cibuild01 : org.bitrepository.bitrepositorymessages.GetAuditTrailsFinalResponse@2a9e261d[correlationID=34a6a811-d3a1-4b0c-9dcb-f39829e8720f, collectionID=TwoPillarCollection, destination=TEST-TOPIC-checksumPillarGetAuditTrailsSpecificRequests-cibuild01, replyTo=TEST-TOPIC-Pillar-checksumPillarGetAuditTrailsSpecificRequests-cibuild01-contributor, from=Pillar-checksumPillarGetAuditTrailsSpecificRequests, to=Pillar-checksumPillarGetAuditTrailsSpecificRequests, version=31, minVersion=24, responseInfo=org.bitrepository.bitrepositoryelements.ResponseInfo@4bcfa08b[responseCode=OPERATION_COMPLETED, responseText=<null>(default)], contributor=Pillar-checksumPillarGetAuditTrailsSpecificRequests, resultingAuditTrails=org.bitrepository.bitrepositoryelements.ResultingAuditTrails@1e90939f[resultAddress=<null>(default), auditTrailEvents=org.bitrepository.bitrepositoryelements.AuditTrailEvents@20bc6f4d[auditTrailEvent={org.bitrepository.bitrepositoryelements.AuditTrailEvent@3dab9366[sequenceNumber=1, fileID=fileID1599207545810, reportingComponent=MOCK-AUDIT-MANAGER, actorOnFile=ACTOR, actionOnFile=OTHER, actionDateTime=2020-09-04T10:19:05.810+02:00, info=InFo, operationID=operationID, certificateID=certificateid, auditTrailInformation=auditTrails],org.bitrepository.bitrepositoryelements.AuditTrailEvent@7b491b89[sequenceNumber=2, fileID=notThisFile, reportingComponent=MOCK-AUDIT-MANAGER, actorOnFile=UnknownActor, actionOnFile=FAILURE, actionDateTime=2020-09-04T10:19:05.810+02:00, info=badInfo, operationID=operationID, certificateID=certificateid, auditTrailInformation=WrongAuditTrail]}]], partialResult=false]
        Step: Receive and validate the progress response.
        Step: Receive and validate the final response
      Test success: checksumPillarGetAuditTrailsSpecificRequests
        Added fixture: Initialize a new Pillar.
      Test starting: checksumPillarGetAuditTrailsSuccessful
        Description: Tests the GetAuditTrails functionality of the pillar for the successful scenario, where all audit trails are requested.
        Step: Set up constants and variables.
        Step: Send the identification request
          Result: Received message on TEST-TOPIC-checksumPillarGetAuditTrailsSuccessful-cibuild01 : org.bitrepository.bitrepositorymessages.IdentifyContributorsForGetAuditTrailsResponse@1bef1304[correlationID=459a6562-c6da-401c-bac7-ed364b9f1b2b, collectionID=TwoPillarCollection, destination=TEST-TOPIC-checksumPillarGetAuditTrailsSuccessful-cibuild01, replyTo=TEST-TOPIC-Pillar-checksumPillarGetAuditTrailsSuccessful-cibuild01-contributor, from=Pillar-checksumPillarGetAuditTrailsSuccessful, to=Pillar-checksumPillarGetAuditTrailsSuccessful, version=31, minVersion=24, responseInfo=org.bitrepository.bitrepositoryelements.ResponseInfo@835718b[responseCode=IDENTIFICATION_POSITIVE, responseText=<null>(default)]]
        Step: Make and send the request for the actual GetAuditTrails operation
          Result: Received message on TEST-TOPIC-checksumPillarGetAuditTrailsSuccessful-cibuild01 : org.bitrepository.bitrepositorymessages.GetAuditTrailsProgressResponse@2e6dc94c[correlationID=459a6562-c6da-401c-bac7-ed364b9f1b2b, collectionID=TwoPillarCollection, destination=TEST-TOPIC-checksumPillarGetAuditTrailsSuccessful-cibuild01, replyTo=TEST-TOPIC-Pillar-checksumPillarGetAuditTrailsSuccessful-cibuild01-contributor, from=Pillar-checksumPillarGetAuditTrailsSuccessful, to=Pillar-checksumPillarGetAuditTrailsSuccessful, version=31, minVersion=24, responseInfo=org.bitrepository.bitrepositoryelements.ResponseInfo@6c39ba30[responseCode=OPERATION_ACCEPTED_PROGRESS, responseText=Starting to extract the requested audit trails.], contributor=Pillar-checksumPillarGetAuditTrailsSuccessful, resultAddress=<null>(default)]
          Result: Received message on TEST-TOPIC-checksumPillarGetAuditTrailsSuccessful-cibuild01 : org.bitrepository.bitrepositorymessages.GetAuditTrailsFinalResponse@f2df380[correlationID=459a6562-c6da-401c-bac7-ed364b9f1b2b, collectionID=TwoPillarCollection, destination=TEST-TOPIC-checksumPillarGetAuditTrailsSuccessful-cibuild01, replyTo=TEST-TOPIC-Pillar-checksumPillarGetAuditTrailsSuccessful-cibuild01-contributor, from=Pillar-checksumPillarGetAuditTrailsSuccessful, to=Pillar-checksumPillarGetAuditTrailsSuccessful, version=31, minVersion=24, responseInfo=org.bitrepository.bitrepositoryelements.ResponseInfo@2c3762c7[responseCode=OPERATION_COMPLETED, responseText=<null>(default)], contributor=Pillar-checksumPillarGetAuditTrailsSuccessful, resultingAuditTrails=org.bitrepository.bitrepositoryelements.ResultingAuditTrails@6cd0f9a4[resultAddress=<null>(default), auditTrailEvents=org.bitrepository.bitrepositoryelements.AuditTrailEvents@4d992634[auditTrailEvent={org.bitrepository.bitrepositoryelements.AuditTrailEvent@2d487df4[sequenceNumber=1, fileID=fileid, reportingComponent=MOCK-AUDIT-MANAGER, actorOnFile=actor, actionOnFile=OTHER, actionDateTime=2020-09-04T10:19:06.082+02:00, info=info, operationID=operationID, certificateID=certificateID, auditTrailInformation=auditTrail]}]], partialResult=false]
        Step: Receive and validate the progress response.
        Step: Receive and validate the final response
      Test success: checksumPillarGetAuditTrailsSuccessful
    Starting testcase GetChecksumsTest
        Added fixture: Initialize a new Pillar.
      Test starting: badCaseIdentification
        Description: Tests the identification for a GetChecksums operation on the pillar for the failure scenario, when the file is missing.
        Step: Set up constants and variables.
        Step: Setup for delivering pillar id and not having the file 
        Step: Create and send the identify request message.
          Result: Received message on TEST-TOPIC-badCaseIdentification-cibuild01 : org.bitrepository.bitrepositorymessages.IdentifyPillarsForGetChecksumsResponse@1f94e1[correlationID=9a077869-c8e8-4b1d-b5c8-5fe7f914b35b, collectionID=TwoPillarCollection, destination=TEST-TOPIC-badCaseIdentification-cibuild01, replyTo=TEST-TOPIC-Pillar-badCaseIdentification-cibuild01-contributor, from=Pillar-badCaseIdentification, to=badCaseIdentification, version=31, minVersion=24, responseInfo=org.bitrepository.bitrepositoryelements.ResponseInfo@30bd925c[responseCode=FILE_NOT_FOUND_FAILURE, responseText=File not found.], fileIDs=org.bitrepository.bitrepositoryelements.FileIDs@2fbbdca[fileID=DefaultFilebadCaseIdentification, allFileIDs=<null>(default)], checksumRequestForExistingFile=org.bitrepository.bitrepositoryelements.ChecksumSpecTYPE@722a2ba2[checksumType=MD5, checksumSalt=<null>(default), otherChecksumType=<null>(default)], pillarID=Pillar-badCaseIdentification, pillarChecksumSpec=<null>(default), timeToDeliver=<null>(default)]
        Step: Retrieve and validate the response getPillarID() the pillar.
      Test success: badCaseIdentification
        Added fixture: Initialize a new Pillar.
      Test starting: badCaseOperationNoFile
        Description: Tests the GetChecksums functionality of the pillar for the failure scenario, where it does not have the file.
        Step: Set up constants and variables.
        Step: Setup for not having the file
        Step: Create and send the actual GetChecksums message to the pillar.
10:19:07.681 WARN  o.b.p.m.GetChecksumsRequestHandler - The following file is missing 'DefaultFilebadCaseOperationNoFile' at collection 'TwoPillarCollection'.
          Result: Received message on TEST-TOPIC-badCaseOperationNoFile-cibuild01 : org.bitrepository.bitrepositorymessages.GetChecksumsFinalResponse@54500139[correlationID=31683b5e-c272-46c8-a9dd-255e6b951f41, collectionID=TwoPillarCollection, destination=TEST-TOPIC-badCaseOperationNoFile-cibuild01, replyTo=TEST-TOPIC-Pillar-badCaseOperationNoFile-cibuild01-contributor, from=Pillar-badCaseOperationNoFile, to=badCaseOperationNoFile, version=31, minVersion=24, responseInfo=org.bitrepository.bitrepositoryelements.ResponseInfo@4a1b710[responseCode=FILE_NOT_FOUND_FAILURE, responseText=File not found.], pillarID=Pillar-badCaseOperationNoFile, checksumRequestForExistingFile=org.bitrepository.bitrepositoryelements.ChecksumSpecTYPE@19574274[checksumType=MD5, checksumSalt=<null>(default), otherChecksumType=<null>(default)], resultingChecksums=<null>(default), partialResult=<null>(default)]
        Step: Retrieve the FinalResponse for the GetChecksums request
      Test success: badCaseOperationNoFile
        Added fixture: Initialize a new Pillar.
      Test starting: goodCaseIdentification
        Description: Tests the identification for a GetChecksums operation on the pillar for the successful scenario.
        Step: Set up constants and variables.
        Step: Setup for having the file and delivering pillar id
        Step: Create and send the identify request message.
          Result: Received message on TEST-TOPIC-goodCaseIdentification-cibuild01 : org.bitrepository.bitrepositorymessages.IdentifyPillarsForGetChecksumsResponse@49588c70[correlationID=4edcba73-f80a-4605-9a01-8b1072cf5f32, collectionID=TwoPillarCollection, destination=TEST-TOPIC-goodCaseIdentification-cibuild01, replyTo=TEST-TOPIC-Pillar-goodCaseIdentification-cibuild01-contributor, from=Pillar-goodCaseIdentification, to=goodCaseIdentification, version=31, minVersion=24, responseInfo=org.bitrepository.bitrepositoryelements.ResponseInfo@43ee585f[responseCode=IDENTIFICATION_POSITIVE, responseText=Operation acknowledged and accepted.], fileIDs=org.bitrepository.bitrepositoryelements.FileIDs@1cb58c8a[fileID=DefaultFilegoodCaseIdentification, allFileIDs=<null>(default)], checksumRequestForExistingFile=org.bitrepository.bitrepositoryelements.ChecksumSpecTYPE@54a81a18[checksumType=MD5, checksumSalt=<null>(default), otherChecksumType=<null>(default)], pillarID=Pillar-goodCaseIdentification, pillarChecksumSpec=<null>(default), timeToDeliver=org.bitrepository.bitrepositoryelements.TimeMeasureTYPE@591e27f1[timeMeasureUnit=MILLISECONDS, timeMeasureValue=1000]]
        Step: Retrieve and validate the response getPillarID() the pillar.
      Test success: goodCaseIdentification
        Added fixture: Initialize a new Pillar.
      Test starting: goodCaseOperationAllFiles
        Description: Tests the GetChecksums operation on the pillar for the successful scenario, when requesting all files.
        Step: Set up constants and variables.
        Step: Setup for having the file and delivering result-set
        Step: Create and send the actual GetChecksums message to the pillar.
          Result: Received message on TEST-TOPIC-goodCaseOperationAllFiles-cibuild01 : org.bitrepository.bitrepositorymessages.GetChecksumsProgressResponse@9e7d82e[correlationID=eba1725d-c4bc-4bc0-91ef-860db211f409, collectionID=TwoPillarCollection, destination=TEST-TOPIC-goodCaseOperationAllFiles-cibuild01, replyTo=TEST-TOPIC-Pillar-goodCaseOperationAllFiles-cibuild01-contributor, from=Pillar-goodCaseOperationAllFiles, to=goodCaseOperationAllFiles, version=31, minVersion=24, responseInfo=org.bitrepository.bitrepositoryelements.ResponseInfo@49de1717[responseCode=OPERATION_ACCEPTED_PROGRESS, responseText=Starting to calculate checksums.], pillarID=Pillar-goodCaseOperationAllFiles, fileIDs=org.bitrepository.bitrepositoryelements.FileIDs@12c66345[fileID=<null>(default), allFileIDs=true], checksumRequestForExistingFile=org.bitrepository.bitrepositoryelements.ChecksumSpecTYPE@24bf95ec[checksumType=MD5, checksumSalt=<null>(default), otherChecksumType=<null>(default)], resultAddress=<null>(default)]
          Result: Received message on TEST-TOPIC-goodCaseOperationAllFiles-cibuild01 : org.bitrepository.bitrepositorymessages.GetChecksumsFinalResponse@713935c8[correlationID=eba1725d-c4bc-4bc0-91ef-860db211f409, collectionID=TwoPillarCollection, destination=TEST-TOPIC-goodCaseOperationAllFiles-cibuild01, replyTo=TEST-TOPIC-Pillar-goodCaseOperationAllFiles-cibuild01-contributor, from=Pillar-goodCaseOperationAllFiles, to=goodCaseOperationAllFiles, version=31, minVersion=24, responseInfo=org.bitrepository.bitrepositoryelements.ResponseInfo@1cf38112[responseCode=OPERATION_COMPLETED, responseText=<null>(default)], pillarID=Pillar-goodCaseOperationAllFiles, checksumRequestForExistingFile=org.bitrepository.bitrepositoryelements.ChecksumSpecTYPE@24bf95ec[checksumType=MD5, checksumSalt=<null>(default), otherChecksumType=<null>(default)], resultingChecksums=org.bitrepository.bitrepositoryelements.ResultingChecksums@59e6fb8a[resultAddress=<null>(default), checksumDataItems={org.bitrepository.bitrepositoryelements.ChecksumDataForChecksumSpecTYPE@502cd238[fileID=DefaultFile, checksumValue={18,52,-52,-52,-52,-52,67,33}, calculationTimestamp=2020-09-04T10:19:10.215+02:00],org.bitrepository.bitrepositoryelements.ChecksumDataForChecksumSpecTYPE@68032a80[fileID=goodCaseOperationAllFiles-cibuild01--Test-File-1599207550197, checksumValue={18,52,-52,-52,-52,-52,67,34}, calculationTimestamp=1970-01-01T01:00:00.000+01:00]}], partialResult=false]
        Step: Retrieve the ProgressResponse for the GetChecksums request
        Step: Retrieve the FinalResponse for the GetChecksums request
      Test success: goodCaseOperationAllFiles
        Added fixture: Initialize a new Pillar.
      Test starting: goodCaseOperationSingleFile
        Description: Tests the GetChecksums operation on the pillar for the successful scenario when requesting one specific file.
        Step: Set up constants and variables.
        Step: Setup for having the file and delivering result-set
        Step: Create and send the actual GetChecksums message to the pillar.
          Result: Received message on TEST-TOPIC-goodCaseOperationSingleFile-cibuild01 : org.bitrepository.bitrepositorymessages.GetChecksumsProgressResponse@34f636a5[correlationID=e68eac8a-1613-4458-b978-82ba7eb1dd7e, collectionID=TwoPillarCollection, destination=TEST-TOPIC-goodCaseOperationSingleFile-cibuild01, replyTo=TEST-TOPIC-Pillar-goodCaseOperationSingleFile-cibuild01-contributor, from=Pillar-goodCaseOperationSingleFile, to=goodCaseOperationSingleFile, version=31, minVersion=24, responseInfo=org.bitrepository.bitrepositoryelements.ResponseInfo@5d55eb7a[responseCode=OPERATION_ACCEPTED_PROGRESS, responseText=Starting to calculate checksums.], pillarID=Pillar-goodCaseOperationSingleFile, fileIDs=org.bitrepository.bitrepositoryelements.FileIDs@1ae11dd3[fileID=DefaultFilegoodCaseOperationSingleFile, allFileIDs=<null>(default)], checksumRequestForExistingFile=org.bitrepository.bitrepositoryelements.ChecksumSpecTYPE@79ae2d13[checksumType=MD5, checksumSalt=<null>(default), otherChecksumType=<null>(default)], resultAddress=<null>(default)]
          Result: Received message on TEST-TOPIC-goodCaseOperationSingleFile-cibuild01 : org.bitrepository.bitrepositorymessages.GetChecksumsFinalResponse@7ce87f9d[correlationID=e68eac8a-1613-4458-b978-82ba7eb1dd7e, collectionID=TwoPillarCollection, destination=TEST-TOPIC-goodCaseOperationSingleFile-cibuild01, replyTo=TEST-TOPIC-Pillar-goodCaseOperationSingleFile-cibuild01-contributor, from=Pillar-goodCaseOperationSingleFile, to=goodCaseOperationSingleFile, version=31, minVersion=24, responseInfo=org.bitrepository.bitrepositoryelements.ResponseInfo@e944541[responseCode=OPERATION_COMPLETED, responseText=<null>(default)], pillarID=Pillar-goodCaseOperationSingleFile, checksumRequestForExistingFile=org.bitrepository.bitrepositoryelements.ChecksumSpecTYPE@79ae2d13[checksumType=MD5, checksumSalt=<null>(default), otherChecksumType=<null>(default)], resultingChecksums=org.bitrepository.bitrepositoryelements.ResultingChecksums@1c89cec5[resultAddress=<null>(default), checksumDataItems={org.bitrepository.bitrepositoryelements.ChecksumDataForChecksumSpecTYPE@1447bef2[fileID=DefaultFilegoodCaseOperationSingleFile, checksumValue={18,52,-52,-52,-52,-52,67,33}, calculationTimestamp=2020-09-04T10:19:10.465+02:00]}], partialResult=false]
        Step: Retrieve the ProgressResponse for the GetChecksums request
        Step: Retrieve the FinalResponse for the GetChecksums request
      Test success: goodCaseOperationSingleFile
        Added fixture: Initialize a new Pillar.
      Test starting: testRestrictions
        Description: Tests that the restrictions are correctly passed on to the cache.
        Step: Set up constants and variables.
        Step: Setup for only delivering result-set when the correct restrictions are given.
        Step: Create and send the actual GetChecksums message to the pillar.
          Result: Received message on TEST-TOPIC-testRestrictions-cibuild01 : org.bitrepository.bitrepositorymessages.GetChecksumsProgressResponse@3e17219[correlationID=35e1d2d4-4146-43a4-b15b-961e7b86767c, collectionID=TwoPillarCollection, destination=TEST-TOPIC-testRestrictions-cibuild01, replyTo=TEST-TOPIC-Pillar-testRestrictions-cibuild01-contributor, from=Pillar-testRestrictions, to=testRestrictions, version=31, minVersion=24, responseInfo=org.bitrepository.bitrepositoryelements.ResponseInfo@3c995eae[responseCode=OPERATION_ACCEPTED_PROGRESS, responseText=Starting to calculate checksums.], pillarID=Pillar-testRestrictions, fileIDs=org.bitrepository.bitrepositoryelements.FileIDs@54fb9c08[fileID=<null>(default), allFileIDs=true], checksumRequestForExistingFile=org.bitrepository.bitrepositoryelements.ChecksumSpecTYPE@8941d98[checksumType=MD5, checksumSalt=<null>(default), otherChecksumType=<null>(default)], resultAddress=<null>(default)]
          Result: Received message on TEST-TOPIC-testRestrictions-cibuild01 : org.bitrepository.bitrepositorymessages.GetChecksumsFinalResponse@6dd729[correlationID=35e1d2d4-4146-43a4-b15b-961e7b86767c, collectionID=TwoPillarCollection, destination=TEST-TOPIC-testRestrictions-cibuild01, replyTo=TEST-TOPIC-Pillar-testRestrictions-cibuild01-contributor, from=Pillar-testRestrictions, to=testRestrictions, version=31, minVersion=24, responseInfo=org.bitrepository.bitrepositoryelements.ResponseInfo@767785a4[responseCode=OPERATION_COMPLETED, responseText=<null>(default)], pillarID=Pillar-testRestrictions, checksumRequestForExistingFile=org.bitrepository.bitrepositoryelements.ChecksumSpecTYPE@8941d98[checksumType=MD5, checksumSalt=<null>(default), otherChecksumType=<null>(default)], resultingChecksums=org.bitrepository.bitrepositoryelements.ResultingChecksums@7ee45cbe[resultAddress=<null>(default), checksumDataItems={org.bitrepository.bitrepositoryelements.ChecksumDataForChecksumSpecTYPE@5634f627[fileID=DefaultFile, checksumValue={18,52,-52,-52,-52,-52,67,33}, calculationTimestamp=2020-09-04T10:19:10.713+02:00]}], partialResult=false]
        Step: Retrieve the ProgressResponse for the GetChecksums request
        Step: Retrieve the FinalResponse for the GetChecksums request
      Test success: testRestrictions
    Starting testcase GetFileIDsTest
        Added fixture: Initialize a new Pillar.
      Test starting: badCaseIdentification
        Description: Tests the identification for a GetFileIDs operation on the pillar for the failure scenario, when the file is missing.
        Step: Set up constants and variables.
        Step: Setup for delivering pillar id and not having the file 
        Step: Create and send the identify request message.
10:19:10.960 WARN  o.b.p.m.IdentifyPillarsForGetFileIDsRequestHandler - The following file is missing 'DefaultFilebadCaseIdentification' at collection 'TwoPillarCollection'.
          Result: Received message on TEST-TOPIC-badCaseIdentification-cibuild01 : org.bitrepository.bitrepositorymessages.IdentifyPillarsForGetFileIDsResponse@22265a8d[correlationID=a64ce279-6600-48cd-9573-b5ed068248a9, collectionID=TwoPillarCollection, destination=TEST-TOPIC-badCaseIdentification-cibuild01, replyTo=TEST-TOPIC-Pillar-badCaseIdentification-cibuild01-contributor, from=Pillar-badCaseIdentification, to=badCaseIdentification, version=31, minVersion=24, responseInfo=org.bitrepository.bitrepositoryelements.ResponseInfo@492939b[responseCode=FILE_NOT_FOUND_FAILURE, responseText=File not found.], pillarID=Pillar-badCaseIdentification, fileIDs=org.bitrepository.bitrepositoryelements.FileIDs@7e4f42c0[fileID=DefaultFilebadCaseIdentification, allFileIDs=<null>(default)], timeToDeliver=<null>(default)]
        Step: Retrieve and validate the response getPillarID() the pillar.
      Test success: badCaseIdentification
        Added fixture: Initialize a new Pillar.
      Test starting: badCaseOperationNoFile
        Description: Tests the GetFileIDs functionality of the pillar for the failure scenario, where it does not have the file.
        Step: Set up constants and variables.
        Step: Setup for not having the file
        Step: Create and send the actual GetFileIDs message to the pillar.
10:19:12.204 WARN  o.b.p.m.GetFileIDsRequestHandler - The following file is missing 'DefaultFilebadCaseOperationNoFile' at collection 'TwoPillarCollection'.
          Result: Received message on TEST-TOPIC-badCaseOperationNoFile-cibuild01 : org.bitrepository.bitrepositorymessages.GetFileIDsFinalResponse@6aa909cb[correlationID=09fe7cd8-bc9c-4375-bdc8-1ccde965ba63, collectionID=TwoPillarCollection, destination=TEST-TOPIC-badCaseOperationNoFile-cibuild01, replyTo=TEST-TOPIC-Pillar-badCaseOperationNoFile-cibuild01-contributor, from=Pillar-badCaseOperationNoFile, to=badCaseOperationNoFile, version=31, minVersion=24, responseInfo=org.bitrepository.bitrepositoryelements.ResponseInfo@4be75a68[responseCode=FILE_NOT_FOUND_FAILURE, responseText=File not found.], pillarID=Pillar-badCaseOperationNoFile, fileIDs=org.bitrepository.bitrepositoryelements.FileIDs@1d38ca2b[fileID=DefaultFilebadCaseOperationNoFile, allFileIDs=<null>(default)], resultingFileIDs=<null>(default), partialResult=<null>(default)]
10:19:12.214 WARN  o.b.p.m.GetFileIDsRequestHandler - The following file is missing 'DefaultFilebadCaseOperationNoFile' at collection 'TwoPillarCollection'.
          Result: Received message on TEST-TOPIC-badCaseOperationNoFile-cibuild01 : org.bitrepository.bitrepositorymessages.GetFileIDsFinalResponse@d8a5846[correlationID=09fe7cd8-bc9c-4375-bdc8-1ccde965ba63, collectionID=TwoPillarCollection, destination=TEST-TOPIC-badCaseOperationNoFile-cibuild01, replyTo=TEST-TOPIC-Pillar-badCaseOperationNoFile-cibuild01-contributor, from=Pillar-badCaseOperationNoFile, to=badCaseOperationNoFile, version=31, minVersion=24, responseInfo=org.bitrepository.bitrepositoryelements.ResponseInfo@7ccf6785[responseCode=FILE_NOT_FOUND_FAILURE, responseText=File not found.], pillarID=Pillar-badCaseOperationNoFile, fileIDs=org.bitrepository.bitrepositoryelements.FileIDs@1d38ca2b[fileID=DefaultFilebadCaseOperationNoFile, allFileIDs=<null>(default)], resultingFileIDs=<null>(default), partialResult=<null>(default)]
        Step: Retrieve the FinalResponse for the GetFileIDs request
      Test success: badCaseOperationNoFile
          Result: The following messages haven't been handled by the testcase: 
org.bitrepository.bitrepositorymessages.GetFileIDsFinalResponse@d8a5846[correlationID=09fe7cd8-bc9c-4375-bdc8-1ccde965ba63, collectionID=TwoPillarCollection, destination=TEST-TOPIC-badCaseOperationNoFile-cibuild01, replyTo=TEST-TOPIC-Pillar-badCaseOperationNoFile-cibuild01-contributor, from=Pillar-badCaseOperationNoFile, to=badCaseOperationNoFile, version=31, minVersion=24, responseInfo=org.bitrepository.bitrepositoryelements.ResponseInfo@7ccf6785[responseCode=FILE_NOT_FOUND_FAILURE, responseText=File not found.], pillarID=Pillar-badCaseOperationNoFile, fileIDs=org.bitrepository.bitrepositoryelements.FileIDs@1d38ca2b[fileID=DefaultFilebadCaseOperationNoFile, allFileIDs=<null>(default)], resultingFileIDs=<null>(default), partialResult=<null>(default)]
10:19:13.217 WARN  o.b.protocol.bus.MessageReceiver - The following messages haven't been handled by the testcase: 
org.bitrepository.bitrepositorymessages.GetFileIDsFinalResponse@d8a5846[correlationID=09fe7cd8-bc9c-4375-bdc8-1ccde965ba63, collectionID=TwoPillarCollection, destination=TEST-TOPIC-badCaseOperationNoFile-cibuild01, replyTo=TEST-TOPIC-Pillar-badCaseOperationNoFile-cibuild01-contributor, from=Pillar-badCaseOperationNoFile, to=badCaseOperationNoFile, version=31, minVersion=24, responseInfo=org.bitrepository.bitrepositoryelements.ResponseInfo@7ccf6785[responseCode=FILE_NOT_FOUND_FAILURE, responseText=File not found.], pillarID=Pillar-badCaseOperationNoFile, fileIDs=org.bitrepository.bitrepositoryelements.FileIDs@1d38ca2b[fileID=DefaultFilebadCaseOperationNoFile, allFileIDs=<null>(default)], resultingFileIDs=<null>(default), partialResult=<null>(default)]
        Added fixture: Initialize a new Pillar.
      Test starting: goodCaseIdentification
        Description: Tests the identification for a GetFileIDs operation on the pillar for the successful scenario.
        Step: Set up constants and variables.
        Step: Setup for having the file and delivering pillar id
        Step: Create and send the identify request message.
          Result: Received message on TEST-TOPIC-goodCaseIdentification-cibuild01 : org.bitrepository.bitrepositorymessages.IdentifyPillarsForGetFileIDsResponse@1cc07127[correlationID=e33ea286-feac-4b45-866d-d40a6ae09588, collectionID=TwoPillarCollection, destination=TEST-TOPIC-goodCaseIdentification-cibuild01, replyTo=TEST-TOPIC-Pillar-goodCaseIdentification-cibuild01-contributor, from=Pillar-goodCaseIdentification, to=goodCaseIdentification, version=31, minVersion=24, responseInfo=org.bitrepository.bitrepositoryelements.ResponseInfo@23867b97[responseCode=IDENTIFICATION_POSITIVE, responseText=Operation acknowledged and accepted.], pillarID=Pillar-goodCaseIdentification, fileIDs=org.bitrepository.bitrepositoryelements.FileIDs@6b83b137[fileID=DefaultFilegoodCaseIdentification, allFileIDs=<null>(default)], timeToDeliver=org.bitrepository.bitrepositoryelements.TimeMeasureTYPE@4098a6b0[timeMeasureUnit=MILLISECONDS, timeMeasureValue=1000]]
        Step: Retrieve and validate the response getPillarID() the pillar.
      Test success: goodCaseIdentification
      Test starting: componentIDTest
      Test success: componentIDTest
    Starting testcase ReplaceFileTest
        Added fixture: Initialize a new Pillar.
      Test starting: badCaseIdentification
        Description: Tests the identification for a ReplaceFile operation on the pillar for the failure scenario, when the file does not exist.
        Step: Set up constants and variables.
        Step: Setup for not having the file and delivering pillar id
        Step: Create and send the identify request message.
          Result: Received message on TEST-TOPIC-badCaseIdentification-cibuild01 : org.bitrepository.bitrepositorymessages.IdentifyPillarsForReplaceFileResponse@52bd1783[correlationID=0a2e72fc-cc57-445f-8de2-0010076a8269, collectionID=TwoPillarCollection, destination=TEST-TOPIC-badCaseIdentification-cibuild01, replyTo=TEST-TOPIC-Pillar-badCaseIdentification-cibuild01-contributor, from=Pillar-badCaseIdentification, to=badCaseIdentification, version=31, minVersion=24, responseInfo=org.bitrepository.bitrepositoryelements.ResponseInfo@28f20b2a[responseCode=FILE_NOT_FOUND_FAILURE, responseText=Could not find the requested file to delete.], fileID=DefaultFile, pillarID=Pillar-badCaseIdentification, pillarChecksumSpec=<null>(default), timeToDeliver=<null>(default)]
        Step: Retrieve and validate the response getPillarID() the pillar.
      Test success: badCaseIdentification
        Added fixture: Initialize a new Pillar.
      Test starting: badCaseOperationMissingFile
        Description: Tests the ReplaceFile operation on the pillar for the failure scenario, when the file is missing.
        Step: Set up constants and variables.
        Step: Setup for not having the file and delivering pillar id
        Step: Create and send the identify request message.
          Result: Received message on TEST-TOPIC-badCaseOperationMissingFile-cibuild01 : org.bitrepository.bitrepositorymessages.ReplaceFileFinalResponse@6325ef80[correlationID=bfc14961-2d66-4ec7-b95f-d7086fa8a13a, collectionID=TwoPillarCollection, destination=TEST-TOPIC-badCaseOperationMissingFile-cibuild01, replyTo=TEST-TOPIC-Pillar-badCaseOperationMissingFile-cibuild01-contributor, from=Pillar-badCaseOperationMissingFile, to=badCaseOperationMissingFile, version=31, minVersion=24, responseInfo=org.bitrepository.bitrepositoryelements.ResponseInfo@66f4fb48[responseCode=FILE_NOT_FOUND_FAILURE, responseText=The file 'DefaultFile' has been requested, but we do not have that file!], pillarID=Pillar-badCaseOperationMissingFile, pillarChecksumSpec=<null>(default), fileID=DefaultFile, fileAddress=file:../bitrepository-core/src/test/resources/test-files//default-test-file.txt, checksumDataForExistingFile=<null>(default), checksumDataForNewFile=<null>(default)]
        Step: Retrieve the FinalResponse for the ReplaceFile request
      Test success: badCaseOperationMissingFile
        Added fixture: Initialize a new Pillar.
      Test starting: badCaseOperationNoDestructiveChecksum
        Description: Tests the ReplaceFile operation on the pillar for the failure scenario, when no validation checksum is given for the destructive action, but though is required.
        Step: Set up constants and variables.
        Step: Setup for having the file and delivering pillar id
        Step: Create and send the identify request message.
          Result: Received message on TEST-TOPIC-badCaseOperationNoDestructiveChecksum-cibuild01 : org.bitrepository.bitrepositorymessages.ReplaceFileFinalResponse@5876bdbb[correlationID=3dfa71f6-77b8-4efa-b226-59cc18b85125, collectionID=TwoPillarCollection, destination=TEST-TOPIC-badCaseOperationNoDestructiveChecksum-cibuild01, replyTo=TEST-TOPIC-Pillar-badCaseOperationNoDestructiveChecksum-cibuild01-contributor, from=Pillar-badCaseOperationNoDestructiveChecksum, to=badCaseOperationNoDestructiveChecksum, version=31, minVersion=24, responseInfo=org.bitrepository.bitrepositoryelements.ResponseInfo@4fa62aed[responseCode=EXISTING_FILE_CHECKSUM_FAILURE, responseText=According to the contract a checksum for file to be deleted during the replacing operation is required.], pillarID=Pillar-badCaseOperationNoDestructiveChecksum, pillarChecksumSpec=<null>(default), fileID=DefaultFile, fileAddress=file:../bitrepository-core/src/test/resources/test-files//default-test-file.txt, checksumDataForExistingFile=<null>(default), checksumDataForNewFile=<null>(default)]
10:19:17.392 WARN  o.b.p.common.PillarAlarmDispatcher - Sending alarm: org.bitrepository.bitrepositoryelements.Alarm@4e370f52[origDateTime=2020-09-04T10:19:17.391+02:00, alarmCode=CHECKSUM_ALARM, alarmRaiser=Pillar-badCaseOperationNoDestructiveChecksum, alarmText=According to the contract a checksum for file to be deleted during the replacing operation is required., fileID=DefaultFile, collectionID=TwoPillarCollection]
          Result: Received message on TEST-ALARM-TOPIC-cibuild01 : org.bitrepository.bitrepositorymessages.AlarmMessage@24cc60ef[correlationID=025e33e4-883d-4a60-83e1-0126b55cc10a, collectionID=TwoPillarCollection, destination=TEST-ALARM-TOPIC-cibuild01, replyTo=TEST-TOPIC-Pillar-badCaseOperationNoDestructiveChecksum-cibuild01-contributor, from=Pillar-badCaseOperationNoDestructiveChecksum, to=<null>(default), version=31, minVersion=24, alarm=org.bitrepository.bitrepositoryelements.Alarm@4e370f52[origDateTime=2020-09-04T10:19:17.391+02:00, alarmCode=CHECKSUM_ALARM, alarmRaiser=Pillar-badCaseOperationNoDestructiveChecksum, alarmText=According to the contract a checksum for file to be deleted during the replacing operation is required., fileID=DefaultFile, collectionID=TwoPillarCollection]]
        Step: Retrieve the FinalResponse for the ReplaceFile request
        Step: Pillar should have sent an alarm
      Test success: badCaseOperationNoDestructiveChecksum
        Added fixture: Initialize a new Pillar.
      Test starting: badCaseOperationNoValidationChecksum
        Description: Tests the ReplaceFile operation on the pillar for the failure scenario, when no validation checksum is given for the new file, but though is required.
        Step: Set up constants and variables.
        Step: Setup for having the file and delivering pillar id
        Step: Create and send the identify request message.
          Result: Received message on TEST-TOPIC-badCaseOperationNoValidationChecksum-cibuild01 : org.bitrepository.bitrepositorymessages.ReplaceFileFinalResponse@7a8d001b[correlationID=93d8cb60-46a4-4b65-ba0f-2965609fc1f1, collectionID=TwoPillarCollection, destination=TEST-TOPIC-badCaseOperationNoValidationChecksum-cibuild01, replyTo=TEST-TOPIC-Pillar-badCaseOperationNoValidationChecksum-cibuild01-contributor, from=Pillar-badCaseOperationNoValidationChecksum, to=badCaseOperationNoValidationChecksum, version=31, minVersion=24, responseInfo=org.bitrepository.bitrepositoryelements.ResponseInfo@3af64136[responseCode=NEW_FILE_CHECKSUM_FAILURE, responseText=According to the contract a checksum for new file in the replacing operation is required.], pillarID=Pillar-badCaseOperationNoValidationChecksum, pillarChecksumSpec=<null>(default), fileID=DefaultFile, fileAddress=file:../bitrepository-core/src/test/resources/test-files//default-test-file.txt, checksumDataForExistingFile=<null>(default), checksumDataForNewFile=<null>(default)]
10:19:17.607 WARN  o.b.p.common.PillarAlarmDispatcher - Sending alarm: org.bitrepository.bitrepositoryelements.Alarm@2f9f939[origDateTime=2020-09-04T10:19:17.607+02:00, alarmCode=CHECKSUM_ALARM, alarmRaiser=Pillar-badCaseOperationNoValidationChecksum, alarmText=According to the contract a checksum for new file in the replacing operation is required., fileID=DefaultFile, collectionID=TwoPillarCollection]
          Result: Received message on TEST-ALARM-TOPIC-cibuild01 : org.bitrepository.bitrepositorymessages.AlarmMessage@113366e7[correlationID=7c42d18f-f927-42e4-a935-fe70551c5fd9, collectionID=TwoPillarCollection, destination=TEST-ALARM-TOPIC-cibuild01, replyTo=TEST-TOPIC-Pillar-badCaseOperationNoValidationChecksum-cibuild01-contributor, from=Pillar-badCaseOperationNoValidationChecksum, to=<null>(default), version=31, minVersion=24, alarm=org.bitrepository.bitrepositoryelements.Alarm@2f9f939[origDateTime=2020-09-04T10:19:17.607+02:00, alarmCode=CHECKSUM_ALARM, alarmRaiser=Pillar-badCaseOperationNoValidationChecksum, alarmText=According to the contract a checksum for new file in the replacing operation is required., fileID=DefaultFile, collectionID=TwoPillarCollection]]
        Step: Retrieve the FinalResponse for the ReplaceFile request
        Step: Pillar should have sent an alarm
      Test success: badCaseOperationNoValidationChecksum
        Added fixture: Initialize a new Pillar.
      Test starting: badCaseOperationWrongDestructiveChecksum
        Description: Tests the ReplaceFile operation on the pillar for the failure scenario, when the checksum for the destructive action is different from the one in the cache.
        Step: Set up constants and variables.
        Step: Setup for having the file and delivering pillar id
        Step: Create and send the identify request message.
10:19:17.877 WARN  o.b.p.m.ReplaceFileRequestHandler - Failed to handle replace operation on file 'DefaultFile' since the request had the checksum '1234cccccccc4321' where our local file has the value '1234cccccccc4322'. Sending alarm and respond failure.
          Result: Received message on TEST-TOPIC-badCaseOperationWrongDestructiveChecksum-cibuild01 : org.bitrepository.bitrepositorymessages.ReplaceFileFinalResponse@3fe1a2ff[correlationID=36a5376f-da96-4632-ab4c-a9899d95f2ed, collectionID=TwoPillarCollection, destination=TEST-TOPIC-badCaseOperationWrongDestructiveChecksum-cibuild01, replyTo=TEST-TOPIC-Pillar-badCaseOperationWrongDestructiveChecksum-cibuild01-contributor, from=Pillar-badCaseOperationWrongDestructiveChecksum, to=badCaseOperationWrongDestructiveChecksum, version=31, minVersion=24, responseInfo=org.bitrepository.bitrepositoryelements.ResponseInfo@eecf56b[responseCode=EXISTING_FILE_CHECKSUM_FAILURE, responseText=Requested to replace the file 'DefaultFile' with checksum '1234cccccccc4321', but our file had a different checksum.], pillarID=Pillar-badCaseOperationWrongDestructiveChecksum, pillarChecksumSpec=<null>(default), fileID=DefaultFile, fileAddress=file:../bitrepository-core/src/test/resources/test-files//default-test-file.txt, checksumDataForExistingFile=<null>(default), checksumDataForNewFile=<null>(default)]
10:19:17.881 WARN  o.b.p.common.PillarAlarmDispatcher - Sending alarm: org.bitrepository.bitrepositoryelements.Alarm@28f6137b[origDateTime=2020-09-04T10:19:17.880+02:00, alarmCode=CHECKSUM_ALARM, alarmRaiser=Pillar-badCaseOperationWrongDestructiveChecksum, alarmText=Requested to replace the file 'DefaultFile' with checksum '1234cccccccc4321', but our file had a different checksum., fileID=DefaultFile, collectionID=TwoPillarCollection]
          Result: Received message on TEST-ALARM-TOPIC-cibuild01 : org.bitrepository.bitrepositorymessages.AlarmMessage@317e9cf5[correlationID=1489dec3-b086-4a4a-995a-bb1773039742, collectionID=TwoPillarCollection, destination=TEST-ALARM-TOPIC-cibuild01, replyTo=TEST-TOPIC-Pillar-badCaseOperationWrongDestructiveChecksum-cibuild01-contributor, from=Pillar-badCaseOperationWrongDestructiveChecksum, to=<null>(default), version=31, minVersion=24, alarm=org.bitrepository.bitrepositoryelements.Alarm@28f6137b[origDateTime=2020-09-04T10:19:17.880+02:00, alarmCode=CHECKSUM_ALARM, alarmRaiser=Pillar-badCaseOperationWrongDestructiveChecksum, alarmText=Requested to replace the file 'DefaultFile' with checksum '1234cccccccc4321', but our file had a different checksum., fileID=DefaultFile, collectionID=TwoPillarCollection]]
        Step: Retrieve the FinalResponse for the ReplaceFile request
        Step: Pillar should have sent an alarm
      Test success: badCaseOperationWrongDestructiveChecksum
        Added fixture: Initialize a new Pillar.
      Test starting: goodCaseIdentification
        Description: Tests the identification for a ReplaceFile operation on the pillar for the successful scenario.
        Step: Set up constants and variables.
        Step: Setup for having the file and delivering pillar id
        Step: Create and send the identify request message.
          Result: Received message on TEST-TOPIC-goodCaseIdentification-cibuild01 : org.bitrepository.bitrepositorymessages.IdentifyPillarsForReplaceFileResponse@16224bd8[correlationID=2dbe7444-5ada-47cc-a552-a9d179d3b29d, collectionID=TwoPillarCollection, destination=TEST-TOPIC-goodCaseIdentification-cibuild01, replyTo=TEST-TOPIC-Pillar-goodCaseIdentification-cibuild01-contributor, from=Pillar-goodCaseIdentification, to=goodCaseIdentification, version=31, minVersion=24, responseInfo=org.bitrepository.bitrepositoryelements.ResponseInfo@f6776e2[responseCode=IDENTIFICATION_POSITIVE, responseText=Operation acknowledged and accepted.], fileID=DefaultFile, pillarID=Pillar-goodCaseIdentification, pillarChecksumSpec=<null>(default), timeToDeliver=org.bitrepository.bitrepositoryelements.TimeMeasureTYPE@79e1f733[timeMeasureUnit=MILLISECONDS, timeMeasureValue=1000]]
        Step: Retrieve and validate the response getPillarID() the pillar.
      Test success: goodCaseIdentification
        Added fixture: Initialize a new Pillar.
      Test starting: goodCaseOperation
        Description: Tests the ReplaceFile operation on the pillar for the success scenario.
        Step: Set up constants and variables.
        Step: Setup for already having the file and delivering pillar id
        Step: Create and send the identify request message.
          Result: Received message on TEST-TOPIC-goodCaseOperation-cibuild01 : org.bitrepository.bitrepositorymessages.ReplaceFileProgressResponse@6f944b94[correlationID=b9e4519c-0ff4-4d7f-ba6c-4f70c3e1bc62, collectionID=TwoPillarCollection, destination=TEST-TOPIC-goodCaseOperation-cibuild01, replyTo=TEST-TOPIC-Pillar-goodCaseOperation-cibuild01-contributor, from=Pillar-goodCaseOperation, to=goodCaseOperation, version=31, minVersion=24, responseInfo=org.bitrepository.bitrepositoryelements.ResponseInfo@60296d11[responseCode=OPERATION_ACCEPTED_PROGRESS, responseText=Performing the ReplaceFileRequest for file 'DefaultFile' at 'TwoPillarCollection'.], pillarID=Pillar-goodCaseOperation, pillarChecksumSpec=<null>(default), fileID=DefaultFile, fileAddress=file:../bitrepository-core/src/test/resources/test-files//default-test-file.txt]
          Result: Received message on TEST-TOPIC-goodCaseOperation-cibuild01 : org.bitrepository.bitrepositorymessages.ReplaceFileFinalResponse@63c5a25d[correlationID=b9e4519c-0ff4-4d7f-ba6c-4f70c3e1bc62, collectionID=TwoPillarCollection, destination=TEST-TOPIC-goodCaseOperation-cibuild01, replyTo=TEST-TOPIC-Pillar-goodCaseOperation-cibuild01-contributor, from=Pillar-goodCaseOperation, to=goodCaseOperation, version=31, minVersion=24, responseInfo=org.bitrepository.bitrepositoryelements.ResponseInfo@2e408d5a[responseCode=OPERATION_COMPLETED, responseText=<null>(default)], pillarID=Pillar-goodCaseOperation, pillarChecksumSpec=<null>(default), fileID=DefaultFile, fileAddress=file:../bitrepository-core/src/test/resources/test-files//default-test-file.txt, checksumDataForExistingFile=<null>(default), checksumDataForNewFile=<null>(default)]
        Step: Retrieve the ProgressResponse for the GetFileIDs request
        Step: Retrieve the FinalResponse for the ReplaceFile request
      Test success: goodCaseOperation
        Added fixture: Initialize a new Pillar.
      Test starting: goodCaseOperationWithChecksumsReturn
        Description: Tests the ReplaceFile operation on the pillar for the success scenario, when requesting both the cheksums of the file returned.
        Step: Set up constants and variables.
        Step: Setup for already having the file and delivering pillar id
        Step: Create and send the identify request message.
          Result: Received message on TEST-TOPIC-goodCaseOperationWithChecksumsReturn-cibuild01 : org.bitrepository.bitrepositorymessages.ReplaceFileProgressResponse@47fa54d[correlationID=46a29a64-5138-4dc6-99ad-30d03fbea63c, collectionID=TwoPillarCollection, destination=TEST-TOPIC-goodCaseOperationWithChecksumsReturn-cibuild01, replyTo=TEST-TOPIC-Pillar-goodCaseOperationWithChecksumsReturn-cibuild01-contributor, from=Pillar-goodCaseOperationWithChecksumsReturn, to=goodCaseOperationWithChecksumsReturn, version=31, minVersion=24, responseInfo=org.bitrepository.bitrepositoryelements.ResponseInfo@3432a612[responseCode=OPERATION_ACCEPTED_PROGRESS, responseText=Performing the ReplaceFileRequest for file 'DefaultFile' at 'TwoPillarCollection'.], pillarID=Pillar-goodCaseOperationWithChecksumsReturn, pillarChecksumSpec=<null>(default), fileID=DefaultFile, fileAddress=file:../bitrepository-core/src/test/resources/test-files//default-test-file.txt]
          Result: Received message on TEST-TOPIC-goodCaseOperationWithChecksumsReturn-cibuild01 : org.bitrepository.bitrepositorymessages.ReplaceFileFinalResponse@5e57149f[correlationID=46a29a64-5138-4dc6-99ad-30d03fbea63c, collectionID=TwoPillarCollection, destination=TEST-TOPIC-goodCaseOperationWithChecksumsReturn-cibuild01, replyTo=TEST-TOPIC-Pillar-goodCaseOperationWithChecksumsReturn-cibuild01-contributor, from=Pillar-goodCaseOperationWithChecksumsReturn, to=goodCaseOperationWithChecksumsReturn, version=31, minVersion=24, responseInfo=org.bitrepository.bitrepositoryelements.ResponseInfo@737fd68[responseCode=OPERATION_COMPLETED, responseText=<null>(default)], pillarID=Pillar-goodCaseOperationWithChecksumsReturn, pillarChecksumSpec=<null>(default), fileID=DefaultFile, fileAddress=file:../bitrepository-core/src/test/resources/test-files//default-test-file.txt, checksumDataForExistingFile=org.bitrepository.bitrepositoryelements.ChecksumDataForFileTYPE@7e1b750e[checksumSpec=org.bitrepository.bitrepositoryelements.ChecksumSpecTYPE@5f385ee9[checksumType=HMAC_SHA512, checksumSalt={97,98}, otherChecksumType=<null>(default)], checksumValue={18,52,-52,-52,-52,-52,67,34}, calculationTimestamp=2020-09-04T10:19:20.596+02:00], checksumDataForNewFile=org.bitrepository.bitrepositoryelements.ChecksumDataForFileTYPE@39ad5a7d[checksumSpec=org.bitrepository.bitrepositoryelements.ChecksumSpecTYPE@1492c9d[checksumType=MD5, checksumSalt=<null>(default), otherChecksumType=<null>(default)], checksumValue={18,52,-52,-52,-52,-52,67,33}, calculationTimestamp=2020-09-04T10:19:20.598+02:00]]
        Step: Retrieve the ProgressResponse for the GetFileIDs request
        Step: Retrieve the FinalResponse for the ReplaceFile request
      Test success: goodCaseOperationWithChecksumsReturn
      Test starting: getPillarCollectionsTest
      Test success: getPillarCollectionsTest
    Starting testcase ChecksumDatabaseMigrationTest
      Test starting: testMigratingChecksumDatabaseFromV3ToV4
        Description: Tests that the checksums table can be migrated from version 3 to 4, e.g. changing the column calculatedchecksumdate from timestamp to bigint.
        Step: Ensure cleanup
10:19:21.726 WARN  o.b.common.utils.FileUtils - Could not delete '/home/cibuild01/workspace/Bitrepository-reference-test/bitrepository-reference-pillar/target/test/referencepillar/checksumdb-for-migration'
        Step: Unzipping and connecting to checksum database version 3
        Step: Validate setup
        Step: Ingest a entry to the database with a date for the calculationdate
        Step: Perform migration
10:19:24.333 WARN  o.b.service.database.DatabaseUtils - Migrating ChecksumDB from version 3 to 4.
        Step: Validate the migration
      Test success: testMigratingChecksumDatabaseFromV3ToV4
    Starting testcase ChecksumDatabaseTest
      Test starting: testChecksumDatabaseExtraction
        Description: Test the extraction of data from the checksum database.
        Step: Check whether the default entry exists.
        Step: Extract calculation date
        Step: Extract the checksum
        Step: Extract the whole entry
        Step: Extract all entries
      Test success: testChecksumDatabaseExtraction
      Test starting: testDeletion
        Description: Test that data can be deleted from the database.
        Step: Check whether the default entry exists.
        Step: Remove the default entry
      Test success: testDeletion
      Test starting: testExtractionOfMissingData
        Description: Test the handling of bad arguments.
        Step: Try to get the date of a wrong file id.
        Step: Try to get the date of a wrong file id.
        Step: Try to remove a bad file id
      Test success: testExtractionOfMissingData
      Test starting: testGetChecksumResult
        Description: Tests the restrictions on the GetChecksumResult call to the database.
        Step: Instantiate database with appropriate data.
        Step: Test with no time restrictions
        Step: Test with time restrictions from epoc to now
        Step: Test with very strict time restrictions around the default date
        Step: Test with too new a lower limit
        Step: Test with exact date as both upper and lower limit
        Step: Test with date limit from 1 millis before as lower and exact date a upper limit
        Step: Test with date limit from exact date as lower and 1 millis after date a upper limit
        Step: Test with too old an upper limit
      Test success: testGetChecksumResult
      Test starting: testGetFileIDsRestrictions
        Description: Tests the restrictions on the GetFileIDs call to the database.
        Step: Instantiate database with appropriate data.
        Step: Test with no time restrictions and 10000 max_results
        Step: Test with minimum-date earlier than first file
        Step: Test with maximum-date earlier than first file
        Step: Test with minimum-date set to later than second file.
        Step: Test with maximum-date set to later than second file.
        Step: Test with minimum-date set to middle date.
        Step: Test with maximum-date set to middle date.
        Step: Test with both minimum-date and maximum-date set to middle date.
        Step: Test the first file-id, with no other restrictions
        Step: Test the second file-id, with no other restrictions
        Step: Test the date for the first file-id, while requesting the second file-id
      Test success: testGetFileIDsRestrictions
      Test starting: testGetFileIDsWithOldChecksums
        Description: Tests the restrictions on the GetFileIDsWithOldChecksums call to the database.
        Step: Instantiate database with appropriate data.
        Step: Extract all entries with checksum date older than now
        Step: Extract all entries with checksum date older than epoch
        Step: Extract all entries with checksum date older than middle date
      Test success: testGetFileIDsWithOldChecksums
      Test starting: testReplacingExistingEntry
        Description: Test that an entry can be replaced by another in the database.
        Step: Check whether the default entry exists.
        Step: Replace the checksum and date
      Test success: testReplacingExistingEntry
      Test starting: testSpecifiedEntryExtraction
        Description: Test that specific entries can be extracted. Has two entries in the database: one for the current timestamp and one for the epoch.
        Step: Instantiate database with appropriate data.
        Step: Extract with out restrictions
        Step: Extract with a maximum of 1 entry
        Step: Extract all dates older than this tests instantiation
        Step: Extract all dates newer than this tests instantiation
        Step: Extract all dates older than the newest instance
        Step: Extract all dates newer than the oldest instantiation
      Test success: testSpecifiedEntryExtraction
    Starting testcase DeleteFileTest
        Added fixture: Initialize a new Pillar.
      Test starting: badCaseIdentification
        Description: Tests the identification for a DeleteFile operation on the checksum pillar for the failure scenario, when the file is missing.
        Step: Set up constants and variables.
        Step: Setup for delivering pillar id and not having the file 
        Step: Create and send the identify request message.
          Result: Received message on TEST-TOPIC-badCaseIdentification-cibuild01 : org.bitrepository.bitrepositorymessages.IdentifyPillarsForDeleteFileResponse@770ecf53[correlationID=fe500330-fb1b-4ef9-aa10-e935285c6bd3, collectionID=TwoPillarCollection, destination=TEST-TOPIC-badCaseIdentification-cibuild01, replyTo=TEST-TOPIC-Pillar-badCaseIdentification-cibuild01-contributor, from=Pillar-badCaseIdentification, to=badCaseIdentification, version=31, minVersion=24, responseInfo=org.bitrepository.bitrepositoryelements.ResponseInfo@1969034e[responseCode=FILE_NOT_FOUND_FAILURE, responseText=File not found.], fileID=DefaultFilebadCaseIdentification, pillarID=Pillar-badCaseIdentification, pillarChecksumSpec=<null>(default), timeToDeliver=<null>(default)]
        Step: Retrieve and validate the response getPillarID() the pillar.
      Test success: badCaseIdentification
        Added fixture: Initialize a new Pillar.
      Test starting: badCaseOperationMissingVerification
        Description: Tests the DeleteFile functionality of the pillar for the failure scenario, where it does not have the file.
        Step: Set up constants and variables.
        Step: Setup for delivering pillar id and having the file 
        Step: Create and send the actual DeleteFile message to the pillar.
          Result: Received message on TEST-TOPIC-badCaseOperationMissingVerification-cibuild01 : org.bitrepository.bitrepositorymessages.DeleteFileFinalResponse@1c5f791a[correlationID=250086eb-7b44-416e-a470-89a6259563a2, collectionID=TwoPillarCollection, destination=TEST-TOPIC-badCaseOperationMissingVerification-cibuild01, replyTo=TEST-TOPIC-Pillar-badCaseOperationMissingVerification-cibuild01-contributor, from=Pillar-badCaseOperationMissingVerification, to=badCaseOperationMissingVerification, version=31, minVersion=24, responseInfo=org.bitrepository.bitrepositoryelements.ResponseInfo@79229358[responseCode=EXISTING_FILE_CHECKSUM_FAILURE, responseText=No mandatory checksum for destructive operation was supplied.], pillarID=Pillar-badCaseOperationMissingVerification, fileID=DefaultFilebadCaseOperationMissingVerification, checksumDataForExistingFile=<null>(default)]
10:19:34.954 WARN  o.b.p.common.PillarAlarmDispatcher - Sending alarm: org.bitrepository.bitrepositoryelements.Alarm@18a79b9f[origDateTime=2020-09-04T10:19:34.954+02:00, alarmCode=CHECKSUM_ALARM, alarmRaiser=Pillar-badCaseOperationMissingVerification, alarmText=No mandatory checksum for destructive operation was supplied., fileID=DefaultFilebadCaseOperationMissingVerification, collectionID=TwoPillarCollection]
          Result: Received message on TEST-ALARM-TOPIC-cibuild01 : org.bitrepository.bitrepositorymessages.AlarmMessage@7f57a638[correlationID=30c3cb60-8092-49b0-ab64-5472926589a0, collectionID=TwoPillarCollection, destination=TEST-ALARM-TOPIC-cibuild01, replyTo=TEST-TOPIC-Pillar-badCaseOperationMissingVerification-cibuild01-contributor, from=Pillar-badCaseOperationMissingVerification, to=<null>(default), version=31, minVersion=24, alarm=org.bitrepository.bitrepositoryelements.Alarm@18a79b9f[origDateTime=2020-09-04T10:19:34.954+02:00, alarmCode=CHECKSUM_ALARM, alarmRaiser=Pillar-badCaseOperationMissingVerification, alarmText=No mandatory checksum for destructive operation was supplied., fileID=DefaultFilebadCaseOperationMissingVerification, collectionID=TwoPillarCollection]]
        Step: Retrieve the FinalResponse for the DeleteFile request
        Step: Pillar should have sent an alarm
      Test success: badCaseOperationMissingVerification
        Added fixture: Initialize a new Pillar.
      Test starting: badCaseOperationNoFile
        Description: Tests the DeleteFile functionality of the pillar for the failure scenario, where it does not have the file.
        Step: Set up constants and variables.
        Step: Setup for delivering pillar id and not having the file 
        Step: Create and send the actual DeleteFile message to the pillar.
          Result: Received message on TEST-TOPIC-badCaseOperationNoFile-cibuild01 : org.bitrepository.bitrepositorymessages.DeleteFileFinalResponse@17c1b7c8[correlationID=07f7a8a8-49ba-4006-b6db-69cfae18cd03, collectionID=TwoPillarCollection, destination=TEST-TOPIC-badCaseOperationNoFile-cibuild01, replyTo=TEST-TOPIC-Pillar-badCaseOperationNoFile-cibuild01-contributor, from=Pillar-badCaseOperationNoFile, to=badCaseOperationNoFile, version=31, minVersion=24, responseInfo=org.bitrepository.bitrepositoryelements.ResponseInfo@1339f9e0[responseCode=FILE_NOT_FOUND_FAILURE, responseText=File not found.], pillarID=Pillar-badCaseOperationNoFile, fileID=DefaultFilebadCaseOperationNoFile, checksumDataForExistingFile=<null>(default)]
          Result: Received message on TEST-TOPIC-badCaseOperationNoFile-cibuild01 : org.bitrepository.bitrepositorymessages.DeleteFileFinalResponse@71c90ddf[correlationID=07f7a8a8-49ba-4006-b6db-69cfae18cd03, collectionID=TwoPillarCollection, destination=TEST-TOPIC-badCaseOperationNoFile-cibuild01, replyTo=TEST-TOPIC-Pillar-badCaseOperationNoFile-cibuild01-contributor, from=Pillar-badCaseOperationNoFile, to=badCaseOperationNoFile, version=31, minVersion=24, responseInfo=org.bitrepository.bitrepositoryelements.ResponseInfo@6bac8bd9[responseCode=FILE_NOT_FOUND_FAILURE, responseText=File not found.], pillarID=Pillar-badCaseOperationNoFile, fileID=DefaultFilebadCaseOperationNoFile, checksumDataForExistingFile=<null>(default)]
          Result: Received message on TEST-TOPIC-badCaseOperationNoFile-cibuild01 : org.bitrepository.bitrepositorymessages.DeleteFileFinalResponse@6576eba4[correlationID=07f7a8a8-49ba-4006-b6db-69cfae18cd03, collectionID=TwoPillarCollection, destination=TEST-TOPIC-badCaseOperationNoFile-cibuild01, replyTo=TEST-TOPIC-Pillar-badCaseOperationNoFile-cibuild01-contributor, from=Pillar-badCaseOperationNoFile, to=badCaseOperationNoFile, version=31, minVersion=24, responseInfo=org.bitrepository.bitrepositoryelements.ResponseInfo@5ce8b520[responseCode=FILE_NOT_FOUND_FAILURE, responseText=File not found.], pillarID=Pillar-badCaseOperationNoFile, fileID=DefaultFilebadCaseOperationNoFile, checksumDataForExistingFile=<null>(default)]
        Step: Retrieve the FinalResponse for the DeleteFile request
      Test success: badCaseOperationNoFile
          Result: The following messages haven't been handled by the testcase: 
org.bitrepository.bitrepositorymessages.DeleteFileFinalResponse@71c90ddf[correlationID=07f7a8a8-49ba-4006-b6db-69cfae18cd03, collectionID=TwoPillarCollection, destination=TEST-TOPIC-badCaseOperationNoFile-cibuild01, replyTo=TEST-TOPIC-Pillar-badCaseOperationNoFile-cibuild01-contributor, from=Pillar-badCaseOperationNoFile, to=badCaseOperationNoFile, version=31, minVersion=24, responseInfo=org.bitrepository.bitrepositoryelements.ResponseInfo@6bac8bd9[responseCode=FILE_NOT_FOUND_FAILURE, responseText=File not found.], pillarID=Pillar-badCaseOperationNoFile, fileID=DefaultFilebadCaseOperationNoFile, checksumDataForExistingFile=<null>(default)]
org.bitrepository.bitrepositorymessages.DeleteFileFinalResponse@6576eba4[correlationID=07f7a8a8-49ba-4006-b6db-69cfae18cd03, collectionID=TwoPillarCollection, destination=TEST-TOPIC-badCaseOperationNoFile-cibuild01, replyTo=TEST-TOPIC-Pillar-badCaseOperationNoFile-cibuild01-contributor, from=Pillar-badCaseOperationNoFile, to=badCaseOperationNoFile, version=31, minVersion=24, responseInfo=org.bitrepository.bitrepositoryelements.ResponseInfo@5ce8b520[responseCode=FILE_NOT_FOUND_FAILURE, responseText=File not found.], pillarID=Pillar-badCaseOperationNoFile, fileID=DefaultFilebadCaseOperationNoFile, checksumDataForExistingFile=<null>(default)]
10:19:36.164 WARN  o.b.protocol.bus.MessageReceiver - The following messages haven't been handled by the testcase: 
org.bitrepository.bitrepositorymessages.DeleteFileFinalResponse@71c90ddf[correlationID=07f7a8a8-49ba-4006-b6db-69cfae18cd03, collectionID=TwoPillarCollection, destination=TEST-TOPIC-badCaseOperationNoFile-cibuild01, replyTo=TEST-TOPIC-Pillar-badCaseOperationNoFile-cibuild01-contributor, from=Pillar-badCaseOperationNoFile, to=badCaseOperationNoFile, version=31, minVersion=24, responseInfo=org.bitrepository.bitrepositoryelements.ResponseInfo@6bac8bd9[responseCode=FILE_NOT_FOUND_FAILURE, responseText=File not found.], pillarID=Pillar-badCaseOperationNoFile, fileID=DefaultFilebadCaseOperationNoFile, checksumDataForExistingFile=<null>(default)]
org.bitrepository.bitrepositorymessages.DeleteFileFinalResponse@6576eba4[correlationID=07f7a8a8-49ba-4006-b6db-69cfae18cd03, collectionID=TwoPillarCollection, destination=TEST-TOPIC-badCaseOperationNoFile-cibuild01, replyTo=TEST-TOPIC-Pillar-badCaseOperationNoFile-cibuild01-contributor, from=Pillar-badCaseOperationNoFile, to=badCaseOperationNoFile, version=31, minVersion=24, responseInfo=org.bitrepository.bitrepositoryelements.ResponseInfo@5ce8b520[responseCode=FILE_NOT_FOUND_FAILURE, responseText=File not found.], pillarID=Pillar-badCaseOperationNoFile, fileID=DefaultFilebadCaseOperationNoFile, checksumDataForExistingFile=<null>(default)]
        Added fixture: Initialize a new Pillar.
      Test starting: goodCaseIdentification
        Description: Tests the identification for a DeleteFile operation on the pillar for the successful scenario.
        Step: Set up constants and variables.
        Step: Setup for having the file and delivering pillar id
        Step: Create and send the identify request message.
          Result: Received message on TEST-TOPIC-goodCaseIdentification-cibuild01 : org.bitrepository.bitrepositorymessages.IdentifyPillarsForDeleteFileResponse@4bfed947[correlationID=000bb8b6-7c71-4bc8-8cdd-97ea0e556d6c, collectionID=TwoPillarCollection, destination=TEST-TOPIC-goodCaseIdentification-cibuild01, replyTo=TEST-TOPIC-Pillar-goodCaseIdentification-cibuild01-contributor, from=Pillar-goodCaseIdentification, to=goodCaseIdentification, version=31, minVersion=24, responseInfo=org.bitrepository.bitrepositoryelements.ResponseInfo@74d083c8[responseCode=IDENTIFICATION_POSITIVE, responseText=Operation acknowledged and accepted.], fileID=DefaultFilegoodCaseIdentification, pillarID=Pillar-goodCaseIdentification, pillarChecksumSpec=<null>(default), timeToDeliver=org.bitrepository.bitrepositoryelements.TimeMeasureTYPE@1b5c7fd8[timeMeasureUnit=MILLISECONDS, timeMeasureValue=1000]]
        Step: Retrieve and validate the response getPillarID() the pillar.
      Test success: goodCaseIdentification
    Starting testcase FullPillarModelTest
      Test starting: testPillarModelBasicFunctionality
        Description: Test the basic functions of the full reference pillar model.
        Step: Check the pillar id in the pillar model
        Step: Ask whether it can handle a file of size 0
        Step: Ask whether it can handle a file of maximum size
        Step: Check the ChecksumPillarSpec
      Test success: testPillarModelBasicFunctionality
      Test starting: testPillarModelHasFile
        Description: Test that the file exists, when placed in the archive and cache
        Step: Setup
        Step: Check whether file exists and retrieve it.
        Step: Verify that no exceptions are thrown when verifying file existance.
        Step: Check retrieval of non-default checksum
      Test success: testPillarModelHasFile
      Test starting: testPillarModelNoFile
        Description: Test that the file exists, when placed in the archive and cache
        Step: Setup
        Step: Check whether file exists and try to retrieve it.
        Step: Verify that anexceptions are thrown when verifying file existance.
10:19:38.291 WARN  o.b.pillar.store.FileStorageModel - The file 'DefaultFile' has been requested, but we do not have that file in collection 'TwoPillarCollection'!
      Test success: testPillarModelNoFile
    Starting testcase GeneralMessageHandlingTest
        Added fixture: Initialize a new Pillar.
      Test starting: testPillarMessageHandler
        Description: Test the handling of the PillarMessageHandler super-class.
        Step: Setup
        Step: Test the pillar ID
      Test success: testPillarMessageHandler
        Added fixture: Initialize a new Pillar.
      Test starting: testPillarMessageHandlerValidateFileIDFormatDefaultFileId
        Description: Test the validation of file id formats of the PillarMessageHandler super-class on the default file id
      Test success: testPillarMessageHandlerValidateFileIDFormatDefaultFileId
        Added fixture: Initialize a new Pillar.
      Test starting: testPillarMessageHandlerValidateFileIDFormatEnvHomePathFileId
        Description: Test the validation of file id formats of the PillarMessageHandler super-class on a file id containing path relative paths from the environment variable home folder
      Test success: testPillarMessageHandlerValidateFileIDFormatEnvHomePathFileId
        Added fixture: Initialize a new Pillar.
      Test starting: testPillarMessageHandlerValidateFileIDFormatFolderFileId
        Description: Test the validation of file id formats of the PillarMessageHandler super-class on a file id with directory path
      Test success: testPillarMessageHandlerValidateFileIDFormatFolderFileId
        Added fixture: Initialize a new Pillar.
      Test starting: testPillarMessageHandlerValidateFileIDFormatParentFolderFileId
        Description: Test the validation of file id formats of the PillarMessageHandler super-class on a file id containing path to a parent directory
      Test success: testPillarMessageHandlerValidateFileIDFormatParentFolderFileId
        Added fixture: Initialize a new Pillar.
      Test starting: testPillarMessageHandlerValidateFileIDFormatRootPathFileId
        Description: Test the validation of file id formats of the PillarMessageHandler super-class on a file id containing path from the root folder
      Test success: testPillarMessageHandlerValidateFileIDFormatRootPathFileId
        Added fixture: Initialize a new Pillar.
      Test starting: testPillarMessageHandlerValidateFileIDFormatSubFolderToParentFolderFileId
        Description: Test the validation of file id formats of the PillarMessageHandler super-class on a file id containing path to a parent directory, but starting with a sub-folder
      Test success: testPillarMessageHandlerValidateFileIDFormatSubFolderToParentFolderFileId
        Added fixture: Initialize a new Pillar.
      Test starting: testPillarMessageHandlerValidateFileIDFormatTildeHomePathFileId
        Description: Test the validation of file id formats of the PillarMessageHandler super-class on a file id containing path relative paths from the tilde home folder
      Test success: testPillarMessageHandlerValidateFileIDFormatTildeHomePathFileId
        Added fixture: Initialize a new Pillar.
      Test starting: testPillarMessageHandlerValidateFileIDFormatTooLong
        Description: Test the validation of file id formats of the PillarMessageHandler super-class on a file id which has more characters than required
      Test success: testPillarMessageHandlerValidateFileIDFormatTooLong
    Starting testcase GetFileTest
        Added fixture: Initialize a new Pillar.
      Test starting: badCaseIdentification
        Description: Tests the identification for a GetFile operation on the checksum pillar for the failure scenario, when the file is missing.
        Step: Set up constants and variables.
        Step: Setup for throwing an exception when asked to verify file existence
        Step: Create and send the identify request message.
          Result: Received message on TEST-TOPIC-badCaseIdentification-cibuild01 : org.bitrepository.bitrepositorymessages.IdentifyPillarsForGetFileResponse@4ba19f19[correlationID=d8b6fed5-5bd0-4525-882a-025f5e04b00a, collectionID=TwoPillarCollection, destination=TEST-TOPIC-badCaseIdentification-cibuild01, replyTo=TEST-TOPIC-Pillar-badCaseIdentification-cibuild01-contributor, from=Pillar-badCaseIdentification, to=badCaseIdentification, version=31, minVersion=24, responseInfo=org.bitrepository.bitrepositoryelements.ResponseInfo@40cb109d[responseCode=FILE_NOT_FOUND_FAILURE, responseText=File not found.], fileID=DefaultFilebadCaseIdentification, pillarID=Pillar-badCaseIdentification, timeToDeliver=<null>(default)]
        Step: Retrieve and validate the response getPillarID() the pillar.
      Test success: badCaseIdentification
        Added fixture: Initialize a new Pillar.
      Test starting: goodCaseIdentification
        Description: Tests the identification for a GetFile operation on the pillar for the successful scenario.
        Step: Set up constants and variables.
        Step: Setup for having the file and delivering pillar id
        Step: Create and send the identify request message.
          Result: Received message on TEST-TOPIC-goodCaseIdentification-cibuild01 : org.bitrepository.bitrepositorymessages.IdentifyPillarsForGetFileResponse@620fbf3a[correlationID=41d87490-3d87-4c71-9507-378e190ae4fc, collectionID=TwoPillarCollection, destination=TEST-TOPIC-goodCaseIdentification-cibuild01, replyTo=TEST-TOPIC-Pillar-goodCaseIdentification-cibuild01-contributor, from=Pillar-goodCaseIdentification, to=goodCaseIdentification, version=31, minVersion=24, responseInfo=org.bitrepository.bitrepositoryelements.ResponseInfo@43bc8030[responseCode=IDENTIFICATION_POSITIVE, responseText=Operation acknowledged and accepted.], fileID=DefaultFilegoodCaseIdentification, pillarID=Pillar-goodCaseIdentification, timeToDeliver=org.bitrepository.bitrepositoryelements.TimeMeasureTYPE@76128ab5[timeMeasureUnit=MILLISECONDS, timeMeasureValue=1000]]
        Step: Retrieve and validate the response getPillarID() the pillar.
      Test success: goodCaseIdentification
    Starting testcase PutFileTest
        Added fixture: Initialize a new Pillar.
      Test starting: badCaseIdentification
        Description: Tests the identification for a PutFile operation on the pillar for the failure scenario, when the file already exists.
        Step: Set up constants and variables.
        Step: Setup for already having the file and delivering pillar id
        Step: Create and send the identify request message.
          Result: Received message on TEST-TOPIC-badCaseIdentification-cibuild01 : org.bitrepository.bitrepositorymessages.IdentifyPillarsForPutFileResponse@612b1b5[correlationID=b7665047-be1e-4bd4-a4a5-a2f4a35e79f3, collectionID=TwoPillarCollection, destination=TEST-TOPIC-badCaseIdentification-cibuild01, replyTo=TEST-TOPIC-Pillar-badCaseIdentification-cibuild01-contributor, from=Pillar-badCaseIdentification, to=badCaseIdentification, version=31, minVersion=24, responseInfo=org.bitrepository.bitrepositoryelements.ResponseInfo@28203154[responseCode=DUPLICATE_FILE_FAILURE, responseText=<null>(default)], pillarID=Pillar-badCaseIdentification, fileID=DefaultFilebadCaseIdentification, pillarChecksumSpec=<null>(default), checksumDataForExistingFile=<null>(default), timeToDeliver=org.bitrepository.bitrepositoryelements.TimeMeasureTYPE@281f4497[timeMeasureUnit=MILLISECONDS, timeMeasureValue=1000]]
        Step: Retrieve and validate the response getPillarID() the pillar.
      Test success: badCaseIdentification
        Added fixture: Initialize a new Pillar.
      Test starting: badCaseOperationFileAlreadyExists
        Description: Tests the PutFile operation on the pillar for the failure scenario, when the file already exists.
        Step: Set up constants and variables.
        Step: Setup for already having the file and delivering pillar id
        Step: Create and send the identify request message.
          Result: Received message on TEST-TOPIC-badCaseOperationFileAlreadyExists-cibuild01 : org.bitrepository.bitrepositorymessages.PutFileFinalResponse@59a45b95[correlationID=3ac602c0-f6d4-4ab2-afb0-939206d523f8, collectionID=TwoPillarCollection, destination=TEST-TOPIC-badCaseOperationFileAlreadyExists-cibuild01, replyTo=TEST-TOPIC-Pillar-badCaseOperationFileAlreadyExists-cibuild01-contributor, from=Pillar-badCaseOperationFileAlreadyExists, to=badCaseOperationFileAlreadyExists, version=31, minVersion=24, responseInfo=org.bitrepository.bitrepositoryelements.ResponseInfo@1faef660[responseCode=DUPLICATE_FILE_FAILURE, responseText=We already have the file], pillarID=Pillar-badCaseOperationFileAlreadyExists, pillarChecksumSpec=<null>(default), fileID=DefaultFilebadCaseOperationFileAlreadyExists, fileAddress=file:../bitrepository-core/src/test/resources/test-files//default-test-file.txt, checksumDataForNewFile=<null>(default), checksumDataForExistingFile=<null>(default)]
        Step: Retrieve the FinalResponse for the PutFile request
      Test success: badCaseOperationFileAlreadyExists
        Added fixture: Initialize a new Pillar.
      Test starting: badCasePutOperationNoValidationChecksum
        Description: Tests the PutFile operation on the pillar for the failure scenario, when no validation checksum is given but required.
        Step: Set up constants and variables.
        Step: Setup for not already having the file and delivering pillar id
        Step: Create and send the identify request message.
          Result: Received message on TEST-TOPIC-badCasePutOperationNoValidationChecksum-cibuild01 : org.bitrepository.bitrepositorymessages.PutFileFinalResponse@5bb1b018[correlationID=9c7a236d-4f1b-414a-a3ec-71b705f499c0, collectionID=TwoPillarCollection, destination=TEST-TOPIC-badCasePutOperationNoValidationChecksum-cibuild01, replyTo=TEST-TOPIC-Pillar-badCasePutOperationNoValidationChecksum-cibuild01-contributor, from=Pillar-badCasePutOperationNoValidationChecksum, to=badCasePutOperationNoValidationChecksum, version=31, minVersion=24, responseInfo=org.bitrepository.bitrepositoryelements.ResponseInfo@779f4ee6[responseCode=NEW_FILE_CHECKSUM_FAILURE, responseText=A checksum is required for the PutFile operation to be performed.], pillarID=Pillar-badCasePutOperationNoValidationChecksum, pillarChecksumSpec=<null>(default), fileID=DefaultFilebadCasePutOperationNoValidationChecksum, fileAddress=file:../bitrepository-core/src/test/resources/test-files//default-test-file.txt, checksumDataForNewFile=<null>(default), checksumDataForExistingFile=<null>(default)]
10:19:44.824 WARN  o.b.p.common.PillarAlarmDispatcher - Sending alarm: org.bitrepository.bitrepositoryelements.Alarm@6627aa35[origDateTime=2020-09-04T10:19:44.823+02:00, alarmCode=CHECKSUM_ALARM, alarmRaiser=Pillar-badCasePutOperationNoValidationChecksum, alarmText=A checksum is required for the PutFile operation to be performed., fileID=DefaultFilebadCasePutOperationNoValidationChecksum, collectionID=TwoPillarCollection]
          Result: Received message on TEST-ALARM-TOPIC-cibuild01 : org.bitrepository.bitrepositorymessages.AlarmMessage@14cbf6f5[correlationID=86ed1268-a6f0-4868-ba78-f834f358fbeb, collectionID=TwoPillarCollection, destination=TEST-ALARM-TOPIC-cibuild01, replyTo=TEST-TOPIC-Pillar-badCasePutOperationNoValidationChecksum-cibuild01-contributor, from=Pillar-badCasePutOperationNoValidationChecksum, to=<null>(default), version=31, minVersion=24, alarm=org.bitrepository.bitrepositoryelements.Alarm@6627aa35[origDateTime=2020-09-04T10:19:44.823+02:00, alarmCode=CHECKSUM_ALARM, alarmRaiser=Pillar-badCasePutOperationNoValidationChecksum, alarmText=A checksum is required for the PutFile operation to be performed., fileID=DefaultFilebadCasePutOperationNoValidationChecksum, collectionID=TwoPillarCollection]]
        Step: Retrieve the FinalResponse for the PutFile request
        Step: Pillar should have sent an alarm
      Test success: badCasePutOperationNoValidationChecksum
        Added fixture: Initialize a new Pillar.
      Test starting: goodCaseIdentification
        Description: Tests the identification for a PutFile operation on the pillar for the successful scenario.
        Step: Set up constants and variables.
        Step: Setup for not already having the file and delivering pillar id
        Step: Create and send the identify request message.
          Result: Received message on TEST-TOPIC-goodCaseIdentification-cibuild01 : org.bitrepository.bitrepositorymessages.IdentifyPillarsForPutFileResponse@1807c124[correlationID=40fd3049-d2d5-4475-ab50-65133f1a151b, collectionID=TwoPillarCollection, destination=TEST-TOPIC-goodCaseIdentification-cibuild01, replyTo=TEST-TOPIC-Pillar-goodCaseIdentification-cibuild01-contributor, from=Pillar-goodCaseIdentification, to=goodCaseIdentification, version=31, minVersion=24, responseInfo=org.bitrepository.bitrepositoryelements.ResponseInfo@7257b1e6[responseCode=IDENTIFICATION_POSITIVE, responseText=Operation acknowledged and accepted.], pillarID=Pillar-goodCaseIdentification, fileID=DefaultFilegoodCaseIdentification, pillarChecksumSpec=<null>(default), checksumDataForExistingFile=<null>(default), timeToDeliver=org.bitrepository.bitrepositoryelements.TimeMeasureTYPE@18eb36ff[timeMeasureUnit=MILLISECONDS, timeMeasureValue=1000]]
        Step: Retrieve and validate the response getPillarID() the pillar.
      Test success: goodCaseIdentification
        Added fixture: Initialize a new Pillar.
      Test starting: goodCaseOperationWithChecksumReturn
        Description: Tests the PutFile operation on the pillar for the success scenario, when requesting the cheksum of the file returned.
        Step: Set up constants and variables.
        Step: Setup for not already having the file and delivering pillar id, and delivering an answer for the checksum request
        Step: Create and send the identify request message.
          Result: Received message on TEST-TOPIC-goodCaseOperationWithChecksumReturn-cibuild01 : org.bitrepository.bitrepositorymessages.PutFileProgressResponse@3c6aae8[correlationID=c3bc936d-6a62-4ea4-9434-f7ff29846655, collectionID=TwoPillarCollection, destination=TEST-TOPIC-goodCaseOperationWithChecksumReturn-cibuild01, replyTo=TEST-TOPIC-Pillar-goodCaseOperationWithChecksumReturn-cibuild01-contributor, from=Pillar-goodCaseOperationWithChecksumReturn, to=goodCaseOperationWithChecksumReturn, version=31, minVersion=24, responseInfo=org.bitrepository.bitrepositoryelements.ResponseInfo@27eab174[responseCode=OPERATION_ACCEPTED_PROGRESS, responseText=Started to receive data.], pillarID=Pillar-goodCaseOperationWithChecksumReturn, pillarChecksumSpec=<null>(default), fileID=DefaultFilegoodCaseOperationWithChecksumReturn, fileAddress=file:../bitrepository-core/src/test/resources/test-files//default-test-file.txt]
          Result: Received message on TEST-TOPIC-goodCaseOperationWithChecksumReturn-cibuild01 : org.bitrepository.bitrepositorymessages.PutFileFinalResponse@32dfaf36[correlationID=c3bc936d-6a62-4ea4-9434-f7ff29846655, collectionID=TwoPillarCollection, destination=TEST-TOPIC-goodCaseOperationWithChecksumReturn-cibuild01, replyTo=TEST-TOPIC-Pillar-goodCaseOperationWithChecksumReturn-cibuild01-contributor, from=Pillar-goodCaseOperationWithChecksumReturn, to=goodCaseOperationWithChecksumReturn, version=31, minVersion=24, responseInfo=org.bitrepository.bitrepositoryelements.ResponseInfo@4f8c26f[responseCode=OPERATION_COMPLETED, responseText=<null>(default)], pillarID=Pillar-goodCaseOperationWithChecksumReturn, pillarChecksumSpec=<null>(default), fileID=DefaultFilegoodCaseOperationWithChecksumReturn, fileAddress=file:../bitrepository-core/src/test/resources/test-files//default-test-file.txt, checksumDataForNewFile=org.bitrepository.bitrepositoryelements.ChecksumDataForFileTYPE@766bb295[checksumSpec=org.bitrepository.bitrepositoryelements.ChecksumSpecTYPE@7a832fdb[checksumType=MD5, checksumSalt=<null>(default), otherChecksumType=<null>(default)], checksumValue={18,52,-52,-52,-52,-52,67,33}, calculationTimestamp=2020-09-04T10:19:46.233+02:00], checksumDataForExistingFile=<null>(default)]
        Step: Retrieve the ProgressResponse for the GetFileIDs request
        Step: Retrieve the FinalResponse for the PutFile request
      Test success: goodCaseOperationWithChecksumReturn
    Starting testcase ReferenceArchiveTest
        Added fixture: Initialize the Reference pillar cache with an empty file in default collection TwoPillarCollection
      Test starting: testReferenceArchive
        Description: Test the ReferenceArchive.
        Step: Setup
        Step: test 'hasFile'
        Step: Test 'getFile'
        Step: Test getAllFileIDs
        Step: Test 'getFileAsInputstream'
        Step: Delete, recreate and delete again
        Step: Try to delete missing file.
        Step: Replace a file, which does not exist in the filedir.
        Step: Copy a file into the tmpDir and then use replace.
        Step: Try performing the replace, when the file in the tempdir has been removed.
      Test success: testReferenceArchive
    Starting testcase MediatorTest
      Test starting: testMediatorRuntimeExceptionHandling
        Description: Tests the handling of a runtime exception
        Step: Setup create and start the mediator.
        Step: Send a request to the mediator.
10:19:48.609 WARN  o.b.pillar.MediatorTest$TestMediator - Unexpected exception caught.
java.lang.RuntimeException: I am supposed to throw a RuntimeException
	at org.bitrepository.pillar.MediatorTest$ErroneousRequestHandler.processRequest(MediatorTest.java:122)
	at org.bitrepository.pillar.MediatorTest$ErroneousRequestHandler.processRequest(MediatorTest.java:113)
	at org.bitrepository.pillar.messagehandler.PillarMediator.handleRequest(PillarMediator.java:80)
	at org.bitrepository.service.contributor.AbstractContributorMediator$GeneralRequestHandler.onMessage(AbstractContributorMediator.java:101)
	at org.bitrepository.protocol.messagebus.SimpleMessageBus.lambda$sendMessage$0(SimpleMessageBus.java:73)
	at java.lang.Iterable.forEach(Iterable.java:75)
	at org.bitrepository.protocol.messagebus.SimpleMessageBus.sendMessage(SimpleMessageBus.java:73)
	at org.bitrepository.pillar.MediatorTest.testMediatorRuntimeExceptionHandling(MediatorTest.java:84)
	at sun.reflect.NativeMethodAccessorImpl.invoke0(Native Method)
	at sun.reflect.NativeMethodAccessorImpl.invoke(NativeMethodAccessorImpl.java:62)
	at sun.reflect.DelegatingMethodAccessorImpl.invoke(DelegatingMethodAccessorImpl.java:43)
	at java.lang.reflect.Method.invoke(Method.java:498)
	at org.testng.internal.MethodInvocationHelper.invokeMethod(MethodInvocationHelper.java:134)
	at org.testng.internal.TestInvoker.invokeMethod(TestInvoker.java:597)
	at org.testng.internal.TestInvoker.invokeTestMethod(TestInvoker.java:173)
	at org.testng.internal.MethodRunner.runInSequence(MethodRunner.java:46)
	at org.testng.internal.TestInvoker$MethodInvocationAgent.invoke(TestInvoker.java:816)
	at org.testng.internal.TestInvoker.invokeTestMethods(TestInvoker.java:146)
	at org.testng.internal.TestMethodWorker.invokeTestMethods(TestMethodWorker.java:146)
	at org.testng.internal.TestMethodWorker.run(TestMethodWorker.java:128)
	at java.util.ArrayList.forEach(ArrayList.java:1249)
	at org.testng.TestRunner.privateRun(TestRunner.java:766)
	at org.testng.TestRunner.run(TestRunner.java:587)
	at org.testng.SuiteRunner.runTest(SuiteRunner.java:384)
	at org.testng.SuiteRunner.runSequentially(SuiteRunner.java:378)
	at org.testng.SuiteRunner.privateRun(SuiteRunner.java:337)
	at org.testng.SuiteRunner.run(SuiteRunner.java:286)
	at org.testng.SuiteRunnerWorker.runSuite(SuiteRunnerWorker.java:53)
	at org.testng.SuiteRunnerWorker.run(SuiteRunnerWorker.java:96)
	at org.testng.TestNG.runSuitesSequentially(TestNG.java:1187)
	at org.testng.TestNG.runSuitesLocally(TestNG.java:1109)
	at org.testng.TestNG.runSuites(TestNG.java:1039)
	at org.testng.TestNG.run(TestNG.java:1007)
	at org.apache.maven.surefire.testng.TestNGExecutor.run(TestNGExecutor.java:135)
	at org.apache.maven.surefire.testng.TestNGDirectoryTestSuite.executeMulti(TestNGDirectoryTestSuite.java:193)
	at org.apache.maven.surefire.testng.TestNGDirectoryTestSuite.execute(TestNGDirectoryTestSuite.java:94)
	at org.apache.maven.surefire.testng.TestNGProvider.invoke(TestNGProvider.java:146)
	at org.apache.maven.surefire.booter.ForkedBooter.runSuitesInProcess(ForkedBooter.java:377)
	at org.apache.maven.surefire.booter.ForkedBooter.execute(ForkedBooter.java:138)
	at org.apache.maven.surefire.booter.ForkedBooter.run(ForkedBooter.java:465)
	at org.apache.maven.surefire.booter.ForkedBooter.main(ForkedBooter.java:451)
          Result: Received message on TEST-TOPIC-testMediatorRuntimeExceptionHandling-cibuild01 : org.bitrepository.bitrepositorymessages.IdentifyContributorsForGetStatusResponse@2759181a[correlationID=525a5c03-bc30-48cc-a187-0230bbc363d5, collectionID=TwoPillarCollection, destination=TEST-TOPIC-testMediatorRuntimeExceptionHandling-cibuild01, replyTo=TEST-TOPIC-MediatorUnderTest-cibuild01-contributor, from=MediatorUnderTest, to=MediatorUnderTest, version=31, minVersion=24, responseInfo=org.bitrepository.bitrepositoryelements.ResponseInfo@2735e052[responseCode=FAILURE, responseText=java.lang.RuntimeException: I am supposed to throw a RuntimeException], contributor=TEST-TOPIC-cibuild01, timeToDeliver=<null>(default)]
10:19:48.613 WARN  o.b.p.common.PillarAlarmDispatcher - Sending alarm: org.bitrepository.bitrepositoryelements.Alarm@5ca5dea1[origDateTime=2020-09-04T10:19:48.613+02:00, alarmCode=COMPONENT_FAILURE, alarmRaiser=MediatorUnderTest, alarmText=java.lang.RuntimeException: I am supposed to throw a RuntimeException, fileID=<null>(default), collectionID=<null>(default)]
          Result: Received message on TEST-ALARM-TOPIC-cibuild01 : org.bitrepository.bitrepositorymessages.AlarmMessage@33d394e7[correlationID=e3604e19-0cd2-4612-8588-741d8531902d, collectionID=<null>(default), destination=TEST-ALARM-TOPIC-cibuild01, replyTo=TEST-TOPIC-MediatorUnderTest-cibuild01-contributor, from=MediatorUnderTest, to=<null>(default), version=31, minVersion=24, alarm=org.bitrepository.bitrepositoryelements.Alarm@5ca5dea1[origDateTime=2020-09-04T10:19:48.613+02:00, alarmCode=COMPONENT_FAILURE, alarmRaiser=MediatorUnderTest, alarmText=java.lang.RuntimeException: I am supposed to throw a RuntimeException, fileID=<null>(default), collectionID=<null>(default)]]
      Test success: testMediatorRuntimeExceptionHandling
    Starting testcase RecalculateChecksumWorkflowTest
        Added fixture: Initialize the Reference pillar cache with an empty file in default collection TwoPillarCollection
      Test starting: testWorkflowDoesNotRecalculateWhenNotNeeded
        Description: Test that the workflow does not recalculates the workflows, when the maximum age has not yet been met.
        Step: Create and run workflow
      Test success: testWorkflowDoesNotRecalculateWhenNotNeeded
        Added fixture: Initialize the Reference pillar cache with an empty file in default collection TwoPillarCollection
      Test starting: testWorkflowRecalculatesChecksum
        Description: Test that the workflow recalculates the workflows, when the maximum age has been met.
        Step: Create and run workflow
      Test success: testWorkflowRecalculatesChecksum
      Finished testcase
  Finished suite
Finished project
[INFO] Tests run: 72, Failures: 0, Errors: 0, Skipped: 0, Time elapsed: 49.392 s - in TestSuite
[INFO] 
[INFO] Results:
[INFO] 
[INFO] Tests run: 72, Failures: 0, Errors: 0, Skipped: 0
[INFO] 
[JENKINS] Recording test results
[INFO] 
[INFO] --- jacoco-maven-plugin:0.8.5:report (report) @ bitrepository-reference-pillar ---
[INFO] Loading execution data file /home/cibuild01/workspace/Bitrepository-reference-test/bitrepository-reference-pillar/target/jacoco.exec
[INFO] Analyzed bundle 'Bitrepository Reference Pillar' with 41 classes
[INFO] 
[INFO] --- maven-jar-plugin:3.2.0:jar (default-jar) @ bitrepository-reference-pillar ---
[INFO] Building jar: /home/cibuild01/workspace/Bitrepository-reference-test/bitrepository-reference-pillar/target/bitrepository-reference-pillar-1.10-SNAPSHOT.jar
[INFO] 
[INFO] --- maven-jar-plugin:3.2.0:test-jar (default) @ bitrepository-reference-pillar ---
[INFO] Building jar: /home/cibuild01/workspace/Bitrepository-reference-test/bitrepository-reference-pillar/target/bitrepository-reference-pillar-1.10-SNAPSHOT-tests.jar
[INFO] 
[INFO] --- maven-source-plugin:3.2.1:jar-no-fork (attach-sources-no-fork) @ bitrepository-reference-pillar ---
[INFO] Building jar: /home/cibuild01/workspace/Bitrepository-reference-test/bitrepository-reference-pillar/target/bitrepository-reference-pillar-1.10-SNAPSHOT-sources.jar
[INFO] 
[INFO] --- maven-assembly-plugin:3.3.0:single (distribution) @ bitrepository-reference-pillar ---
[INFO] Reading assembly descriptor: src/main/assembly/assembly.xml
[INFO] Reading assembly descriptor: src/test/assembly/assembly.xml
[INFO] Reading assembly descriptor: src/main/assembly/deploy-assembly.xml
[INFO] Reading assembly descriptor: src/test/assembly/test-deploy-assembly.xml
[INFO] Building tar: /home/cibuild01/workspace/Bitrepository-reference-test/bitrepository-reference-pillar/target/bitrepository-reference-pillar-1.10-SNAPSHOT-distribution.tar.gz
[INFO] Building tar: /home/cibuild01/workspace/Bitrepository-reference-test/bitrepository-reference-pillar/target/bitrepository-reference-pillar-1.10-SNAPSHOT-acceptance-test.tar.gz
[WARNING] Entry: bitrepository-reference-pillar-1.10-SNAPSHOT/lib/bitrepository-reference-pillar-1.10-SNAPSHOT-tests.jar longer than 100 characters.
[WARNING] Resulting tar file can only be processed successfully by GNU compatible tar commands
[WARNING] Entry: bitrepository-reference-pillar-1.10-SNAPSHOT/lib/listenablefuture-9999.0-empty-to-avoid-conflict-with-guava.jar longer than 100 characters.
[INFO] Building tar: /home/cibuild01/workspace/Bitrepository-reference-test/bitrepository-reference-pillar/target/bitrepository-reference-pillar-1.10-SNAPSHOT-deploy.tar.gz
[INFO] Building tar: /home/cibuild01/workspace/Bitrepository-reference-test/bitrepository-reference-pillar/target/bitrepository-reference-pillar-1.10-SNAPSHOT-acceptance-test-deploy.tar.gz
[INFO] 
[INFO] --- maven-install-plugin:3.0.0-M1:install (default-install) @ bitrepository-reference-pillar ---
[INFO] Installing /home/cibuild01/workspace/Bitrepository-reference-test/bitrepository-reference-pillar/target/bitrepository-reference-pillar-1.10-SNAPSHOT.jar to /home/cibuild01/.m2/repository/org/bitrepository/reference/bitrepository-reference-pillar/1.10-SNAPSHOT/bitrepository-reference-pillar-1.10-SNAPSHOT.jar
[INFO] Installing /home/cibuild01/workspace/Bitrepository-reference-test/bitrepository-reference-pillar/pom.xml to /home/cibuild01/.m2/repository/org/bitrepository/reference/bitrepository-reference-pillar/1.10-SNAPSHOT/bitrepository-reference-pillar-1.10-SNAPSHOT.pom
[INFO] Installing /home/cibuild01/workspace/Bitrepository-reference-test/bitrepository-reference-pillar/target/bitrepository-reference-pillar-1.10-SNAPSHOT-tests.jar to /home/cibuild01/.m2/repository/org/bitrepository/reference/bitrepository-reference-pillar/1.10-SNAPSHOT/bitrepository-reference-pillar-1.10-SNAPSHOT-tests.jar
[INFO] Installing /home/cibuild01/workspace/Bitrepository-reference-test/bitrepository-reference-pillar/target/bitrepository-reference-pillar-1.10-SNAPSHOT-sources.jar to /home/cibuild01/.m2/repository/org/bitrepository/reference/bitrepository-reference-pillar/1.10-SNAPSHOT/bitrepository-reference-pillar-1.10-SNAPSHOT-sources.jar
[INFO] Installing /home/cibuild01/workspace/Bitrepository-reference-test/bitrepository-reference-pillar/target/bitrepository-reference-pillar-1.10-SNAPSHOT-distribution.tar.gz to /home/cibuild01/.m2/repository/org/bitrepository/reference/bitrepository-reference-pillar/1.10-SNAPSHOT/bitrepository-reference-pillar-1.10-SNAPSHOT-distribution.tar.gz
[INFO] Installing /home/cibuild01/workspace/Bitrepository-reference-test/bitrepository-reference-pillar/target/bitrepository-reference-pillar-1.10-SNAPSHOT-acceptance-test.tar.gz to /home/cibuild01/.m2/repository/org/bitrepository/reference/bitrepository-reference-pillar/1.10-SNAPSHOT/bitrepository-reference-pillar-1.10-SNAPSHOT-acceptance-test.tar.gz
[INFO] Installing /home/cibuild01/workspace/Bitrepository-reference-test/bitrepository-reference-pillar/target/bitrepository-reference-pillar-1.10-SNAPSHOT-deploy.tar.gz to /home/cibuild01/.m2/repository/org/bitrepository/reference/bitrepository-reference-pillar/1.10-SNAPSHOT/bitrepository-reference-pillar-1.10-SNAPSHOT-deploy.tar.gz
[INFO] Installing /home/cibuild01/workspace/Bitrepository-reference-test/bitrepository-reference-pillar/target/bitrepository-reference-pillar-1.10-SNAPSHOT-acceptance-test-deploy.tar.gz to /home/cibuild01/.m2/repository/org/bitrepository/reference/bitrepository-reference-pillar/1.10-SNAPSHOT/bitrepository-reference-pillar-1.10-SNAPSHOT-acceptance-test-deploy.tar.gz
[INFO] 
[INFO] --- maven-deploy-plugin:3.0.0-M1:deploy (default-deploy) @ bitrepository-reference-pillar ---
[INFO] Downloading: https://sbforge.org/nexus/content/repositories/snapshots/org/bitrepository/reference/bitrepository-reference-pillar/1.10-SNAPSHOT/maven-metadata.xml
[INFO] Downloaded: https://sbforge.org/nexus/content/repositories/snapshots/org/bitrepository/reference/bitrepository-reference-pillar/1.10-SNAPSHOT/maven-metadata.xml (3 KB at 67.0 KB/sec)
[INFO] Uploading: https://sbforge.org/nexus/content/repositories/snapshots/org/bitrepository/reference/bitrepository-reference-pillar/1.10-SNAPSHOT/bitrepository-reference-pillar-1.10-20200904.081956-53.jar
[INFO] Uploaded: https://sbforge.org/nexus/content/repositories/snapshots/org/bitrepository/reference/bitrepository-reference-pillar/1.10-SNAPSHOT/bitrepository-reference-pillar-1.10-20200904.081956-53.jar (128 KB at 1248.1 KB/sec)
[INFO] Uploading: https://sbforge.org/nexus/content/repositories/snapshots/org/bitrepository/reference/bitrepository-reference-pillar/1.10-SNAPSHOT/bitrepository-reference-pillar-1.10-20200904.081956-53.pom
[INFO] Uploaded: https://sbforge.org/nexus/content/repositories/snapshots/org/bitrepository/reference/bitrepository-reference-pillar/1.10-SNAPSHOT/bitrepository-reference-pillar-1.10-20200904.081956-53.pom (6 KB at 292.1 KB/sec)
[INFO] Uploading: https://sbforge.org/nexus/content/repositories/snapshots/org/bitrepository/reference/bitrepository-reference-pillar/1.10-SNAPSHOT/bitrepository-reference-pillar-1.10-20200904.081956-53-tests.jar
[INFO] Uploaded: https://sbforge.org/nexus/content/repositories/snapshots/org/bitrepository/reference/bitrepository-reference-pillar/1.10-SNAPSHOT/bitrepository-reference-pillar-1.10-20200904.081956-53-tests.jar (250 KB at 13124.2 KB/sec)
[INFO] Uploading: https://sbforge.org/nexus/content/repositories/snapshots/org/bitrepository/reference/bitrepository-reference-pillar/1.10-SNAPSHOT/bitrepository-reference-pillar-1.10-20200904.081956-53-sources.jar
[INFO] Uploaded: https://sbforge.org/nexus/content/repositories/snapshots/org/bitrepository/reference/bitrepository-reference-pillar/1.10-SNAPSHOT/bitrepository-reference-pillar-1.10-20200904.081956-53-sources.jar (106 KB at 5878.5 KB/sec)
[INFO] Uploading: https://sbforge.org/nexus/content/repositories/snapshots/org/bitrepository/reference/bitrepository-reference-pillar/1.10-SNAPSHOT/bitrepository-reference-pillar-1.10-20200904.081956-53-distribution.tar.gz
[INFO] Uploaded: https://sbforge.org/nexus/content/repositories/snapshots/org/bitrepository/reference/bitrepository-reference-pillar/1.10-SNAPSHOT/bitrepository-reference-pillar-1.10-20200904.081956-53-distribution.tar.gz (14768 KB at 34263.3 KB/sec)
[INFO] Uploading: https://sbforge.org/nexus/content/repositories/snapshots/org/bitrepository/reference/bitrepository-reference-pillar/1.10-SNAPSHOT/bitrepository-reference-pillar-1.10-20200904.081956-53-acceptance-test.tar.gz
[INFO] Uploaded: https://sbforge.org/nexus/content/repositories/snapshots/org/bitrepository/reference/bitrepository-reference-pillar/1.10-SNAPSHOT/bitrepository-reference-pillar-1.10-20200904.081956-53-acceptance-test.tar.gz (21344 KB at 38457.4 KB/sec)
[INFO] Uploading: https://sbforge.org/nexus/content/repositories/snapshots/org/bitrepository/reference/bitrepository-reference-pillar/1.10-SNAPSHOT/bitrepository-reference-pillar-1.10-20200904.081956-53-deploy.tar.gz
[INFO] Uploaded: https://sbforge.org/nexus/content/repositories/snapshots/org/bitrepository/reference/bitrepository-reference-pillar/1.10-SNAPSHOT/bitrepository-reference-pillar-1.10-20200904.081956-53-deploy.tar.gz (4 KB at 185.1 KB/sec)
[INFO] Uploading: https://sbforge.org/nexus/content/repositories/snapshots/org/bitrepository/reference/bitrepository-reference-pillar/1.10-SNAPSHOT/bitrepository-reference-pillar-1.10-20200904.081956-53-acceptance-test-deploy.tar.gz
[INFO] Uploaded: https://sbforge.org/nexus/content/repositories/snapshots/org/bitrepository/reference/bitrepository-reference-pillar/1.10-SNAPSHOT/bitrepository-reference-pillar-1.10-20200904.081956-53-acceptance-test-deploy.tar.gz (4 KB at 176.8 KB/sec)
[INFO] Downloading: https://sbforge.org/nexus/content/repositories/snapshots/org/bitrepository/reference/bitrepository-reference-pillar/maven-metadata.xml
[INFO] Downloaded: https://sbforge.org/nexus/content/repositories/snapshots/org/bitrepository/reference/bitrepository-reference-pillar/maven-metadata.xml (494 B at 53.6 KB/sec)
[INFO] Uploading: https://sbforge.org/nexus/content/repositories/snapshots/org/bitrepository/reference/bitrepository-reference-pillar/1.10-SNAPSHOT/maven-metadata.xml
[INFO] Uploaded: https://sbforge.org/nexus/content/repositories/snapshots/org/bitrepository/reference/bitrepository-reference-pillar/1.10-SNAPSHOT/maven-metadata.xml (3 KB at 159.9 KB/sec)
[INFO] Uploading: https://sbforge.org/nexus/content/repositories/snapshots/org/bitrepository/reference/bitrepository-reference-pillar/maven-metadata.xml
[INFO] Uploaded: https://sbforge.org/nexus/content/repositories/snapshots/org/bitrepository/reference/bitrepository-reference-pillar/maven-metadata.xml (494 B at 40.2 KB/sec)
[JENKINS] Archiving disabled