SuccessConsole Output

[INFO]                                                                         
[INFO] ------------------------------------------------------------------------
[INFO] Building Bitrepository Reference Pillar 1.10-SNAPSHOT
[INFO] ------------------------------------------------------------------------
[INFO] 
[INFO] --- maven-clean-plugin:3.1.0:clean (default-clean) @ bitrepository-reference-pillar ---
[INFO] 
[INFO] --- maven-enforcer-plugin:3.0.0-M3:enforce (enforce-maven) @ bitrepository-reference-pillar ---
[INFO] 
[INFO] --- jacoco-maven-plugin:0.8.5:prepare-agent (default) @ bitrepository-reference-pillar ---
[INFO] argLine set to -javaagent:/home/cibuild01/.m2/repository/org/jacoco/org.jacoco.agent/0.8.5/org.jacoco.agent-0.8.5-runtime.jar=destfile=/home/cibuild01/workspace/Bitrepository-reference-test/bitrepository-reference-pillar/target/jacoco.exec
[INFO] 
[INFO] --- maven-dependency-plugin:3.1.2:unpack-dependencies (unpack-shared-sqlscripts) @ bitrepository-reference-pillar ---
[INFO] Unpacking /home/cibuild01/workspace/Bitrepository-reference-test/bitrepository-service/target/bitrepository-service-1.10-SNAPSHOT.jar to /home/cibuild01/workspace/Bitrepository-reference-test/bitrepository-reference-pillar/target/classes with includes "**/*.sql" and excludes ""
[INFO] 
[INFO] --- maven-resources-plugin:3.1.0:resources (default-resources) @ bitrepository-reference-pillar ---
[INFO] Using 'UTF-8' encoding to copy filtered resources.
[INFO] Copying 13 resources
[INFO] 
[INFO] --- maven-compiler-plugin:3.8.1:compile (default-compile) @ bitrepository-reference-pillar ---
[INFO] Changes detected - recompiling the module!
[INFO] Compiling 44 source files to /home/cibuild01/workspace/Bitrepository-reference-test/bitrepository-reference-pillar/target/classes
[WARNING] /home/cibuild01/workspace/Bitrepository-reference-test/bitrepository-reference-pillar/src/main/java/org/bitrepository/pillar/store/checksumdatabase/ChecksumExtractor.java:[236,25] explicit call to close() on an auto-closeable resource
[WARNING] /home/cibuild01/workspace/Bitrepository-reference-test/bitrepository-reference-pillar/src/main/java/org/bitrepository/pillar/store/checksumdatabase/ChecksumExtractor.java:[304,25] explicit call to close() on an auto-closeable resource
[WARNING] /home/cibuild01/workspace/Bitrepository-reference-test/bitrepository-reference-pillar/src/main/java/org/bitrepository/pillar/store/checksumdatabase/ChecksumExtractor.java:[347,25] explicit call to close() on an auto-closeable resource
[INFO] 
[INFO] --- forbiddenapis:2.7:check (default) @ bitrepository-reference-pillar ---
[INFO] Scanning for classes to check...
[INFO] Reading bundled API signatures: jdk-unsafe-1.8
[INFO] Reading bundled API signatures: jdk-deprecated-1.8
[INFO] Reading bundled API signatures: jdk-non-portable
[INFO] Reading bundled API signatures: jdk-reflection
[INFO] Loading classes to check...
[INFO] Scanning classes for violations...
[INFO] Scanned 44 class file(s) for forbidden API invocations (in 0.15s), 0 error(s).
[INFO] 
[INFO] --- forbiddenapis:2.7:testCheck (default) @ bitrepository-reference-pillar ---
[INFO] Scanning for classes to check...
[WARNING] Classes directory does not exist, forbiddenapis check skipped: /home/cibuild01/workspace/Bitrepository-reference-test/bitrepository-reference-pillar/target/test-classes
[INFO] 
[INFO] --- maven-resources-plugin:3.1.0:testResources (default-testResources) @ bitrepository-reference-pillar ---
[INFO] Using 'UTF-8' encoding to copy filtered resources.
[INFO] Copying 13 resources
[INFO] 
[INFO] --- maven-compiler-plugin:3.8.1:testCompile (default-testCompile) @ bitrepository-reference-pillar ---
[INFO] Changes detected - recompiling the module!
[INFO] Compiling 73 source files to /home/cibuild01/workspace/Bitrepository-reference-test/bitrepository-reference-pillar/target/test-classes
[INFO] 
[INFO] --- maven-surefire-plugin:3.0.0-M4:test (default-test) @ bitrepository-reference-pillar ---
[INFO] 
[INFO] -------------------------------------------------------
[INFO]  T E S T S
[INFO] -------------------------------------------------------
[INFO] Running TestSuite
Starting test project Reference Pillar Test
  Suite: Surefire suite
    Starting testcase ArchiveDirectoryTest
      Test starting: testArchiveDirectoryExistingFile
        Description: Test the ArchiveDirectory when the file exists
        Step: Setup
        Step: Validate the existence of the file
        Step: Delete the file.
      Test success: testArchiveDirectoryExistingFile
      Test starting: testArchiveDirectoryExistingFolderFile
        Description: Test the ArchiveDirectory when the file exists
        Step: Setup
        Step: Validate the existence of the file
        Step: Delete the file.
      Test success: testArchiveDirectoryExistingFolderFile
      Test starting: testArchiveDirectoryMissingFile
        Description: Test the ArchiveDirectory when the file is missing.
        Step: Setup
        Step: Validate the existence of the file
        Step: Delete the file.
      Test success: testArchiveDirectoryMissingFile
      Test starting: testArchiveDirectoryMissingFolderFile
        Description: Test the ArchiveDirectory when the file is missing.
        Step: Setup
        Step: Validate the existence of the file
        Step: Delete the file.
      Test success: testArchiveDirectoryMissingFolderFile
      Test starting: testArchiveDirectoryMoveFileToArchive
        Description: Testing the error scenarios when moving a file from tmp to archive for the ArchiveDirectory.
        Step: Setup
        Step: Moving file from tmp to archive
        Step: Create file in both tmp and archive.
        Step: Moving file from tmp to archive
        Step: Remove the file from archive and try again
      Test success: testArchiveDirectoryMoveFileToArchive
      Test starting: testArchiveDirectoryMoveFolderFileToArchive
        Description: Testing the error scenarios when moving a file from tmp to archive for the ArchiveDirectory.
        Step: Setup
        Step: Moving file from tmp to archive
        Step: Create file in both tmp and archive.
        Step: Moving file from tmp to archive
        Step: Remove the file from archive and try again
      Test success: testArchiveDirectoryMoveFolderFileToArchive
      Test starting: testArchiveDirectoryNewFile
        Description: Testing the ArchiveDirectory handling of a new file.
        Step: Setup
        Step: Retrieve tmp file
        Step: Request a new file for the tmp dir
        Step: Retrieve tmp file
        Step: Request another new file with the same name
        Step: Move the file from tmp to archive
      Test success: testArchiveDirectoryNewFile
      Test starting: testArchiveDirectoryNewFolderFile
        Description: Testing the ArchiveDirectory handling of a new file.
        Step: Setup
        Step: Retrieve tmp file
        Step: Request a new file for the tmp dir
        Step: Retrieve tmp file
        Step: Request another new file with the same name
        Step: Move the file from tmp to archive
      Test success: testArchiveDirectoryNewFolderFile
      Test starting: testArchiveDirectoryRemoveFile
        Description: Testing the error scenarios when removing files from the archive.
        Step: Setup
        Step: Remove nonexisting file from archive
        Step: Remove nonexisting file from tmp
        Step: Create file in both tmp, archive and retain directories.
        Step: Remove the file from archive and tmp
      Test success: testArchiveDirectoryRemoveFile
      Test starting: testArchiveDirectoryRemoveFolderFile
        Description: Testing the error scenarios when removing files from the archive.
        Step: Setup
        Step: Remove nonexisting file from archive
        Step: Remove nonexisting file from tmp
        Step: Create file in both tmp, archive and retain directories.
        Step: Remove the file from archive and tmp
      Test success: testArchiveDirectoryRemoveFolderFile
    Starting testcase ChecksumPillarModelTest
      Test starting: testPillarModelBasicFunctionality
        Description: Test the basic functions of the full reference pillar model.
        Step: Check the pillar id in the pillar model
        Step: Ask whether it can handle a file of size 0
        Step: Ask whether it can handle a file of maximum size
        Step: Check the ChecksumPillarSpec
        Step: Checkum whether the checksum pillar should download
      Test success: testPillarModelBasicFunctionality
      Test starting: testPillarModelHasFile
        Description: Test that the file exists, when placed in the archive and cache
        Step: Setup
        Step: Check whether file exists and retrieve it.
        Step: Check whether file exists.
        Step: Ask for the checksum data for the file with different checksum specs
        Step: Ask for the checksum entry for the file with different checksum specs
        Step: Ask for the checksum for the file with different checksum specs
        Step: Check extraction of checksum result set
        Step: Check retrieval of non-default checksum
        Step: Check retrieval of non-default checksum result set
        Step: Test retrieval of single checksum result set
      Test success: testPillarModelHasFile
      Test starting: testPillarModelNoFile
        Description: Test that the file exists, when placed in the archive and cache
        Step: Setup
        Step: Check whether file exists and try to retrieve it.
        Step: Verify that anexceptions are thrown when verifying file existance.
      Test success: testPillarModelNoFile
    Starting testcase DeleteFileTest
        Added fixture: Initialize a new Pillar.
      Test starting: badCaseIdentification
        Description: Tests the identification for a DeleteFile operation on the checksum pillar for the failure scenario, when the file is missing.
        Step: Set up constants and variables.
        Step: Setup for delivering pillar id and not having the file 
        Step: Create and send the identify request message.
          Result: Received message on TEST-TOPIC-badCaseIdentification-cibuild01 : org.bitrepository.bitrepositorymessages.IdentifyPillarsForDeleteFileResponse@7220ff10[correlationID=362f1a16-09cf-44e9-aa67-0ac64160b8ca, collectionID=TwoPillarCollection, destination=TEST-TOPIC-badCaseIdentification-cibuild01, replyTo=TEST-TOPIC-Pillar-badCaseIdentification-cibuild01-contributor, from=Pillar-badCaseIdentification, to=badCaseIdentification, version=30, minVersion=24, responseInfo=org.bitrepository.bitrepositoryelements.ResponseInfo@776eb512[responseCode=FILE_NOT_FOUND_FAILURE, responseText=File not found.], fileID=DefaultFilebadCaseIdentification, pillarID=Pillar-badCaseIdentification, pillarChecksumSpec=<null>(default), timeToDeliver=<null>(default)]
        Step: Retrieve and validate the response getPillarID() the pillar.
      Test success: badCaseIdentification
        Added fixture: Initialize a new Pillar.
      Test starting: badCaseOperationMissingVerification
        Description: Tests the DeleteFile functionality of the pillar for the failure scenario, where it does not have the file.
        Step: Set up constants and variables.
        Step: Setup for delivering pillar id and having the file 
        Step: Create and send the actual DeleteFile message to the pillar.
          Result: Received message on TEST-TOPIC-badCaseOperationMissingVerification-cibuild01 : org.bitrepository.bitrepositorymessages.DeleteFileFinalResponse@726e780a[correlationID=a97b4a04-6383-4427-b780-0b92504b097a, collectionID=TwoPillarCollection, destination=TEST-TOPIC-badCaseOperationMissingVerification-cibuild01, replyTo=TEST-TOPIC-Pillar-badCaseOperationMissingVerification-cibuild01-contributor, from=Pillar-badCaseOperationMissingVerification, to=badCaseOperationMissingVerification, version=30, minVersion=24, responseInfo=org.bitrepository.bitrepositoryelements.ResponseInfo@4698ae6[responseCode=EXISTING_FILE_CHECKSUM_FAILURE, responseText=No mandatory checksum for destructive operation was supplied.], pillarID=Pillar-badCaseOperationMissingVerification, fileID=DefaultFilebadCaseOperationMissingVerification, checksumDataForExistingFile=<null>(default)]
09:53:14.035 WARN  o.b.p.common.PillarAlarmDispatcher - Sending alarm: org.bitrepository.bitrepositoryelements.Alarm@2d839402[origDateTime=2020-09-04T09:53:14.034+02:00, alarmCode=CHECKSUM_ALARM, alarmRaiser=Pillar-badCaseOperationMissingVerification, alarmText=No mandatory checksum for destructive operation was supplied., fileID=DefaultFilebadCaseOperationMissingVerification, collectionID=TwoPillarCollection]
          Result: Received message on TEST-ALARM-TOPIC-cibuild01 : org.bitrepository.bitrepositorymessages.AlarmMessage@2c2c1790[correlationID=f1ab2740-e548-4590-8e9c-fdddee0705b9, collectionID=TwoPillarCollection, destination=TEST-ALARM-TOPIC-cibuild01, replyTo=TEST-TOPIC-Pillar-badCaseOperationMissingVerification-cibuild01-contributor, from=Pillar-badCaseOperationMissingVerification, to=<null>(default), version=30, minVersion=24, alarm=org.bitrepository.bitrepositoryelements.Alarm@2d839402[origDateTime=2020-09-04T09:53:14.034+02:00, alarmCode=CHECKSUM_ALARM, alarmRaiser=Pillar-badCaseOperationMissingVerification, alarmText=No mandatory checksum for destructive operation was supplied., fileID=DefaultFilebadCaseOperationMissingVerification, collectionID=TwoPillarCollection]]
        Step: Retrieve the FinalResponse for the DeleteFile request
        Step: Pillar should have sent an alarm
      Test success: badCaseOperationMissingVerification
        Added fixture: Initialize a new Pillar.
      Test starting: badCaseOperationNoFile
        Description: Tests the DeleteFile functionality of the pillar for the failure scenario, where it does not have the file.
        Step: Set up constants and variables.
        Step: Setup for delivering pillar id and not having the file 
        Step: Create and send the actual DeleteFile message to the pillar.
          Result: Received message on TEST-TOPIC-badCaseOperationNoFile-cibuild01 : org.bitrepository.bitrepositorymessages.DeleteFileFinalResponse@beac39c[correlationID=c0b40977-0e54-4856-bd68-115844e3b065, collectionID=TwoPillarCollection, destination=TEST-TOPIC-badCaseOperationNoFile-cibuild01, replyTo=TEST-TOPIC-Pillar-badCaseOperationNoFile-cibuild01-contributor, from=Pillar-badCaseOperationNoFile, to=badCaseOperationNoFile, version=30, minVersion=24, responseInfo=org.bitrepository.bitrepositoryelements.ResponseInfo@41843b88[responseCode=FILE_NOT_FOUND_FAILURE, responseText=File not found.], pillarID=Pillar-badCaseOperationNoFile, fileID=DefaultFilebadCaseOperationNoFile, checksumDataForExistingFile=<null>(default)]
        Step: Retrieve the FinalResponse for the DeleteFile request
      Test success: badCaseOperationNoFile
        Added fixture: Initialize a new Pillar.
      Test starting: goodCaseIdentification
        Description: Tests the identification for a DeleteFile operation on the pillar for the successful scenario.
        Step: Set up constants and variables.
        Step: Setup for having the file and delivering pillar id
        Step: Create and send the identify request message.
          Result: Received message on TEST-TOPIC-goodCaseIdentification-cibuild01 : org.bitrepository.bitrepositorymessages.IdentifyPillarsForDeleteFileResponse@3f46fb53[correlationID=42a62450-11ce-4c2b-9913-dc7a5c9ed5af, collectionID=TwoPillarCollection, destination=TEST-TOPIC-goodCaseIdentification-cibuild01, replyTo=TEST-TOPIC-Pillar-goodCaseIdentification-cibuild01-contributor, from=Pillar-goodCaseIdentification, to=goodCaseIdentification, version=30, minVersion=24, responseInfo=org.bitrepository.bitrepositoryelements.ResponseInfo@42ae0fcf[responseCode=IDENTIFICATION_POSITIVE, responseText=Operation acknowledged and accepted.], fileID=DefaultFilegoodCaseIdentification, pillarID=Pillar-goodCaseIdentification, pillarChecksumSpec=<null>(default), timeToDeliver=org.bitrepository.bitrepositoryelements.TimeMeasureTYPE@5e16e521[timeMeasureUnit=MILLISECONDS, timeMeasureValue=1000]]
        Step: Retrieve and validate the response getPillarID() the pillar.
      Test success: goodCaseIdentification
    Starting testcase FullPillarModelTest
      Test starting: testPillarModelBasicFunctionality
        Description: Test the basic functions of the full reference pillar model.
        Step: Check the pillar id in the pillar model
        Step: Ask whether it can handle a file of size 0
        Step: Ask whether it can handle a file of maximum size
        Step: Check the ChecksumPillarSpec
      Test success: testPillarModelBasicFunctionality
      Test starting: testPillarModelHasFile
        Description: Test that the file exists, when placed in the archive and cache
        Step: Setup
        Step: Check whether file exists and retrieve it.
        Step: Verify that no exceptions are thrown when verifying file existance.
        Step: Check retrieval of non-default checksum
      Test success: testPillarModelHasFile
      Test starting: testPillarModelNoFile
        Description: Test that the file exists, when placed in the archive and cache
        Step: Setup
        Step: Check whether file exists and try to retrieve it.
        Step: Verify that anexceptions are thrown when verifying file existance.
09:53:17.679 WARN  o.b.pillar.store.FileStorageModel - The file 'DefaultFile' has been requested, but we do not have that file in collection 'TwoPillarCollection'!
      Test success: testPillarModelNoFile
    Starting testcase GetFileIDsTest
        Added fixture: Initialize a new Pillar.
      Test starting: badCaseIdentification
        Description: Tests the identification for a GetFileIDs operation on the pillar for the failure scenario, when the file is missing.
        Step: Set up constants and variables.
        Step: Setup for delivering pillar id and not having the file 
        Step: Create and send the identify request message.
09:53:17.932 WARN  o.b.p.m.IdentifyPillarsForGetFileIDsRequestHandler - The following file is missing 'DefaultFilebadCaseIdentification' at collection 'TwoPillarCollection'.
          Result: Received message on TEST-TOPIC-badCaseIdentification-cibuild01 : org.bitrepository.bitrepositorymessages.IdentifyPillarsForGetFileIDsResponse@4dc74211[correlationID=8ff65051-515b-44bc-8b6c-ff9db543f064, collectionID=TwoPillarCollection, destination=TEST-TOPIC-badCaseIdentification-cibuild01, replyTo=TEST-TOPIC-Pillar-badCaseIdentification-cibuild01-contributor, from=Pillar-badCaseIdentification, to=badCaseIdentification, version=30, minVersion=24, responseInfo=org.bitrepository.bitrepositoryelements.ResponseInfo@4bbc9862[responseCode=FILE_NOT_FOUND_FAILURE, responseText=File not found.], pillarID=Pillar-badCaseIdentification, fileIDs=org.bitrepository.bitrepositoryelements.FileIDs@751df26c[fileID=DefaultFilebadCaseIdentification, allFileIDs=<null>(default)], timeToDeliver=<null>(default)]
        Step: Retrieve and validate the response getPillarID() the pillar.
      Test success: badCaseIdentification
        Added fixture: Initialize a new Pillar.
      Test starting: badCaseOperationNoFile
        Description: Tests the GetFileIDs functionality of the pillar for the failure scenario, where it does not have the file.
        Step: Set up constants and variables.
        Step: Setup for not having the file
        Step: Create and send the actual GetFileIDs message to the pillar.
09:53:19.184 WARN  o.b.p.m.GetFileIDsRequestHandler - The following file is missing 'DefaultFilebadCaseOperationNoFile' at collection 'TwoPillarCollection'.
          Result: Received message on TEST-TOPIC-badCaseOperationNoFile-cibuild01 : org.bitrepository.bitrepositorymessages.GetFileIDsFinalResponse@2027e9f9[correlationID=e98de0f4-2a82-444a-92ab-0ab72c91de64, collectionID=TwoPillarCollection, destination=TEST-TOPIC-badCaseOperationNoFile-cibuild01, replyTo=TEST-TOPIC-Pillar-badCaseOperationNoFile-cibuild01-contributor, from=Pillar-badCaseOperationNoFile, to=badCaseOperationNoFile, version=30, minVersion=24, responseInfo=org.bitrepository.bitrepositoryelements.ResponseInfo@42eb459d[responseCode=FILE_NOT_FOUND_FAILURE, responseText=File not found.], pillarID=Pillar-badCaseOperationNoFile, fileIDs=org.bitrepository.bitrepositoryelements.FileIDs@661fe6c4[fileID=DefaultFilebadCaseOperationNoFile, allFileIDs=<null>(default)], resultingFileIDs=<null>(default), partialResult=<null>(default)]
09:53:19.189 WARN  o.b.p.m.GetFileIDsRequestHandler - The following file is missing 'DefaultFilebadCaseOperationNoFile' at collection 'TwoPillarCollection'.
          Result: Received message on TEST-TOPIC-badCaseOperationNoFile-cibuild01 : org.bitrepository.bitrepositorymessages.GetFileIDsFinalResponse@66cb7a21[correlationID=e98de0f4-2a82-444a-92ab-0ab72c91de64, collectionID=TwoPillarCollection, destination=TEST-TOPIC-badCaseOperationNoFile-cibuild01, replyTo=TEST-TOPIC-Pillar-badCaseOperationNoFile-cibuild01-contributor, from=Pillar-badCaseOperationNoFile, to=badCaseOperationNoFile, version=30, minVersion=24, responseInfo=org.bitrepository.bitrepositoryelements.ResponseInfo@7e941cc8[responseCode=FILE_NOT_FOUND_FAILURE, responseText=File not found.], pillarID=Pillar-badCaseOperationNoFile, fileIDs=org.bitrepository.bitrepositoryelements.FileIDs@661fe6c4[fileID=DefaultFilebadCaseOperationNoFile, allFileIDs=<null>(default)], resultingFileIDs=<null>(default), partialResult=<null>(default)]
        Step: Retrieve the FinalResponse for the GetFileIDs request
      Test success: badCaseOperationNoFile
          Result: The following messages haven't been handled by the testcase: 
org.bitrepository.bitrepositorymessages.GetFileIDsFinalResponse@66cb7a21[correlationID=e98de0f4-2a82-444a-92ab-0ab72c91de64, collectionID=TwoPillarCollection, destination=TEST-TOPIC-badCaseOperationNoFile-cibuild01, replyTo=TEST-TOPIC-Pillar-badCaseOperationNoFile-cibuild01-contributor, from=Pillar-badCaseOperationNoFile, to=badCaseOperationNoFile, version=30, minVersion=24, responseInfo=org.bitrepository.bitrepositoryelements.ResponseInfo@7e941cc8[responseCode=FILE_NOT_FOUND_FAILURE, responseText=File not found.], pillarID=Pillar-badCaseOperationNoFile, fileIDs=org.bitrepository.bitrepositoryelements.FileIDs@661fe6c4[fileID=DefaultFilebadCaseOperationNoFile, allFileIDs=<null>(default)], resultingFileIDs=<null>(default), partialResult=<null>(default)]
09:53:20.197 WARN  o.b.protocol.bus.MessageReceiver - The following messages haven't been handled by the testcase: 
org.bitrepository.bitrepositorymessages.GetFileIDsFinalResponse@66cb7a21[correlationID=e98de0f4-2a82-444a-92ab-0ab72c91de64, collectionID=TwoPillarCollection, destination=TEST-TOPIC-badCaseOperationNoFile-cibuild01, replyTo=TEST-TOPIC-Pillar-badCaseOperationNoFile-cibuild01-contributor, from=Pillar-badCaseOperationNoFile, to=badCaseOperationNoFile, version=30, minVersion=24, responseInfo=org.bitrepository.bitrepositoryelements.ResponseInfo@7e941cc8[responseCode=FILE_NOT_FOUND_FAILURE, responseText=File not found.], pillarID=Pillar-badCaseOperationNoFile, fileIDs=org.bitrepository.bitrepositoryelements.FileIDs@661fe6c4[fileID=DefaultFilebadCaseOperationNoFile, allFileIDs=<null>(default)], resultingFileIDs=<null>(default), partialResult=<null>(default)]
        Added fixture: Initialize a new Pillar.
      Test starting: goodCaseIdentification
        Description: Tests the identification for a GetFileIDs operation on the pillar for the successful scenario.
        Step: Set up constants and variables.
        Step: Setup for having the file and delivering pillar id
        Step: Create and send the identify request message.
          Result: Received message on TEST-TOPIC-goodCaseIdentification-cibuild01 : org.bitrepository.bitrepositorymessages.IdentifyPillarsForGetFileIDsResponse@1a4132b2[correlationID=68ccf986-53cb-43c5-9926-3d901d4c3bbb, collectionID=TwoPillarCollection, destination=TEST-TOPIC-goodCaseIdentification-cibuild01, replyTo=TEST-TOPIC-Pillar-goodCaseIdentification-cibuild01-contributor, from=Pillar-goodCaseIdentification, to=goodCaseIdentification, version=30, minVersion=24, responseInfo=org.bitrepository.bitrepositoryelements.ResponseInfo@1f96db42[responseCode=IDENTIFICATION_POSITIVE, responseText=Operation acknowledged and accepted.], pillarID=Pillar-goodCaseIdentification, fileIDs=org.bitrepository.bitrepositoryelements.FileIDs@13bf9a03[fileID=DefaultFilegoodCaseIdentification, allFileIDs=<null>(default)], timeToDeliver=org.bitrepository.bitrepositoryelements.TimeMeasureTYPE@2c952e6[timeMeasureUnit=MILLISECONDS, timeMeasureValue=1000]]
        Step: Retrieve and validate the response getPillarID() the pillar.
      Test success: goodCaseIdentification
    Starting testcase GetFileTest
        Added fixture: Initialize a new Pillar.
      Test starting: badCaseIdentification
        Description: Tests the identification for a GetFile operation on the checksum pillar for the failure scenario, when the file is missing.
        Step: Set up constants and variables.
        Step: Setup for throwing an exception when asked to verify file existence
        Step: Create and send the identify request message.
          Result: Received message on TEST-TOPIC-badCaseIdentification-cibuild01 : org.bitrepository.bitrepositorymessages.IdentifyPillarsForGetFileResponse@3f06c9ac[correlationID=5a952de6-bd48-4ade-9563-b427c9b91187, collectionID=TwoPillarCollection, destination=TEST-TOPIC-badCaseIdentification-cibuild01, replyTo=TEST-TOPIC-Pillar-badCaseIdentification-cibuild01-contributor, from=Pillar-badCaseIdentification, to=badCaseIdentification, version=30, minVersion=24, responseInfo=org.bitrepository.bitrepositoryelements.ResponseInfo@3fe8c952[responseCode=FILE_NOT_FOUND_FAILURE, responseText=File not found.], fileID=DefaultFilebadCaseIdentification, pillarID=Pillar-badCaseIdentification, timeToDeliver=<null>(default)]
        Step: Retrieve and validate the response getPillarID() the pillar.
      Test success: badCaseIdentification
        Added fixture: Initialize a new Pillar.
      Test starting: goodCaseIdentification
        Description: Tests the identification for a GetFile operation on the pillar for the successful scenario.
        Step: Set up constants and variables.
        Step: Setup for having the file and delivering pillar id
        Step: Create and send the identify request message.
          Result: Received message on TEST-TOPIC-goodCaseIdentification-cibuild01 : org.bitrepository.bitrepositorymessages.IdentifyPillarsForGetFileResponse@29b78b34[correlationID=56768cea-bb13-4d18-8fbd-ac20b3bc0e15, collectionID=TwoPillarCollection, destination=TEST-TOPIC-goodCaseIdentification-cibuild01, replyTo=TEST-TOPIC-Pillar-goodCaseIdentification-cibuild01-contributor, from=Pillar-goodCaseIdentification, to=goodCaseIdentification, version=30, minVersion=24, responseInfo=org.bitrepository.bitrepositoryelements.ResponseInfo@3817d886[responseCode=IDENTIFICATION_POSITIVE, responseText=Operation acknowledged and accepted.], fileID=DefaultFilegoodCaseIdentification, pillarID=Pillar-goodCaseIdentification, timeToDeliver=org.bitrepository.bitrepositoryelements.TimeMeasureTYPE@109a28c8[timeMeasureUnit=MILLISECONDS, timeMeasureValue=1000]]
        Step: Retrieve and validate the response getPillarID() the pillar.
      Test success: goodCaseIdentification
      Test starting: componentIDTest
      Test success: componentIDTest
    Starting testcase RecalculateChecksumWorkflowTest
        Added fixture: Initialize the Reference pillar cache with an empty file in default collection TwoPillarCollection
      Test starting: testWorkflowDoesNotRecalculateWhenNotNeeded
        Description: Test that the workflow does not recalculates the workflows, when the maximum age has not yet been met.
        Step: Create and run workflow
      Test success: testWorkflowDoesNotRecalculateWhenNotNeeded
        Added fixture: Initialize the Reference pillar cache with an empty file in default collection TwoPillarCollection
      Test starting: testWorkflowRecalculatesChecksum
        Description: Test that the workflow recalculates the workflows, when the maximum age has been met.
        Step: Create and run workflow
      Test success: testWorkflowRecalculatesChecksum
    Starting testcase ReferenceArchiveTest
        Added fixture: Initialize the Reference pillar cache with an empty file in default collection TwoPillarCollection
      Test starting: testReferenceArchive
        Description: Test the ReferenceArchive.
        Step: Setup
        Step: test 'hasFile'
        Step: Test 'getFile'
        Step: Test getAllFileIDs
        Step: Test 'getFileAsInputstream'
        Step: Delete, recreate and delete again
        Step: Try to delete missing file.
        Step: Replace a file, which does not exist in the filedir.
        Step: Copy a file into the tmpDir and then use replace.
        Step: Try performing the replace, when the file in the tempdir has been removed.
      Test success: testReferenceArchive
      Test starting: getPillarCollectionsTest
      Test success: getPillarCollectionsTest
    Starting testcase ChecksumDatabaseMigrationTest
      Test starting: testMigratingChecksumDatabaseFromV3ToV4
        Description: Tests that the checksums table can be migrated from version 3 to 4, e.g. changing the column calculatedchecksumdate from timestamp to bigint.
        Step: Ensure cleanup
09:53:25.200 WARN  o.b.common.utils.FileUtils - Could not delete '/home/cibuild01/workspace/Bitrepository-reference-test/bitrepository-reference-pillar/target/test/referencepillar/checksumdb-for-migration'
        Step: Unzipping and connecting to checksum database version 3
        Step: Validate setup
        Step: Ingest a entry to the database with a date for the calculationdate
        Step: Perform migration
09:53:27.839 WARN  o.b.service.database.DatabaseUtils - Migrating ChecksumDB from version 3 to 4.
        Step: Validate the migration
      Test success: testMigratingChecksumDatabaseFromV3ToV4
    Starting testcase ChecksumDatabaseTest
      Test starting: testChecksumDatabaseExtraction
        Description: Test the extraction of data from the checksum database.
        Step: Check whether the default entry exists.
        Step: Extract calculation date
        Step: Extract the checksum
        Step: Extract the whole entry
        Step: Extract all entries
      Test success: testChecksumDatabaseExtraction
      Test starting: testDeletion
        Description: Test that data can be deleted from the database.
        Step: Check whether the default entry exists.
        Step: Remove the default entry
      Test success: testDeletion
      Test starting: testExtractionOfMissingData
        Description: Test the handling of bad arguments.
        Step: Try to get the date of a wrong file id.
        Step: Try to get the date of a wrong file id.
        Step: Try to remove a bad file id
      Test success: testExtractionOfMissingData
      Test starting: testGetChecksumResult
        Description: Tests the restrictions on the GetChecksumResult call to the database.
        Step: Instantiate database with appropriate data.
        Step: Test with no time restrictions
        Step: Test with time restrictions from epoc to now
        Step: Test with very strict time restrictions around the default date
        Step: Test with too new a lower limit
        Step: Test with exact date as both upper and lower limit
        Step: Test with date limit from 1 millis before as lower and exact date a upper limit
        Step: Test with date limit from exact date as lower and 1 millis after date a upper limit
        Step: Test with too old an upper limit
      Test success: testGetChecksumResult
      Test starting: testGetFileIDsRestrictions
        Description: Tests the restrictions on the GetFileIDs call to the database.
        Step: Instantiate database with appropriate data.
        Step: Test with no time restrictions and 10000 max_results
        Step: Test with minimum-date earlier than first file
        Step: Test with maximum-date earlier than first file
        Step: Test with minimum-date set to later than second file.
        Step: Test with maximum-date set to later than second file.
        Step: Test with minimum-date set to middle date.
        Step: Test with maximum-date set to middle date.
        Step: Test with both minimum-date and maximum-date set to middle date.
        Step: Test the first file-id, with no other restrictions
        Step: Test the second file-id, with no other restrictions
        Step: Test the date for the first file-id, while requesting the second file-id
      Test success: testGetFileIDsRestrictions
      Test starting: testGetFileIDsWithOldChecksums
        Description: Tests the restrictions on the GetFileIDsWithOldChecksums call to the database.
        Step: Instantiate database with appropriate data.
        Step: Extract all entries with checksum date older than now
        Step: Extract all entries with checksum date older than epoch
        Step: Extract all entries with checksum date older than middle date
      Test success: testGetFileIDsWithOldChecksums
      Test starting: testReplacingExistingEntry
        Description: Test that an entry can be replaced by another in the database.
        Step: Check whether the default entry exists.
        Step: Replace the checksum and date
      Test success: testReplacingExistingEntry
      Test starting: testSpecifiedEntryExtraction
        Description: Test that specific entries can be extracted. Has two entries in the database: one for the current timestamp and one for the epoch.
        Step: Instantiate database with appropriate data.
        Step: Extract with out restrictions
        Step: Extract with a maximum of 1 entry
        Step: Extract all dates older than this tests instantiation
        Step: Extract all dates newer than this tests instantiation
        Step: Extract all dates older than the newest instance
        Step: Extract all dates newer than the oldest instantiation
      Test success: testSpecifiedEntryExtraction
    Starting testcase GeneralMessageHandlingTest
        Added fixture: Initialize a new Pillar.
      Test starting: testPillarMessageHandler
        Description: Test the handling of the PillarMessageHandler super-class.
        Step: Setup
        Step: Test the pillar ID
      Test success: testPillarMessageHandler
        Added fixture: Initialize a new Pillar.
      Test starting: testPillarMessageHandlerValidateFileIDFormatDefaultFileId
        Description: Test the validation of file id formats of the PillarMessageHandler super-class on the default file id
      Test success: testPillarMessageHandlerValidateFileIDFormatDefaultFileId
        Added fixture: Initialize a new Pillar.
      Test starting: testPillarMessageHandlerValidateFileIDFormatEnvHomePathFileId
        Description: Test the validation of file id formats of the PillarMessageHandler super-class on a file id containing path relative paths from the environment variable home folder
      Test success: testPillarMessageHandlerValidateFileIDFormatEnvHomePathFileId
        Added fixture: Initialize a new Pillar.
      Test starting: testPillarMessageHandlerValidateFileIDFormatFolderFileId
        Description: Test the validation of file id formats of the PillarMessageHandler super-class on a file id with directory path
      Test success: testPillarMessageHandlerValidateFileIDFormatFolderFileId
        Added fixture: Initialize a new Pillar.
      Test starting: testPillarMessageHandlerValidateFileIDFormatParentFolderFileId
        Description: Test the validation of file id formats of the PillarMessageHandler super-class on a file id containing path to a parent directory
      Test success: testPillarMessageHandlerValidateFileIDFormatParentFolderFileId
        Added fixture: Initialize a new Pillar.
      Test starting: testPillarMessageHandlerValidateFileIDFormatRootPathFileId
        Description: Test the validation of file id formats of the PillarMessageHandler super-class on a file id containing path from the root folder
      Test success: testPillarMessageHandlerValidateFileIDFormatRootPathFileId
        Added fixture: Initialize a new Pillar.
      Test starting: testPillarMessageHandlerValidateFileIDFormatSubFolderToParentFolderFileId
        Description: Test the validation of file id formats of the PillarMessageHandler super-class on a file id containing path to a parent directory, but starting with a sub-folder
      Test success: testPillarMessageHandlerValidateFileIDFormatSubFolderToParentFolderFileId
        Added fixture: Initialize a new Pillar.
      Test starting: testPillarMessageHandlerValidateFileIDFormatTildeHomePathFileId
        Description: Test the validation of file id formats of the PillarMessageHandler super-class on a file id containing path relative paths from the tilde home folder
      Test success: testPillarMessageHandlerValidateFileIDFormatTildeHomePathFileId
        Added fixture: Initialize a new Pillar.
      Test starting: testPillarMessageHandlerValidateFileIDFormatTooLong
        Description: Test the validation of file id formats of the PillarMessageHandler super-class on a file id which has more characters than required
      Test success: testPillarMessageHandlerValidateFileIDFormatTooLong
    Starting testcase GetChecksumsTest
        Added fixture: Initialize a new Pillar.
      Test starting: badCaseIdentification
        Description: Tests the identification for a GetChecksums operation on the pillar for the failure scenario, when the file is missing.
        Step: Set up constants and variables.
        Step: Setup for delivering pillar id and not having the file 
        Step: Create and send the identify request message.
          Result: Received message on TEST-TOPIC-badCaseIdentification-cibuild01 : org.bitrepository.bitrepositorymessages.IdentifyPillarsForGetChecksumsResponse@3bdbf525[correlationID=d0fbcdc9-ffc8-45a5-b6be-54834b67f9a9, collectionID=TwoPillarCollection, destination=TEST-TOPIC-badCaseIdentification-cibuild01, replyTo=TEST-TOPIC-Pillar-badCaseIdentification-cibuild01-contributor, from=Pillar-badCaseIdentification, to=badCaseIdentification, version=30, minVersion=24, responseInfo=org.bitrepository.bitrepositoryelements.ResponseInfo@54d8147d[responseCode=FILE_NOT_FOUND_FAILURE, responseText=File not found.], fileIDs=org.bitrepository.bitrepositoryelements.FileIDs@15ab7999[fileID=DefaultFilebadCaseIdentification, allFileIDs=<null>(default)], checksumRequestForExistingFile=org.bitrepository.bitrepositoryelements.ChecksumSpecTYPE@6ed61f9e[checksumType=MD5, checksumSalt=<null>(default), otherChecksumType=<null>(default)], pillarID=Pillar-badCaseIdentification, pillarChecksumSpec=<null>(default), timeToDeliver=<null>(default)]
        Step: Retrieve and validate the response getPillarID() the pillar.
      Test success: badCaseIdentification
        Added fixture: Initialize a new Pillar.
      Test starting: badCaseOperationNoFile
        Description: Tests the GetChecksums functionality of the pillar for the failure scenario, where it does not have the file.
        Step: Set up constants and variables.
        Step: Setup for not having the file
        Step: Create and send the actual GetChecksums message to the pillar.
09:53:39.892 WARN  o.b.p.m.GetChecksumsRequestHandler - The following file is missing 'DefaultFilebadCaseOperationNoFile' at collection 'TwoPillarCollection'.
          Result: Received message on TEST-TOPIC-badCaseOperationNoFile-cibuild01 : org.bitrepository.bitrepositorymessages.GetChecksumsFinalResponse@6bd476f5[correlationID=fefd2884-088c-4bff-8fe8-000ea6417193, collectionID=TwoPillarCollection, destination=TEST-TOPIC-badCaseOperationNoFile-cibuild01, replyTo=TEST-TOPIC-Pillar-badCaseOperationNoFile-cibuild01-contributor, from=Pillar-badCaseOperationNoFile, to=badCaseOperationNoFile, version=30, minVersion=24, responseInfo=org.bitrepository.bitrepositoryelements.ResponseInfo@74d7c00a[responseCode=FILE_NOT_FOUND_FAILURE, responseText=File not found.], pillarID=Pillar-badCaseOperationNoFile, checksumRequestForExistingFile=org.bitrepository.bitrepositoryelements.ChecksumSpecTYPE@2d6726f6[checksumType=MD5, checksumSalt=<null>(default), otherChecksumType=<null>(default)], resultingChecksums=<null>(default), partialResult=<null>(default)]
09:53:39.895 WARN  o.b.p.m.GetChecksumsRequestHandler - The following file is missing 'DefaultFilebadCaseOperationNoFile' at collection 'TwoPillarCollection'.
          Result: Received message on TEST-TOPIC-badCaseOperationNoFile-cibuild01 : org.bitrepository.bitrepositorymessages.GetChecksumsFinalResponse@46cef39e[correlationID=fefd2884-088c-4bff-8fe8-000ea6417193, collectionID=TwoPillarCollection, destination=TEST-TOPIC-badCaseOperationNoFile-cibuild01, replyTo=TEST-TOPIC-Pillar-badCaseOperationNoFile-cibuild01-contributor, from=Pillar-badCaseOperationNoFile, to=badCaseOperationNoFile, version=30, minVersion=24, responseInfo=org.bitrepository.bitrepositoryelements.ResponseInfo@cd3acdd[responseCode=FILE_NOT_FOUND_FAILURE, responseText=File not found.], pillarID=Pillar-badCaseOperationNoFile, checksumRequestForExistingFile=org.bitrepository.bitrepositoryelements.ChecksumSpecTYPE@2d6726f6[checksumType=MD5, checksumSalt=<null>(default), otherChecksumType=<null>(default)], resultingChecksums=<null>(default), partialResult=<null>(default)]
09:53:39.897 WARN  o.b.p.m.GetChecksumsRequestHandler - The following file is missing 'DefaultFilebadCaseOperationNoFile' at collection 'TwoPillarCollection'.
          Result: Received message on TEST-TOPIC-badCaseOperationNoFile-cibuild01 : org.bitrepository.bitrepositorymessages.GetChecksumsFinalResponse@3e0c2650[correlationID=fefd2884-088c-4bff-8fe8-000ea6417193, collectionID=TwoPillarCollection, destination=TEST-TOPIC-badCaseOperationNoFile-cibuild01, replyTo=TEST-TOPIC-Pillar-badCaseOperationNoFile-cibuild01-contributor, from=Pillar-badCaseOperationNoFile, to=badCaseOperationNoFile, version=30, minVersion=24, responseInfo=org.bitrepository.bitrepositoryelements.ResponseInfo@fef700c[responseCode=FILE_NOT_FOUND_FAILURE, responseText=File not found.], pillarID=Pillar-badCaseOperationNoFile, checksumRequestForExistingFile=org.bitrepository.bitrepositoryelements.ChecksumSpecTYPE@2d6726f6[checksumType=MD5, checksumSalt=<null>(default), otherChecksumType=<null>(default)], resultingChecksums=<null>(default), partialResult=<null>(default)]
        Step: Retrieve the FinalResponse for the GetChecksums request
      Test success: badCaseOperationNoFile
          Result: The following messages haven't been handled by the testcase: 
org.bitrepository.bitrepositorymessages.GetChecksumsFinalResponse@46cef39e[correlationID=fefd2884-088c-4bff-8fe8-000ea6417193, collectionID=TwoPillarCollection, destination=TEST-TOPIC-badCaseOperationNoFile-cibuild01, replyTo=TEST-TOPIC-Pillar-badCaseOperationNoFile-cibuild01-contributor, from=Pillar-badCaseOperationNoFile, to=badCaseOperationNoFile, version=30, minVersion=24, responseInfo=org.bitrepository.bitrepositoryelements.ResponseInfo@cd3acdd[responseCode=FILE_NOT_FOUND_FAILURE, responseText=File not found.], pillarID=Pillar-badCaseOperationNoFile, checksumRequestForExistingFile=org.bitrepository.bitrepositoryelements.ChecksumSpecTYPE@2d6726f6[checksumType=MD5, checksumSalt=<null>(default), otherChecksumType=<null>(default)], resultingChecksums=<null>(default), partialResult=<null>(default)]
org.bitrepository.bitrepositorymessages.GetChecksumsFinalResponse@3e0c2650[correlationID=fefd2884-088c-4bff-8fe8-000ea6417193, collectionID=TwoPillarCollection, destination=TEST-TOPIC-badCaseOperationNoFile-cibuild01, replyTo=TEST-TOPIC-Pillar-badCaseOperationNoFile-cibuild01-contributor, from=Pillar-badCaseOperationNoFile, to=badCaseOperationNoFile, version=30, minVersion=24, responseInfo=org.bitrepository.bitrepositoryelements.ResponseInfo@fef700c[responseCode=FILE_NOT_FOUND_FAILURE, responseText=File not found.], pillarID=Pillar-badCaseOperationNoFile, checksumRequestForExistingFile=org.bitrepository.bitrepositoryelements.ChecksumSpecTYPE@2d6726f6[checksumType=MD5, checksumSalt=<null>(default), otherChecksumType=<null>(default)], resultingChecksums=<null>(default), partialResult=<null>(default)]
09:53:40.905 WARN  o.b.protocol.bus.MessageReceiver - The following messages haven't been handled by the testcase: 
org.bitrepository.bitrepositorymessages.GetChecksumsFinalResponse@46cef39e[correlationID=fefd2884-088c-4bff-8fe8-000ea6417193, collectionID=TwoPillarCollection, destination=TEST-TOPIC-badCaseOperationNoFile-cibuild01, replyTo=TEST-TOPIC-Pillar-badCaseOperationNoFile-cibuild01-contributor, from=Pillar-badCaseOperationNoFile, to=badCaseOperationNoFile, version=30, minVersion=24, responseInfo=org.bitrepository.bitrepositoryelements.ResponseInfo@cd3acdd[responseCode=FILE_NOT_FOUND_FAILURE, responseText=File not found.], pillarID=Pillar-badCaseOperationNoFile, checksumRequestForExistingFile=org.bitrepository.bitrepositoryelements.ChecksumSpecTYPE@2d6726f6[checksumType=MD5, checksumSalt=<null>(default), otherChecksumType=<null>(default)], resultingChecksums=<null>(default), partialResult=<null>(default)]
org.bitrepository.bitrepositorymessages.GetChecksumsFinalResponse@3e0c2650[correlationID=fefd2884-088c-4bff-8fe8-000ea6417193, collectionID=TwoPillarCollection, destination=TEST-TOPIC-badCaseOperationNoFile-cibuild01, replyTo=TEST-TOPIC-Pillar-badCaseOperationNoFile-cibuild01-contributor, from=Pillar-badCaseOperationNoFile, to=badCaseOperationNoFile, version=30, minVersion=24, responseInfo=org.bitrepository.bitrepositoryelements.ResponseInfo@fef700c[responseCode=FILE_NOT_FOUND_FAILURE, responseText=File not found.], pillarID=Pillar-badCaseOperationNoFile, checksumRequestForExistingFile=org.bitrepository.bitrepositoryelements.ChecksumSpecTYPE@2d6726f6[checksumType=MD5, checksumSalt=<null>(default), otherChecksumType=<null>(default)], resultingChecksums=<null>(default), partialResult=<null>(default)]
        Added fixture: Initialize a new Pillar.
      Test starting: goodCaseIdentification
        Description: Tests the identification for a GetChecksums operation on the pillar for the successful scenario.
        Step: Set up constants and variables.
        Step: Setup for having the file and delivering pillar id
        Step: Create and send the identify request message.
          Result: Received message on TEST-TOPIC-goodCaseIdentification-cibuild01 : org.bitrepository.bitrepositorymessages.IdentifyPillarsForGetChecksumsResponse@577981ca[correlationID=436b4896-ff6c-4593-9bf3-75353d4b9c41, collectionID=TwoPillarCollection, destination=TEST-TOPIC-goodCaseIdentification-cibuild01, replyTo=TEST-TOPIC-Pillar-goodCaseIdentification-cibuild01-contributor, from=Pillar-goodCaseIdentification, to=goodCaseIdentification, version=30, minVersion=24, responseInfo=org.bitrepository.bitrepositoryelements.ResponseInfo@cba01e2[responseCode=IDENTIFICATION_POSITIVE, responseText=Operation acknowledged and accepted.], fileIDs=org.bitrepository.bitrepositoryelements.FileIDs@615524a[fileID=DefaultFilegoodCaseIdentification, allFileIDs=<null>(default)], checksumRequestForExistingFile=org.bitrepository.bitrepositoryelements.ChecksumSpecTYPE@3a75a52a[checksumType=MD5, checksumSalt=<null>(default), otherChecksumType=<null>(default)], pillarID=Pillar-goodCaseIdentification, pillarChecksumSpec=<null>(default), timeToDeliver=org.bitrepository.bitrepositoryelements.TimeMeasureTYPE@2199147f[timeMeasureUnit=MILLISECONDS, timeMeasureValue=1000]]
        Step: Retrieve and validate the response getPillarID() the pillar.
      Test success: goodCaseIdentification
        Added fixture: Initialize a new Pillar.
      Test starting: goodCaseOperationAllFiles
        Description: Tests the GetChecksums operation on the pillar for the successful scenario, when requesting all files.
        Step: Set up constants and variables.
        Step: Setup for having the file and delivering result-set
        Step: Create and send the actual GetChecksums message to the pillar.
          Result: Received message on TEST-TOPIC-goodCaseOperationAllFiles-cibuild01 : org.bitrepository.bitrepositorymessages.GetChecksumsProgressResponse@57b97628[correlationID=e7909433-3cf3-4b75-a4d2-1e6b0cde8b79, collectionID=TwoPillarCollection, destination=TEST-TOPIC-goodCaseOperationAllFiles-cibuild01, replyTo=TEST-TOPIC-Pillar-goodCaseOperationAllFiles-cibuild01-contributor, from=Pillar-goodCaseOperationAllFiles, to=goodCaseOperationAllFiles, version=30, minVersion=24, responseInfo=org.bitrepository.bitrepositoryelements.ResponseInfo@63cdd551[responseCode=OPERATION_ACCEPTED_PROGRESS, responseText=Starting to calculate checksums.], pillarID=Pillar-goodCaseOperationAllFiles, fileIDs=org.bitrepository.bitrepositoryelements.FileIDs@f55bfa8[fileID=<null>(default), allFileIDs=true], checksumRequestForExistingFile=org.bitrepository.bitrepositoryelements.ChecksumSpecTYPE@4961b6f0[checksumType=MD5, checksumSalt=<null>(default), otherChecksumType=<null>(default)], resultAddress=<null>(default)]
          Result: Received message on TEST-TOPIC-goodCaseOperationAllFiles-cibuild01 : org.bitrepository.bitrepositorymessages.GetChecksumsFinalResponse@10125936[correlationID=e7909433-3cf3-4b75-a4d2-1e6b0cde8b79, collectionID=TwoPillarCollection, destination=TEST-TOPIC-goodCaseOperationAllFiles-cibuild01, replyTo=TEST-TOPIC-Pillar-goodCaseOperationAllFiles-cibuild01-contributor, from=Pillar-goodCaseOperationAllFiles, to=goodCaseOperationAllFiles, version=30, minVersion=24, responseInfo=org.bitrepository.bitrepositoryelements.ResponseInfo@67b2bcbd[responseCode=OPERATION_COMPLETED, responseText=<null>(default)], pillarID=Pillar-goodCaseOperationAllFiles, checksumRequestForExistingFile=org.bitrepository.bitrepositoryelements.ChecksumSpecTYPE@4961b6f0[checksumType=MD5, checksumSalt=<null>(default), otherChecksumType=<null>(default)], resultingChecksums=org.bitrepository.bitrepositoryelements.ResultingChecksums@1148eccb[resultAddress=<null>(default), checksumDataItems={org.bitrepository.bitrepositoryelements.ChecksumDataForChecksumSpecTYPE@3bae5f78[fileID=DefaultFile, checksumValue={18,52,-52,-52,-52,-52,67,33}, calculationTimestamp=2020-09-04T09:53:42.245+02:00],org.bitrepository.bitrepositoryelements.ChecksumDataForChecksumSpecTYPE@39777ad2[fileID=goodCaseOperationAllFiles-cibuild01--Test-File-1599206022235, checksumValue={18,52,-52,-52,-52,-52,67,34}, calculationTimestamp=1970-01-01T01:00:00.000+01:00]}], partialResult=false]
        Step: Retrieve the ProgressResponse for the GetChecksums request
        Step: Retrieve the FinalResponse for the GetChecksums request
      Test success: goodCaseOperationAllFiles
        Added fixture: Initialize a new Pillar.
      Test starting: goodCaseOperationSingleFile
        Description: Tests the GetChecksums operation on the pillar for the successful scenario when requesting one specific file.
        Step: Set up constants and variables.
        Step: Setup for having the file and delivering result-set
        Step: Create and send the actual GetChecksums message to the pillar.
          Result: Received message on TEST-TOPIC-goodCaseOperationSingleFile-cibuild01 : org.bitrepository.bitrepositorymessages.GetChecksumsProgressResponse@4f29208d[correlationID=1448599b-1bf3-4e9a-8481-fef7ab33a342, collectionID=TwoPillarCollection, destination=TEST-TOPIC-goodCaseOperationSingleFile-cibuild01, replyTo=TEST-TOPIC-Pillar-goodCaseOperationSingleFile-cibuild01-contributor, from=Pillar-goodCaseOperationSingleFile, to=goodCaseOperationSingleFile, version=30, minVersion=24, responseInfo=org.bitrepository.bitrepositoryelements.ResponseInfo@67369634[responseCode=OPERATION_ACCEPTED_PROGRESS, responseText=Starting to calculate checksums.], pillarID=Pillar-goodCaseOperationSingleFile, fileIDs=org.bitrepository.bitrepositoryelements.FileIDs@7075359c[fileID=DefaultFilegoodCaseOperationSingleFile, allFileIDs=<null>(default)], checksumRequestForExistingFile=org.bitrepository.bitrepositoryelements.ChecksumSpecTYPE@28226f76[checksumType=MD5, checksumSalt=<null>(default), otherChecksumType=<null>(default)], resultAddress=<null>(default)]
          Result: Received message on TEST-TOPIC-goodCaseOperationSingleFile-cibuild01 : org.bitrepository.bitrepositorymessages.GetChecksumsFinalResponse@2e090fb7[correlationID=1448599b-1bf3-4e9a-8481-fef7ab33a342, collectionID=TwoPillarCollection, destination=TEST-TOPIC-goodCaseOperationSingleFile-cibuild01, replyTo=TEST-TOPIC-Pillar-goodCaseOperationSingleFile-cibuild01-contributor, from=Pillar-goodCaseOperationSingleFile, to=goodCaseOperationSingleFile, version=30, minVersion=24, responseInfo=org.bitrepository.bitrepositoryelements.ResponseInfo@7dddbb74[responseCode=OPERATION_COMPLETED, responseText=<null>(default)], pillarID=Pillar-goodCaseOperationSingleFile, checksumRequestForExistingFile=org.bitrepository.bitrepositoryelements.ChecksumSpecTYPE@28226f76[checksumType=MD5, checksumSalt=<null>(default), otherChecksumType=<null>(default)], resultingChecksums=org.bitrepository.bitrepositoryelements.ResultingChecksums@245db886[resultAddress=<null>(default), checksumDataItems={org.bitrepository.bitrepositoryelements.ChecksumDataForChecksumSpecTYPE@1f3f3aa4[fileID=DefaultFilegoodCaseOperationSingleFile, checksumValue={18,52,-52,-52,-52,-52,67,33}, calculationTimestamp=2020-09-04T09:53:42.426+02:00]}], partialResult=false]
        Step: Retrieve the ProgressResponse for the GetChecksums request
        Step: Retrieve the FinalResponse for the GetChecksums request
      Test success: goodCaseOperationSingleFile
        Added fixture: Initialize a new Pillar.
      Test starting: testRestrictions
        Description: Tests that the restrictions are correctly passed on to the cache.
        Step: Set up constants and variables.
        Step: Setup for only delivering result-set when the correct restrictions are given.
        Step: Create and send the actual GetChecksums message to the pillar.
          Result: Received message on TEST-TOPIC-testRestrictions-cibuild01 : org.bitrepository.bitrepositorymessages.GetChecksumsProgressResponse@168bcf44[correlationID=bc1bba69-1ecb-4db4-a76a-1af3b3c2bbe8, collectionID=TwoPillarCollection, destination=TEST-TOPIC-testRestrictions-cibuild01, replyTo=TEST-TOPIC-Pillar-testRestrictions-cibuild01-contributor, from=Pillar-testRestrictions, to=testRestrictions, version=30, minVersion=24, responseInfo=org.bitrepository.bitrepositoryelements.ResponseInfo@4332c44d[responseCode=OPERATION_ACCEPTED_PROGRESS, responseText=Starting to calculate checksums.], pillarID=Pillar-testRestrictions, fileIDs=org.bitrepository.bitrepositoryelements.FileIDs@50f9f2c3[fileID=<null>(default), allFileIDs=true], checksumRequestForExistingFile=org.bitrepository.bitrepositoryelements.ChecksumSpecTYPE@259a3d8c[checksumType=MD5, checksumSalt=<null>(default), otherChecksumType=<null>(default)], resultAddress=<null>(default)]
          Result: Received message on TEST-TOPIC-testRestrictions-cibuild01 : org.bitrepository.bitrepositorymessages.GetChecksumsFinalResponse@6da33794[correlationID=bc1bba69-1ecb-4db4-a76a-1af3b3c2bbe8, collectionID=TwoPillarCollection, destination=TEST-TOPIC-testRestrictions-cibuild01, replyTo=TEST-TOPIC-Pillar-testRestrictions-cibuild01-contributor, from=Pillar-testRestrictions, to=testRestrictions, version=30, minVersion=24, responseInfo=org.bitrepository.bitrepositoryelements.ResponseInfo@386686c1[responseCode=OPERATION_COMPLETED, responseText=<null>(default)], pillarID=Pillar-testRestrictions, checksumRequestForExistingFile=org.bitrepository.bitrepositoryelements.ChecksumSpecTYPE@259a3d8c[checksumType=MD5, checksumSalt=<null>(default), otherChecksumType=<null>(default)], resultingChecksums=org.bitrepository.bitrepositoryelements.ResultingChecksums@271614e4[resultAddress=<null>(default), checksumDataItems={org.bitrepository.bitrepositoryelements.ChecksumDataForChecksumSpecTYPE@53142bd7[fileID=DefaultFile, checksumValue={18,52,-52,-52,-52,-52,67,33}, calculationTimestamp=2020-09-04T09:53:42.566+02:00]}], partialResult=false]
        Step: Retrieve the ProgressResponse for the GetChecksums request
        Step: Retrieve the FinalResponse for the GetChecksums request
      Test success: testRestrictions
    Starting testcase MediatorTest
      Test starting: testMediatorRuntimeExceptionHandling
        Description: Tests the handling of a runtime exception
        Step: Setup create and start the mediator.
        Step: Send a request to the mediator.
09:53:43.779 WARN  o.b.pillar.MediatorTest$TestMediator - Unexpected exception caught.
java.lang.RuntimeException: I am supposed to throw a RuntimeException
	at org.bitrepository.pillar.MediatorTest$ErroneousRequestHandler.processRequest(MediatorTest.java:122)
	at org.bitrepository.pillar.MediatorTest$ErroneousRequestHandler.processRequest(MediatorTest.java:113)
	at org.bitrepository.pillar.messagehandler.PillarMediator.handleRequest(PillarMediator.java:80)
	at org.bitrepository.service.contributor.AbstractContributorMediator$GeneralRequestHandler.onMessage(AbstractContributorMediator.java:101)
	at org.bitrepository.protocol.messagebus.SimpleMessageBus.lambda$sendMessage$0(SimpleMessageBus.java:73)
	at java.lang.Iterable.forEach(Iterable.java:75)
	at org.bitrepository.protocol.messagebus.SimpleMessageBus.sendMessage(SimpleMessageBus.java:73)
	at org.bitrepository.pillar.MediatorTest.testMediatorRuntimeExceptionHandling(MediatorTest.java:84)
	at sun.reflect.NativeMethodAccessorImpl.invoke0(Native Method)
	at sun.reflect.NativeMethodAccessorImpl.invoke(NativeMethodAccessorImpl.java:62)
	at sun.reflect.DelegatingMethodAccessorImpl.invoke(DelegatingMethodAccessorImpl.java:43)
	at java.lang.reflect.Method.invoke(Method.java:498)
	at org.testng.internal.MethodInvocationHelper.invokeMethod(MethodInvocationHelper.java:134)
	at org.testng.internal.TestInvoker.invokeMethod(TestInvoker.java:597)
	at org.testng.internal.TestInvoker.invokeTestMethod(TestInvoker.java:173)
	at org.testng.internal.MethodRunner.runInSequence(MethodRunner.java:46)
	at org.testng.internal.TestInvoker$MethodInvocationAgent.invoke(TestInvoker.java:816)
	at org.testng.internal.TestInvoker.invokeTestMethods(TestInvoker.java:146)
	at org.testng.internal.TestMethodWorker.invokeTestMethods(TestMethodWorker.java:146)
	at org.testng.internal.TestMethodWorker.run(TestMethodWorker.java:128)
	at java.util.ArrayList.forEach(ArrayList.java:1249)
	at org.testng.TestRunner.privateRun(TestRunner.java:766)
	at org.testng.TestRunner.run(TestRunner.java:587)
	at org.testng.SuiteRunner.runTest(SuiteRunner.java:384)
	at org.testng.SuiteRunner.runSequentially(SuiteRunner.java:378)
	at org.testng.SuiteRunner.privateRun(SuiteRunner.java:337)
	at org.testng.SuiteRunner.run(SuiteRunner.java:286)
	at org.testng.SuiteRunnerWorker.runSuite(SuiteRunnerWorker.java:53)
	at org.testng.SuiteRunnerWorker.run(SuiteRunnerWorker.java:96)
	at org.testng.TestNG.runSuitesSequentially(TestNG.java:1187)
	at org.testng.TestNG.runSuitesLocally(TestNG.java:1109)
	at org.testng.TestNG.runSuites(TestNG.java:1039)
	at org.testng.TestNG.run(TestNG.java:1007)
	at org.apache.maven.surefire.testng.TestNGExecutor.run(TestNGExecutor.java:135)
	at org.apache.maven.surefire.testng.TestNGDirectoryTestSuite.executeMulti(TestNGDirectoryTestSuite.java:193)
	at org.apache.maven.surefire.testng.TestNGDirectoryTestSuite.execute(TestNGDirectoryTestSuite.java:94)
	at org.apache.maven.surefire.testng.TestNGProvider.invoke(TestNGProvider.java:146)
	at org.apache.maven.surefire.booter.ForkedBooter.runSuitesInProcess(ForkedBooter.java:377)
	at org.apache.maven.surefire.booter.ForkedBooter.execute(ForkedBooter.java:138)
	at org.apache.maven.surefire.booter.ForkedBooter.run(ForkedBooter.java:465)
	at org.apache.maven.surefire.booter.ForkedBooter.main(ForkedBooter.java:451)
          Result: Received message on TEST-TOPIC-testMediatorRuntimeExceptionHandling-cibuild01 : org.bitrepository.bitrepositorymessages.IdentifyContributorsForGetStatusResponse@6ace6b0a[correlationID=deea16b3-ae4b-4945-8ae1-fdfec6a7dfb7, collectionID=TwoPillarCollection, destination=TEST-TOPIC-testMediatorRuntimeExceptionHandling-cibuild01, replyTo=TEST-TOPIC-MediatorUnderTest-cibuild01-contributor, from=MediatorUnderTest, to=MediatorUnderTest, version=30, minVersion=24, responseInfo=org.bitrepository.bitrepositoryelements.ResponseInfo@2cd8310d[responseCode=FAILURE, responseText=java.lang.RuntimeException: I am supposed to throw a RuntimeException], contributor=TEST-TOPIC-cibuild01, timeToDeliver=<null>(default)]
09:53:43.781 WARN  o.b.p.common.PillarAlarmDispatcher - Sending alarm: org.bitrepository.bitrepositoryelements.Alarm@bebbcbd[origDateTime=2020-09-04T09:53:43.781+02:00, alarmCode=COMPONENT_FAILURE, alarmRaiser=MediatorUnderTest, alarmText=java.lang.RuntimeException: I am supposed to throw a RuntimeException, fileID=<null>(default), collectionID=<null>(default)]
          Result: Received message on TEST-ALARM-TOPIC-cibuild01 : org.bitrepository.bitrepositorymessages.AlarmMessage@126410f1[correlationID=aba3ae07-b1b4-40a4-98b5-51411ee2174e, collectionID=<null>(default), destination=TEST-ALARM-TOPIC-cibuild01, replyTo=TEST-TOPIC-MediatorUnderTest-cibuild01-contributor, from=MediatorUnderTest, to=<null>(default), version=30, minVersion=24, alarm=org.bitrepository.bitrepositoryelements.Alarm@bebbcbd[origDateTime=2020-09-04T09:53:43.781+02:00, alarmCode=COMPONENT_FAILURE, alarmRaiser=MediatorUnderTest, alarmText=java.lang.RuntimeException: I am supposed to throw a RuntimeException, fileID=<null>(default), collectionID=<null>(default)]]
      Test success: testMediatorRuntimeExceptionHandling
    Starting testcase ChecksumEntryTest
      Test starting: testExtendedTestCase
        Description: Test the ChecksumEntry
        Step: Create a ChecksumEntry
      Test success: testExtendedTestCase
    Starting testcase GetAuditTrailsTest
        Added fixture: Initialize a new Pillar.
      Test starting: checksumPillarGetAuditTrailsMaximumNumberOfResults
        Description: Tests the GetAuditTrails functionality of the pillar for the successful scenario, where a limited number of audit trails are requested.
        Step: Set up constants and variables.
        Step: Send the request for the limited amount of audit trails to the pillar.
          Result: Received message on TEST-TOPIC-checksumPillarGetAuditTrailsMaximumNumberOfResults-cibuild01 : org.bitrepository.bitrepositorymessages.GetAuditTrailsProgressResponse@51ebd67a[correlationID=63f66b2f-6919-4d80-ab13-94d4aeaf1914, collectionID=TwoPillarCollection, destination=TEST-TOPIC-checksumPillarGetAuditTrailsMaximumNumberOfResults-cibuild01, replyTo=TEST-TOPIC-Pillar-checksumPillarGetAuditTrailsMaximumNumberOfResults-cibuild01-contributor, from=Pillar-checksumPillarGetAuditTrailsMaximumNumberOfResults, to=Pillar-checksumPillarGetAuditTrailsMaximumNumberOfResults, version=30, minVersion=24, responseInfo=org.bitrepository.bitrepositoryelements.ResponseInfo@347cfca3[responseCode=OPERATION_ACCEPTED_PROGRESS, responseText=Starting to extract the requested audit trails.], contributor=Pillar-checksumPillarGetAuditTrailsMaximumNumberOfResults, resultAddress=<null>(default)]
          Result: Received message on TEST-TOPIC-checksumPillarGetAuditTrailsMaximumNumberOfResults-cibuild01 : org.bitrepository.bitrepositorymessages.GetAuditTrailsFinalResponse@3c846b00[correlationID=63f66b2f-6919-4d80-ab13-94d4aeaf1914, collectionID=TwoPillarCollection, destination=TEST-TOPIC-checksumPillarGetAuditTrailsMaximumNumberOfResults-cibuild01, replyTo=TEST-TOPIC-Pillar-checksumPillarGetAuditTrailsMaximumNumberOfResults-cibuild01-contributor, from=Pillar-checksumPillarGetAuditTrailsMaximumNumberOfResults, to=Pillar-checksumPillarGetAuditTrailsMaximumNumberOfResults, version=30, minVersion=24, responseInfo=org.bitrepository.bitrepositoryelements.ResponseInfo@65ba7bf2[responseCode=OPERATION_COMPLETED, responseText=<null>(default)], contributor=Pillar-checksumPillarGetAuditTrailsMaximumNumberOfResults, resultingAuditTrails=org.bitrepository.bitrepositoryelements.ResultingAuditTrails@66100089[resultAddress=<null>(default), auditTrailEvents=org.bitrepository.bitrepositoryelements.AuditTrailEvents@52cd65a[auditTrailEvent={org.bitrepository.bitrepositoryelements.AuditTrailEvent@1aef7194[sequenceNumber=1, fileID=fileID1599206023926, reportingComponent=MOCK-AUDIT-MANAGER, actorOnFile=ACTOR, actionOnFile=CHECKSUM_CALCULATED, actionDateTime=2020-09-04T09:53:43.928+02:00, info=InFo, operationID=operationID, certificateID=certificateid, auditTrailInformation=auditTrails],org.bitrepository.bitrepositoryelements.AuditTrailEvent@2cbcecd0[sequenceNumber=2, fileID=fileID1599206023926, reportingComponent=MOCK-AUDIT-MANAGER, actorOnFile=ACTOR, actionOnFile=DELETE_FILE, actionDateTime=2020-09-04T09:53:43.928+02:00, info=InFo, operationID=operationID, certificateID=certificateid, auditTrailInformation=auditTrails],org.bitrepository.bitrepositoryelements.AuditTrailEvent@4a4ea586[sequenceNumber=3, fileID=fileID1599206023926, reportingComponent=MOCK-AUDIT-MANAGER, actorOnFile=ACTOR, actionOnFile=FAILURE, actionDateTime=2020-09-04T09:53:43.929+02:00, info=InFo, operationID=operationID, certificateID=certificateid, auditTrailInformation=auditTrails],org.bitrepository.bitrepositoryelements.AuditTrailEvent@29333493[sequenceNumber=4, fileID=fileID1599206023926, reportingComponent=MOCK-AUDIT-MANAGER, actorOnFile=ACTOR, actionOnFile=FILE_MOVED, actionDateTime=2020-09-04T09:53:43.929+02:00, info=InFo, operationID=operationID, certificateID=certificateid, auditTrailInformation=auditTrails],org.bitrepository.bitrepositoryelements.AuditTrailEvent@48b193f0[sequenceNumber=5, fileID=fileID1599206023926, reportingComponent=MOCK-AUDIT-MANAGER, actorOnFile=ACTOR, actionOnFile=GET_CHECKSUMS, actionDateTime=2020-09-04T09:53:43.929+02:00, info=InFo, operationID=operationID, certificateID=certificateid, auditTrailInformation=auditTrails]}]], partialResult=true]
        Step: Validate the final response
      Test success: checksumPillarGetAuditTrailsMaximumNumberOfResults
        Added fixture: Initialize a new Pillar.
      Test starting: checksumPillarGetAuditTrailsSpecificRequests
        Description: Tests the GetAuditTrails functionality of the pillar for the successful scenario, where a specific audit trail are requested.
        Step: Set up constants and variables.
        Step: Send the identification request
          Result: Received message on TEST-TOPIC-checksumPillarGetAuditTrailsSpecificRequests-cibuild01 : org.bitrepository.bitrepositorymessages.IdentifyContributorsForGetAuditTrailsResponse@43dd99aa[correlationID=76f0eb08-567b-4922-b7e3-ddb093e557d6, collectionID=TwoPillarCollection, destination=TEST-TOPIC-checksumPillarGetAuditTrailsSpecificRequests-cibuild01, replyTo=TEST-TOPIC-Pillar-checksumPillarGetAuditTrailsSpecificRequests-cibuild01-contributor, from=Pillar-checksumPillarGetAuditTrailsSpecificRequests, to=Pillar-checksumPillarGetAuditTrailsSpecificRequests, version=30, minVersion=24, responseInfo=org.bitrepository.bitrepositoryelements.ResponseInfo@25f0f461[responseCode=IDENTIFICATION_POSITIVE, responseText=<null>(default)]]
        Step: Retrieve and validate the response.
        Step: Make and send the request for the actual GetAuditTrails operation
          Result: Received message on TEST-TOPIC-checksumPillarGetAuditTrailsSpecificRequests-cibuild01 : org.bitrepository.bitrepositorymessages.GetAuditTrailsProgressResponse@2cca0a50[correlationID=76f0eb08-567b-4922-b7e3-ddb093e557d6, collectionID=TwoPillarCollection, destination=TEST-TOPIC-checksumPillarGetAuditTrailsSpecificRequests-cibuild01, replyTo=TEST-TOPIC-Pillar-checksumPillarGetAuditTrailsSpecificRequests-cibuild01-contributor, from=Pillar-checksumPillarGetAuditTrailsSpecificRequests, to=Pillar-checksumPillarGetAuditTrailsSpecificRequests, version=30, minVersion=24, responseInfo=org.bitrepository.bitrepositoryelements.ResponseInfo@375d6aa[responseCode=OPERATION_ACCEPTED_PROGRESS, responseText=Starting to extract the requested audit trails.], contributor=Pillar-checksumPillarGetAuditTrailsSpecificRequests, resultAddress=<null>(default)]
          Result: Received message on TEST-TOPIC-checksumPillarGetAuditTrailsSpecificRequests-cibuild01 : org.bitrepository.bitrepositorymessages.GetAuditTrailsFinalResponse@21846959[correlationID=76f0eb08-567b-4922-b7e3-ddb093e557d6, collectionID=TwoPillarCollection, destination=TEST-TOPIC-checksumPillarGetAuditTrailsSpecificRequests-cibuild01, replyTo=TEST-TOPIC-Pillar-checksumPillarGetAuditTrailsSpecificRequests-cibuild01-contributor, from=Pillar-checksumPillarGetAuditTrailsSpecificRequests, to=Pillar-checksumPillarGetAuditTrailsSpecificRequests, version=30, minVersion=24, responseInfo=org.bitrepository.bitrepositoryelements.ResponseInfo@4e9492b6[responseCode=OPERATION_COMPLETED, responseText=<null>(default)], contributor=Pillar-checksumPillarGetAuditTrailsSpecificRequests, resultingAuditTrails=org.bitrepository.bitrepositoryelements.ResultingAuditTrails@327089be[resultAddress=<null>(default), auditTrailEvents=org.bitrepository.bitrepositoryelements.AuditTrailEvents@1f9dc9dc[auditTrailEvent={org.bitrepository.bitrepositoryelements.AuditTrailEvent@1d51a5d7[sequenceNumber=1, fileID=fileID1599206024147, reportingComponent=MOCK-AUDIT-MANAGER, actorOnFile=ACTOR, actionOnFile=OTHER, actionDateTime=2020-09-04T09:53:44.147+02:00, info=InFo, operationID=operationID, certificateID=certificateid, auditTrailInformation=auditTrails]}]], partialResult=false]
        Step: Receive and validate the progress response.
        Step: Receive and validate the final response
        Step: Make another request, where both ingested audit trails is requested
          Result: Received message on TEST-TOPIC-checksumPillarGetAuditTrailsSpecificRequests-cibuild01 : org.bitrepository.bitrepositorymessages.GetAuditTrailsProgressResponse@77ba85e9[correlationID=76f0eb08-567b-4922-b7e3-ddb093e557d6, collectionID=TwoPillarCollection, destination=TEST-TOPIC-checksumPillarGetAuditTrailsSpecificRequests-cibuild01, replyTo=TEST-TOPIC-Pillar-checksumPillarGetAuditTrailsSpecificRequests-cibuild01-contributor, from=Pillar-checksumPillarGetAuditTrailsSpecificRequests, to=Pillar-checksumPillarGetAuditTrailsSpecificRequests, version=30, minVersion=24, responseInfo=org.bitrepository.bitrepositoryelements.ResponseInfo@4131dfd9[responseCode=OPERATION_ACCEPTED_PROGRESS, responseText=Starting to extract the requested audit trails.], contributor=Pillar-checksumPillarGetAuditTrailsSpecificRequests, resultAddress=<null>(default)]
          Result: Received message on TEST-TOPIC-checksumPillarGetAuditTrailsSpecificRequests-cibuild01 : org.bitrepository.bitrepositorymessages.GetAuditTrailsFinalResponse@30132d0a[correlationID=76f0eb08-567b-4922-b7e3-ddb093e557d6, collectionID=TwoPillarCollection, destination=TEST-TOPIC-checksumPillarGetAuditTrailsSpecificRequests-cibuild01, replyTo=TEST-TOPIC-Pillar-checksumPillarGetAuditTrailsSpecificRequests-cibuild01-contributor, from=Pillar-checksumPillarGetAuditTrailsSpecificRequests, to=Pillar-checksumPillarGetAuditTrailsSpecificRequests, version=30, minVersion=24, responseInfo=org.bitrepository.bitrepositoryelements.ResponseInfo@20fc59c2[responseCode=OPERATION_COMPLETED, responseText=<null>(default)], contributor=Pillar-checksumPillarGetAuditTrailsSpecificRequests, resultingAuditTrails=org.bitrepository.bitrepositoryelements.ResultingAuditTrails@34a05f9[resultAddress=<null>(default), auditTrailEvents=org.bitrepository.bitrepositoryelements.AuditTrailEvents@4c4add5e[auditTrailEvent={org.bitrepository.bitrepositoryelements.AuditTrailEvent@1d51a5d7[sequenceNumber=1, fileID=fileID1599206024147, reportingComponent=MOCK-AUDIT-MANAGER, actorOnFile=ACTOR, actionOnFile=OTHER, actionDateTime=2020-09-04T09:53:44.147+02:00, info=InFo, operationID=operationID, certificateID=certificateid, auditTrailInformation=auditTrails],org.bitrepository.bitrepositoryelements.AuditTrailEvent@6518c2a0[sequenceNumber=2, fileID=notThisFile, reportingComponent=MOCK-AUDIT-MANAGER, actorOnFile=UnknownActor, actionOnFile=FAILURE, actionDateTime=2020-09-04T09:53:44.147+02:00, info=badInfo, operationID=operationID, certificateID=certificateid, auditTrailInformation=WrongAuditTrail]}]], partialResult=false]
        Step: Receive and validate the progress response.
        Step: Receive and validate the final response
      Test success: checksumPillarGetAuditTrailsSpecificRequests
        Added fixture: Initialize a new Pillar.
      Test starting: checksumPillarGetAuditTrailsSuccessful
        Description: Tests the GetAuditTrails functionality of the pillar for the successful scenario, where all audit trails are requested.
        Step: Set up constants and variables.
        Step: Send the identification request
          Result: Received message on TEST-TOPIC-checksumPillarGetAuditTrailsSuccessful-cibuild01 : org.bitrepository.bitrepositorymessages.IdentifyContributorsForGetAuditTrailsResponse@2eda0ddf[correlationID=be938f57-5a1f-4f31-b8b4-116ed73186be, collectionID=TwoPillarCollection, destination=TEST-TOPIC-checksumPillarGetAuditTrailsSuccessful-cibuild01, replyTo=TEST-TOPIC-Pillar-checksumPillarGetAuditTrailsSuccessful-cibuild01-contributor, from=Pillar-checksumPillarGetAuditTrailsSuccessful, to=Pillar-checksumPillarGetAuditTrailsSuccessful, version=30, minVersion=24, responseInfo=org.bitrepository.bitrepositoryelements.ResponseInfo@368ac303[responseCode=IDENTIFICATION_POSITIVE, responseText=<null>(default)]]
        Step: Make and send the request for the actual GetAuditTrails operation
          Result: Received message on TEST-TOPIC-checksumPillarGetAuditTrailsSuccessful-cibuild01 : org.bitrepository.bitrepositorymessages.GetAuditTrailsProgressResponse@390b4bcc[correlationID=be938f57-5a1f-4f31-b8b4-116ed73186be, collectionID=TwoPillarCollection, destination=TEST-TOPIC-checksumPillarGetAuditTrailsSuccessful-cibuild01, replyTo=TEST-TOPIC-Pillar-checksumPillarGetAuditTrailsSuccessful-cibuild01-contributor, from=Pillar-checksumPillarGetAuditTrailsSuccessful, to=Pillar-checksumPillarGetAuditTrailsSuccessful, version=30, minVersion=24, responseInfo=org.bitrepository.bitrepositoryelements.ResponseInfo@6c087b6a[responseCode=OPERATION_ACCEPTED_PROGRESS, responseText=Starting to extract the requested audit trails.], contributor=Pillar-checksumPillarGetAuditTrailsSuccessful, resultAddress=<null>(default)]
          Result: Received message on TEST-TOPIC-checksumPillarGetAuditTrailsSuccessful-cibuild01 : org.bitrepository.bitrepositorymessages.GetAuditTrailsFinalResponse@124227c1[correlationID=be938f57-5a1f-4f31-b8b4-116ed73186be, collectionID=TwoPillarCollection, destination=TEST-TOPIC-checksumPillarGetAuditTrailsSuccessful-cibuild01, replyTo=TEST-TOPIC-Pillar-checksumPillarGetAuditTrailsSuccessful-cibuild01-contributor, from=Pillar-checksumPillarGetAuditTrailsSuccessful, to=Pillar-checksumPillarGetAuditTrailsSuccessful, version=30, minVersion=24, responseInfo=org.bitrepository.bitrepositoryelements.ResponseInfo@72b06c51[responseCode=OPERATION_COMPLETED, responseText=<null>(default)], contributor=Pillar-checksumPillarGetAuditTrailsSuccessful, resultingAuditTrails=org.bitrepository.bitrepositoryelements.ResultingAuditTrails@11861ce0[resultAddress=<null>(default), auditTrailEvents=org.bitrepository.bitrepositoryelements.AuditTrailEvents@3efae691[auditTrailEvent={org.bitrepository.bitrepositoryelements.AuditTrailEvent@3d85a2a0[sequenceNumber=1, fileID=fileid, reportingComponent=MOCK-AUDIT-MANAGER, actorOnFile=actor, actionOnFile=OTHER, actionDateTime=2020-09-04T09:53:44.324+02:00, info=info, operationID=operationID, certificateID=certificateID, auditTrailInformation=auditTrail]}]], partialResult=false]
        Step: Receive and validate the progress response.
        Step: Receive and validate the final response
      Test success: checksumPillarGetAuditTrailsSuccessful
    Starting testcase PutFileTest
        Added fixture: Initialize a new Pillar.
      Test starting: badCaseIdentification
        Description: Tests the identification for a PutFile operation on the pillar for the failure scenario, when the file already exists.
        Step: Set up constants and variables.
        Step: Setup for already having the file and delivering pillar id
        Step: Create and send the identify request message.
          Result: Received message on TEST-TOPIC-badCaseIdentification-cibuild01 : org.bitrepository.bitrepositorymessages.IdentifyPillarsForPutFileResponse@2e73e513[correlationID=864f6445-3f0b-455c-97fb-bf8892b68fbc, collectionID=TwoPillarCollection, destination=TEST-TOPIC-badCaseIdentification-cibuild01, replyTo=TEST-TOPIC-Pillar-badCaseIdentification-cibuild01-contributor, from=Pillar-badCaseIdentification, to=badCaseIdentification, version=30, minVersion=24, responseInfo=org.bitrepository.bitrepositoryelements.ResponseInfo@12bef203[responseCode=DUPLICATE_FILE_FAILURE, responseText=<null>(default)], pillarID=Pillar-badCaseIdentification, fileID=DefaultFilebadCaseIdentification, pillarChecksumSpec=<null>(default), checksumDataForExistingFile=<null>(default), timeToDeliver=org.bitrepository.bitrepositoryelements.TimeMeasureTYPE@5ab2d78[timeMeasureUnit=MILLISECONDS, timeMeasureValue=1000]]
        Step: Retrieve and validate the response getPillarID() the pillar.
      Test success: badCaseIdentification
        Added fixture: Initialize a new Pillar.
      Test starting: badCaseOperationFileAlreadyExists
        Description: Tests the PutFile operation on the pillar for the failure scenario, when the file already exists.
        Step: Set up constants and variables.
        Step: Setup for already having the file and delivering pillar id
        Step: Create and send the identify request message.
          Result: Received message on TEST-TOPIC-badCaseOperationFileAlreadyExists-cibuild01 : org.bitrepository.bitrepositorymessages.PutFileFinalResponse@10faa55c[correlationID=b26d99f7-e612-473f-b578-f78db808e70c, collectionID=TwoPillarCollection, destination=TEST-TOPIC-badCaseOperationFileAlreadyExists-cibuild01, replyTo=TEST-TOPIC-Pillar-badCaseOperationFileAlreadyExists-cibuild01-contributor, from=Pillar-badCaseOperationFileAlreadyExists, to=badCaseOperationFileAlreadyExists, version=30, minVersion=24, responseInfo=org.bitrepository.bitrepositoryelements.ResponseInfo@74ce5fe3[responseCode=DUPLICATE_FILE_FAILURE, responseText=We already have the file], pillarID=Pillar-badCaseOperationFileAlreadyExists, pillarChecksumSpec=<null>(default), fileID=DefaultFilebadCaseOperationFileAlreadyExists, fileAddress=file:../bitrepository-core/src/test/resources/test-files//default-test-file.txt, checksumDataForNewFile=<null>(default), checksumDataForExistingFile=<null>(default)]
        Step: Retrieve the FinalResponse for the PutFile request
      Test success: badCaseOperationFileAlreadyExists
        Added fixture: Initialize a new Pillar.
      Test starting: badCasePutOperationNoValidationChecksum
        Description: Tests the PutFile operation on the pillar for the failure scenario, when no validation checksum is given but required.
        Step: Set up constants and variables.
        Step: Setup for not already having the file and delivering pillar id
        Step: Create and send the identify request message.
          Result: Received message on TEST-TOPIC-badCasePutOperationNoValidationChecksum-cibuild01 : org.bitrepository.bitrepositorymessages.PutFileFinalResponse@42d6568e[correlationID=5b1db822-3e56-4dfa-b747-5d7f811feaf9, collectionID=TwoPillarCollection, destination=TEST-TOPIC-badCasePutOperationNoValidationChecksum-cibuild01, replyTo=TEST-TOPIC-Pillar-badCasePutOperationNoValidationChecksum-cibuild01-contributor, from=Pillar-badCasePutOperationNoValidationChecksum, to=badCasePutOperationNoValidationChecksum, version=30, minVersion=24, responseInfo=org.bitrepository.bitrepositoryelements.ResponseInfo@26a290a9[responseCode=NEW_FILE_CHECKSUM_FAILURE, responseText=A checksum is required for the PutFile operation to be performed.], pillarID=Pillar-badCasePutOperationNoValidationChecksum, pillarChecksumSpec=<null>(default), fileID=DefaultFilebadCasePutOperationNoValidationChecksum, fileAddress=file:../bitrepository-core/src/test/resources/test-files//default-test-file.txt, checksumDataForNewFile=<null>(default), checksumDataForExistingFile=<null>(default)]
09:53:46.893 WARN  o.b.p.common.PillarAlarmDispatcher - Sending alarm: org.bitrepository.bitrepositoryelements.Alarm@1ddd957e[origDateTime=2020-09-04T09:53:46.892+02:00, alarmCode=CHECKSUM_ALARM, alarmRaiser=Pillar-badCasePutOperationNoValidationChecksum, alarmText=A checksum is required for the PutFile operation to be performed., fileID=DefaultFilebadCasePutOperationNoValidationChecksum, collectionID=TwoPillarCollection]
          Result: Received message on TEST-ALARM-TOPIC-cibuild01 : org.bitrepository.bitrepositorymessages.AlarmMessage@118f091e[correlationID=f9f36f46-b78b-4002-a385-b25edbc32778, collectionID=TwoPillarCollection, destination=TEST-ALARM-TOPIC-cibuild01, replyTo=TEST-TOPIC-Pillar-badCasePutOperationNoValidationChecksum-cibuild01-contributor, from=Pillar-badCasePutOperationNoValidationChecksum, to=<null>(default), version=30, minVersion=24, alarm=org.bitrepository.bitrepositoryelements.Alarm@1ddd957e[origDateTime=2020-09-04T09:53:46.892+02:00, alarmCode=CHECKSUM_ALARM, alarmRaiser=Pillar-badCasePutOperationNoValidationChecksum, alarmText=A checksum is required for the PutFile operation to be performed., fileID=DefaultFilebadCasePutOperationNoValidationChecksum, collectionID=TwoPillarCollection]]
        Step: Retrieve the FinalResponse for the PutFile request
        Step: Pillar should have sent an alarm
      Test success: badCasePutOperationNoValidationChecksum
        Added fixture: Initialize a new Pillar.
      Test starting: goodCaseIdentification
        Description: Tests the identification for a PutFile operation on the pillar for the successful scenario.
        Step: Set up constants and variables.
        Step: Setup for not already having the file and delivering pillar id
        Step: Create and send the identify request message.
          Result: Received message on TEST-TOPIC-goodCaseIdentification-cibuild01 : org.bitrepository.bitrepositorymessages.IdentifyPillarsForPutFileResponse@64d0f697[correlationID=65cce0f8-2f00-4148-8cce-176c9b3f3b7a, collectionID=TwoPillarCollection, destination=TEST-TOPIC-goodCaseIdentification-cibuild01, replyTo=TEST-TOPIC-Pillar-goodCaseIdentification-cibuild01-contributor, from=Pillar-goodCaseIdentification, to=goodCaseIdentification, version=30, minVersion=24, responseInfo=org.bitrepository.bitrepositoryelements.ResponseInfo@10d9212b[responseCode=IDENTIFICATION_POSITIVE, responseText=Operation acknowledged and accepted.], pillarID=Pillar-goodCaseIdentification, fileID=DefaultFilegoodCaseIdentification, pillarChecksumSpec=<null>(default), checksumDataForExistingFile=<null>(default), timeToDeliver=org.bitrepository.bitrepositoryelements.TimeMeasureTYPE@691c6395[timeMeasureUnit=MILLISECONDS, timeMeasureValue=1000]]
        Step: Retrieve and validate the response getPillarID() the pillar.
      Test success: goodCaseIdentification
        Added fixture: Initialize a new Pillar.
      Test starting: goodCaseOperationWithChecksumReturn
        Description: Tests the PutFile operation on the pillar for the success scenario, when requesting the cheksum of the file returned.
        Step: Set up constants and variables.
        Step: Setup for not already having the file and delivering pillar id, and delivering an answer for the checksum request
        Step: Create and send the identify request message.
          Result: Received message on TEST-TOPIC-goodCaseOperationWithChecksumReturn-cibuild01 : org.bitrepository.bitrepositorymessages.PutFileProgressResponse@63b334dc[correlationID=a63a87dd-2bc5-4f55-93ff-72fae5908e7a, collectionID=TwoPillarCollection, destination=TEST-TOPIC-goodCaseOperationWithChecksumReturn-cibuild01, replyTo=TEST-TOPIC-Pillar-goodCaseOperationWithChecksumReturn-cibuild01-contributor, from=Pillar-goodCaseOperationWithChecksumReturn, to=goodCaseOperationWithChecksumReturn, version=30, minVersion=24, responseInfo=org.bitrepository.bitrepositoryelements.ResponseInfo@6fa3905b[responseCode=OPERATION_ACCEPTED_PROGRESS, responseText=Started to receive data.], pillarID=Pillar-goodCaseOperationWithChecksumReturn, pillarChecksumSpec=<null>(default), fileID=DefaultFilegoodCaseOperationWithChecksumReturn, fileAddress=file:../bitrepository-core/src/test/resources/test-files//default-test-file.txt]
          Result: Received message on TEST-TOPIC-goodCaseOperationWithChecksumReturn-cibuild01 : org.bitrepository.bitrepositorymessages.PutFileFinalResponse@2dacbd55[correlationID=a63a87dd-2bc5-4f55-93ff-72fae5908e7a, collectionID=TwoPillarCollection, destination=TEST-TOPIC-goodCaseOperationWithChecksumReturn-cibuild01, replyTo=TEST-TOPIC-Pillar-goodCaseOperationWithChecksumReturn-cibuild01-contributor, from=Pillar-goodCaseOperationWithChecksumReturn, to=goodCaseOperationWithChecksumReturn, version=30, minVersion=24, responseInfo=org.bitrepository.bitrepositoryelements.ResponseInfo@57c369e8[responseCode=OPERATION_COMPLETED, responseText=<null>(default)], pillarID=Pillar-goodCaseOperationWithChecksumReturn, pillarChecksumSpec=<null>(default), fileID=DefaultFilegoodCaseOperationWithChecksumReturn, fileAddress=file:../bitrepository-core/src/test/resources/test-files//default-test-file.txt, checksumDataForNewFile=org.bitrepository.bitrepositoryelements.ChecksumDataForFileTYPE@24111a03[checksumSpec=org.bitrepository.bitrepositoryelements.ChecksumSpecTYPE@1a4f2755[checksumType=MD5, checksumSalt=<null>(default), otherChecksumType=<null>(default)], checksumValue={18,52,-52,-52,-52,-52,67,33}, calculationTimestamp=2020-09-04T09:53:48.231+02:00], checksumDataForExistingFile=<null>(default)]
        Step: Retrieve the ProgressResponse for the GetFileIDs request
        Step: Retrieve the FinalResponse for the PutFile request
      Test success: goodCaseOperationWithChecksumReturn
    Starting testcase ReplaceFileTest
        Added fixture: Initialize a new Pillar.
      Test starting: badCaseIdentification
        Description: Tests the identification for a ReplaceFile operation on the pillar for the failure scenario, when the file does not exist.
        Step: Set up constants and variables.
        Step: Setup for not having the file and delivering pillar id
        Step: Create and send the identify request message.
          Result: Received message on TEST-TOPIC-badCaseIdentification-cibuild01 : org.bitrepository.bitrepositorymessages.IdentifyPillarsForReplaceFileResponse@2108400a[correlationID=f9a4ff12-11da-475d-b8e8-5c7c4e39b826, collectionID=TwoPillarCollection, destination=TEST-TOPIC-badCaseIdentification-cibuild01, replyTo=TEST-TOPIC-Pillar-badCaseIdentification-cibuild01-contributor, from=Pillar-badCaseIdentification, to=badCaseIdentification, version=30, minVersion=24, responseInfo=org.bitrepository.bitrepositoryelements.ResponseInfo@2dd3bed7[responseCode=FILE_NOT_FOUND_FAILURE, responseText=Could not find the requested file to delete.], fileID=DefaultFile, pillarID=Pillar-badCaseIdentification, pillarChecksumSpec=<null>(default), timeToDeliver=<null>(default)]
        Step: Retrieve and validate the response getPillarID() the pillar.
      Test success: badCaseIdentification
        Added fixture: Initialize a new Pillar.
      Test starting: badCaseOperationMissingFile
        Description: Tests the ReplaceFile operation on the pillar for the failure scenario, when the file is missing.
        Step: Set up constants and variables.
        Step: Setup for not having the file and delivering pillar id
        Step: Create and send the identify request message.
          Result: Received message on TEST-TOPIC-badCaseOperationMissingFile-cibuild01 : org.bitrepository.bitrepositorymessages.ReplaceFileFinalResponse@714fc0ad[correlationID=a579e3d5-32b9-4fc4-993b-182a1f4e3be3, collectionID=TwoPillarCollection, destination=TEST-TOPIC-badCaseOperationMissingFile-cibuild01, replyTo=TEST-TOPIC-Pillar-badCaseOperationMissingFile-cibuild01-contributor, from=Pillar-badCaseOperationMissingFile, to=badCaseOperationMissingFile, version=30, minVersion=24, responseInfo=org.bitrepository.bitrepositoryelements.ResponseInfo@4b5ec80a[responseCode=FILE_NOT_FOUND_FAILURE, responseText=The file 'DefaultFile' has been requested, but we do not have that file!], pillarID=Pillar-badCaseOperationMissingFile, pillarChecksumSpec=<null>(default), fileID=DefaultFile, fileAddress=file:../bitrepository-core/src/test/resources/test-files//default-test-file.txt, checksumDataForExistingFile=<null>(default), checksumDataForNewFile=<null>(default)]
        Step: Retrieve the FinalResponse for the ReplaceFile request
      Test success: badCaseOperationMissingFile
        Added fixture: Initialize a new Pillar.
      Test starting: badCaseOperationNoDestructiveChecksum
        Description: Tests the ReplaceFile operation on the pillar for the failure scenario, when no validation checksum is given for the destructive action, but though is required.
        Step: Set up constants and variables.
        Step: Setup for having the file and delivering pillar id
        Step: Create and send the identify request message.
          Result: Received message on TEST-TOPIC-badCaseOperationNoDestructiveChecksum-cibuild01 : org.bitrepository.bitrepositorymessages.ReplaceFileFinalResponse@2e798b8f[correlationID=6f7b2e10-8f3e-460f-8930-847c81e573b1, collectionID=TwoPillarCollection, destination=TEST-TOPIC-badCaseOperationNoDestructiveChecksum-cibuild01, replyTo=TEST-TOPIC-Pillar-badCaseOperationNoDestructiveChecksum-cibuild01-contributor, from=Pillar-badCaseOperationNoDestructiveChecksum, to=badCaseOperationNoDestructiveChecksum, version=30, minVersion=24, responseInfo=org.bitrepository.bitrepositoryelements.ResponseInfo@28408ad7[responseCode=EXISTING_FILE_CHECKSUM_FAILURE, responseText=According to the contract a checksum for file to be deleted during the replacing operation is required.], pillarID=Pillar-badCaseOperationNoDestructiveChecksum, pillarChecksumSpec=<null>(default), fileID=DefaultFile, fileAddress=file:../bitrepository-core/src/test/resources/test-files//default-test-file.txt, checksumDataForExistingFile=<null>(default), checksumDataForNewFile=<null>(default)]
09:53:51.769 WARN  o.b.p.common.PillarAlarmDispatcher - Sending alarm: org.bitrepository.bitrepositoryelements.Alarm@6e1d2e9f[origDateTime=2020-09-04T09:53:51.769+02:00, alarmCode=CHECKSUM_ALARM, alarmRaiser=Pillar-badCaseOperationNoDestructiveChecksum, alarmText=According to the contract a checksum for file to be deleted during the replacing operation is required., fileID=DefaultFile, collectionID=TwoPillarCollection]
          Result: Received message on TEST-ALARM-TOPIC-cibuild01 : org.bitrepository.bitrepositorymessages.AlarmMessage@273db89c[correlationID=5b917b07-c8f0-4335-9d07-a72e6007bb7e, collectionID=TwoPillarCollection, destination=TEST-ALARM-TOPIC-cibuild01, replyTo=TEST-TOPIC-Pillar-badCaseOperationNoDestructiveChecksum-cibuild01-contributor, from=Pillar-badCaseOperationNoDestructiveChecksum, to=<null>(default), version=30, minVersion=24, alarm=org.bitrepository.bitrepositoryelements.Alarm@6e1d2e9f[origDateTime=2020-09-04T09:53:51.769+02:00, alarmCode=CHECKSUM_ALARM, alarmRaiser=Pillar-badCaseOperationNoDestructiveChecksum, alarmText=According to the contract a checksum for file to be deleted during the replacing operation is required., fileID=DefaultFile, collectionID=TwoPillarCollection]]
        Step: Retrieve the FinalResponse for the ReplaceFile request
        Step: Pillar should have sent an alarm
      Test success: badCaseOperationNoDestructiveChecksum
        Added fixture: Initialize a new Pillar.
      Test starting: badCaseOperationNoValidationChecksum
        Description: Tests the ReplaceFile operation on the pillar for the failure scenario, when no validation checksum is given for the new file, but though is required.
        Step: Set up constants and variables.
        Step: Setup for having the file and delivering pillar id
        Step: Create and send the identify request message.
          Result: Received message on TEST-TOPIC-badCaseOperationNoValidationChecksum-cibuild01 : org.bitrepository.bitrepositorymessages.ReplaceFileFinalResponse@7a832fdb[correlationID=d0ef9bee-56af-45d1-a6a6-ebd8651430c8, collectionID=TwoPillarCollection, destination=TEST-TOPIC-badCaseOperationNoValidationChecksum-cibuild01, replyTo=TEST-TOPIC-Pillar-badCaseOperationNoValidationChecksum-cibuild01-contributor, from=Pillar-badCaseOperationNoValidationChecksum, to=badCaseOperationNoValidationChecksum, version=30, minVersion=24, responseInfo=org.bitrepository.bitrepositoryelements.ResponseInfo@356a99a2[responseCode=NEW_FILE_CHECKSUM_FAILURE, responseText=According to the contract a checksum for new file in the replacing operation is required.], pillarID=Pillar-badCaseOperationNoValidationChecksum, pillarChecksumSpec=<null>(default), fileID=DefaultFile, fileAddress=file:../bitrepository-core/src/test/resources/test-files//default-test-file.txt, checksumDataForExistingFile=<null>(default), checksumDataForNewFile=<null>(default)]
09:53:51.946 WARN  o.b.p.common.PillarAlarmDispatcher - Sending alarm: org.bitrepository.bitrepositoryelements.Alarm@7743ceda[origDateTime=2020-09-04T09:53:51.945+02:00, alarmCode=CHECKSUM_ALARM, alarmRaiser=Pillar-badCaseOperationNoValidationChecksum, alarmText=According to the contract a checksum for new file in the replacing operation is required., fileID=DefaultFile, collectionID=TwoPillarCollection]
          Result: Received message on TEST-ALARM-TOPIC-cibuild01 : org.bitrepository.bitrepositorymessages.AlarmMessage@5c1735bd[correlationID=a8752b0c-cc06-4678-9714-95e7fc15c7ad, collectionID=TwoPillarCollection, destination=TEST-ALARM-TOPIC-cibuild01, replyTo=TEST-TOPIC-Pillar-badCaseOperationNoValidationChecksum-cibuild01-contributor, from=Pillar-badCaseOperationNoValidationChecksum, to=<null>(default), version=30, minVersion=24, alarm=org.bitrepository.bitrepositoryelements.Alarm@7743ceda[origDateTime=2020-09-04T09:53:51.945+02:00, alarmCode=CHECKSUM_ALARM, alarmRaiser=Pillar-badCaseOperationNoValidationChecksum, alarmText=According to the contract a checksum for new file in the replacing operation is required., fileID=DefaultFile, collectionID=TwoPillarCollection]]
        Step: Retrieve the FinalResponse for the ReplaceFile request
        Step: Pillar should have sent an alarm
      Test success: badCaseOperationNoValidationChecksum
        Added fixture: Initialize a new Pillar.
      Test starting: badCaseOperationWrongDestructiveChecksum
        Description: Tests the ReplaceFile operation on the pillar for the failure scenario, when the checksum for the destructive action is different from the one in the cache.
        Step: Set up constants and variables.
        Step: Setup for having the file and delivering pillar id
        Step: Create and send the identify request message.
09:53:52.074 WARN  o.b.p.m.ReplaceFileRequestHandler - Failed to handle replace operation on file 'DefaultFile' since the request had the checksum '1234cccccccc4321' where our local file has the value '1234cccccccc4322'. Sending alarm and respond failure.
          Result: Received message on TEST-TOPIC-badCaseOperationWrongDestructiveChecksum-cibuild01 : org.bitrepository.bitrepositorymessages.ReplaceFileFinalResponse@47875773[correlationID=f4f4090f-e366-427b-8d54-4e825c3eb744, collectionID=TwoPillarCollection, destination=TEST-TOPIC-badCaseOperationWrongDestructiveChecksum-cibuild01, replyTo=TEST-TOPIC-Pillar-badCaseOperationWrongDestructiveChecksum-cibuild01-contributor, from=Pillar-badCaseOperationWrongDestructiveChecksum, to=badCaseOperationWrongDestructiveChecksum, version=30, minVersion=24, responseInfo=org.bitrepository.bitrepositoryelements.ResponseInfo@39c5f774[responseCode=EXISTING_FILE_CHECKSUM_FAILURE, responseText=Requested to replace the file 'DefaultFile' with checksum '1234cccccccc4321', but our file had a different checksum.], pillarID=Pillar-badCaseOperationWrongDestructiveChecksum, pillarChecksumSpec=<null>(default), fileID=DefaultFile, fileAddress=file:../bitrepository-core/src/test/resources/test-files//default-test-file.txt, checksumDataForExistingFile=<null>(default), checksumDataForNewFile=<null>(default)]
09:53:52.076 WARN  o.b.p.common.PillarAlarmDispatcher - Sending alarm: org.bitrepository.bitrepositoryelements.Alarm@1b6b391c[origDateTime=2020-09-04T09:53:52.075+02:00, alarmCode=CHECKSUM_ALARM, alarmRaiser=Pillar-badCaseOperationWrongDestructiveChecksum, alarmText=Requested to replace the file 'DefaultFile' with checksum '1234cccccccc4321', but our file had a different checksum., fileID=DefaultFile, collectionID=TwoPillarCollection]
          Result: Received message on TEST-ALARM-TOPIC-cibuild01 : org.bitrepository.bitrepositorymessages.AlarmMessage@37f7c2af[correlationID=3225b9a6-fc4a-4038-9144-f25885890e4b, collectionID=TwoPillarCollection, destination=TEST-ALARM-TOPIC-cibuild01, replyTo=TEST-TOPIC-Pillar-badCaseOperationWrongDestructiveChecksum-cibuild01-contributor, from=Pillar-badCaseOperationWrongDestructiveChecksum, to=<null>(default), version=30, minVersion=24, alarm=org.bitrepository.bitrepositoryelements.Alarm@1b6b391c[origDateTime=2020-09-04T09:53:52.075+02:00, alarmCode=CHECKSUM_ALARM, alarmRaiser=Pillar-badCaseOperationWrongDestructiveChecksum, alarmText=Requested to replace the file 'DefaultFile' with checksum '1234cccccccc4321', but our file had a different checksum., fileID=DefaultFile, collectionID=TwoPillarCollection]]
        Step: Retrieve the FinalResponse for the ReplaceFile request
        Step: Pillar should have sent an alarm
      Test success: badCaseOperationWrongDestructiveChecksum
        Added fixture: Initialize a new Pillar.
      Test starting: goodCaseIdentification
        Description: Tests the identification for a ReplaceFile operation on the pillar for the successful scenario.
        Step: Set up constants and variables.
        Step: Setup for having the file and delivering pillar id
        Step: Create and send the identify request message.
          Result: Received message on TEST-TOPIC-goodCaseIdentification-cibuild01 : org.bitrepository.bitrepositorymessages.IdentifyPillarsForReplaceFileResponse@13f86c89[correlationID=4bc08e4b-6ff3-4ef7-b0e2-156763c1e037, collectionID=TwoPillarCollection, destination=TEST-TOPIC-goodCaseIdentification-cibuild01, replyTo=TEST-TOPIC-Pillar-goodCaseIdentification-cibuild01-contributor, from=Pillar-goodCaseIdentification, to=goodCaseIdentification, version=30, minVersion=24, responseInfo=org.bitrepository.bitrepositoryelements.ResponseInfo@5ca5dea1[responseCode=IDENTIFICATION_POSITIVE, responseText=Operation acknowledged and accepted.], fileID=DefaultFile, pillarID=Pillar-goodCaseIdentification, pillarChecksumSpec=<null>(default), timeToDeliver=org.bitrepository.bitrepositoryelements.TimeMeasureTYPE@33d394e7[timeMeasureUnit=MILLISECONDS, timeMeasureValue=1000]]
        Step: Retrieve and validate the response getPillarID() the pillar.
      Test success: goodCaseIdentification
        Added fixture: Initialize a new Pillar.
      Test starting: goodCaseOperation
        Description: Tests the ReplaceFile operation on the pillar for the success scenario.
        Step: Set up constants and variables.
        Step: Setup for already having the file and delivering pillar id
        Step: Create and send the identify request message.
          Result: Received message on TEST-TOPIC-goodCaseOperation-cibuild01 : org.bitrepository.bitrepositorymessages.ReplaceFileProgressResponse@3bfc4070[correlationID=0b6c218e-b0c7-42bb-b6a5-0db1d6b67832, collectionID=TwoPillarCollection, destination=TEST-TOPIC-goodCaseOperation-cibuild01, replyTo=TEST-TOPIC-Pillar-goodCaseOperation-cibuild01-contributor, from=Pillar-goodCaseOperation, to=goodCaseOperation, version=30, minVersion=24, responseInfo=org.bitrepository.bitrepositoryelements.ResponseInfo@7f7d7f5d[responseCode=OPERATION_ACCEPTED_PROGRESS, responseText=Performing the ReplaceFileRequest for file 'DefaultFile' at 'TwoPillarCollection'.], pillarID=Pillar-goodCaseOperation, pillarChecksumSpec=<null>(default), fileID=DefaultFile, fileAddress=file:../bitrepository-core/src/test/resources/test-files//default-test-file.txt]
          Result: Received message on TEST-TOPIC-goodCaseOperation-cibuild01 : org.bitrepository.bitrepositorymessages.ReplaceFileFinalResponse@63b3463e[correlationID=0b6c218e-b0c7-42bb-b6a5-0db1d6b67832, collectionID=TwoPillarCollection, destination=TEST-TOPIC-goodCaseOperation-cibuild01, replyTo=TEST-TOPIC-Pillar-goodCaseOperation-cibuild01-contributor, from=Pillar-goodCaseOperation, to=goodCaseOperation, version=30, minVersion=24, responseInfo=org.bitrepository.bitrepositoryelements.ResponseInfo@3a1575f8[responseCode=OPERATION_COMPLETED, responseText=<null>(default)], pillarID=Pillar-goodCaseOperation, pillarChecksumSpec=<null>(default), fileID=DefaultFile, fileAddress=file:../bitrepository-core/src/test/resources/test-files//default-test-file.txt, checksumDataForExistingFile=<null>(default), checksumDataForNewFile=<null>(default)]
        Step: Retrieve the ProgressResponse for the GetFileIDs request
        Step: Retrieve the FinalResponse for the ReplaceFile request
      Test success: goodCaseOperation
        Added fixture: Initialize a new Pillar.
      Test starting: goodCaseOperationWithChecksumsReturn
        Description: Tests the ReplaceFile operation on the pillar for the success scenario, when requesting both the cheksums of the file returned.
        Step: Set up constants and variables.
        Step: Setup for already having the file and delivering pillar id
        Step: Create and send the identify request message.
          Result: Received message on TEST-TOPIC-goodCaseOperationWithChecksumsReturn-cibuild01 : org.bitrepository.bitrepositorymessages.ReplaceFileProgressResponse@1cac9b74[correlationID=fba1e5ee-c916-4053-a3bd-8151d8d2312e, collectionID=TwoPillarCollection, destination=TEST-TOPIC-goodCaseOperationWithChecksumsReturn-cibuild01, replyTo=TEST-TOPIC-Pillar-goodCaseOperationWithChecksumsReturn-cibuild01-contributor, from=Pillar-goodCaseOperationWithChecksumsReturn, to=goodCaseOperationWithChecksumsReturn, version=30, minVersion=24, responseInfo=org.bitrepository.bitrepositoryelements.ResponseInfo@44dcc583[responseCode=OPERATION_ACCEPTED_PROGRESS, responseText=Performing the ReplaceFileRequest for file 'DefaultFile' at 'TwoPillarCollection'.], pillarID=Pillar-goodCaseOperationWithChecksumsReturn, pillarChecksumSpec=<null>(default), fileID=DefaultFile, fileAddress=file:../bitrepository-core/src/test/resources/test-files//default-test-file.txt]
          Result: Received message on TEST-TOPIC-goodCaseOperationWithChecksumsReturn-cibuild01 : org.bitrepository.bitrepositorymessages.ReplaceFileFinalResponse@7f65c882[correlationID=fba1e5ee-c916-4053-a3bd-8151d8d2312e, collectionID=TwoPillarCollection, destination=TEST-TOPIC-goodCaseOperationWithChecksumsReturn-cibuild01, replyTo=TEST-TOPIC-Pillar-goodCaseOperationWithChecksumsReturn-cibuild01-contributor, from=Pillar-goodCaseOperationWithChecksumsReturn, to=goodCaseOperationWithChecksumsReturn, version=30, minVersion=24, responseInfo=org.bitrepository.bitrepositoryelements.ResponseInfo@54d12021[responseCode=OPERATION_COMPLETED, responseText=<null>(default)], pillarID=Pillar-goodCaseOperationWithChecksumsReturn, pillarChecksumSpec=<null>(default), fileID=DefaultFile, fileAddress=file:../bitrepository-core/src/test/resources/test-files//default-test-file.txt, checksumDataForExistingFile=org.bitrepository.bitrepositoryelements.ChecksumDataForFileTYPE@2cde66f4[checksumSpec=org.bitrepository.bitrepositoryelements.ChecksumSpecTYPE@e0c4e31[checksumType=HMAC_SHA512, checksumSalt={97,98}, otherChecksumType=<null>(default)], checksumValue={18,52,-52,-52,-52,-52,67,34}, calculationTimestamp=2020-09-04T09:53:54.484+02:00], checksumDataForNewFile=org.bitrepository.bitrepositoryelements.ChecksumDataForFileTYPE@5ffcb6aa[checksumSpec=org.bitrepository.bitrepositoryelements.ChecksumSpecTYPE@2f1555c[checksumType=MD5, checksumSalt=<null>(default), otherChecksumType=<null>(default)], checksumValue={18,52,-52,-52,-52,-52,67,33}, calculationTimestamp=2020-09-04T09:53:54.485+02:00]]
        Step: Retrieve the ProgressResponse for the GetFileIDs request
        Step: Retrieve the FinalResponse for the ReplaceFile request
      Test success: goodCaseOperationWithChecksumsReturn
      Finished testcase
  Finished suite
Finished project
[INFO] Tests run: 72, Failures: 0, Errors: 0, Skipped: 0, Time elapsed: 48.682 s - in TestSuite
[INFO] 
[INFO] Results:
[INFO] 
[INFO] Tests run: 72, Failures: 0, Errors: 0, Skipped: 0
[INFO] 
[JENKINS] Recording test results
[INFO] 
[INFO] --- jacoco-maven-plugin:0.8.5:report (report) @ bitrepository-reference-pillar ---
[INFO] Loading execution data file /home/cibuild01/workspace/Bitrepository-reference-test/bitrepository-reference-pillar/target/jacoco.exec
[INFO] Analyzed bundle 'Bitrepository Reference Pillar' with 41 classes
[INFO] 
[INFO] --- maven-jar-plugin:3.2.0:jar (default-jar) @ bitrepository-reference-pillar ---
[INFO] Building jar: /home/cibuild01/workspace/Bitrepository-reference-test/bitrepository-reference-pillar/target/bitrepository-reference-pillar-1.10-SNAPSHOT.jar
[INFO] 
[INFO] --- maven-jar-plugin:3.2.0:test-jar (default) @ bitrepository-reference-pillar ---
[INFO] Building jar: /home/cibuild01/workspace/Bitrepository-reference-test/bitrepository-reference-pillar/target/bitrepository-reference-pillar-1.10-SNAPSHOT-tests.jar
[INFO] 
[INFO] --- maven-source-plugin:3.2.1:jar-no-fork (attach-sources-no-fork) @ bitrepository-reference-pillar ---
[INFO] Building jar: /home/cibuild01/workspace/Bitrepository-reference-test/bitrepository-reference-pillar/target/bitrepository-reference-pillar-1.10-SNAPSHOT-sources.jar
[INFO] 
[INFO] --- maven-assembly-plugin:3.3.0:single (distribution) @ bitrepository-reference-pillar ---
[INFO] Reading assembly descriptor: src/main/assembly/assembly.xml
[INFO] Reading assembly descriptor: src/test/assembly/assembly.xml
[INFO] Reading assembly descriptor: src/main/assembly/deploy-assembly.xml
[INFO] Reading assembly descriptor: src/test/assembly/test-deploy-assembly.xml
[INFO] Building tar: /home/cibuild01/workspace/Bitrepository-reference-test/bitrepository-reference-pillar/target/bitrepository-reference-pillar-1.10-SNAPSHOT-distribution.tar.gz
[INFO] Building tar: /home/cibuild01/workspace/Bitrepository-reference-test/bitrepository-reference-pillar/target/bitrepository-reference-pillar-1.10-SNAPSHOT-acceptance-test.tar.gz
[WARNING] Entry: bitrepository-reference-pillar-1.10-SNAPSHOT/lib/bitrepository-reference-pillar-1.10-SNAPSHOT-tests.jar longer than 100 characters.
[WARNING] Resulting tar file can only be processed successfully by GNU compatible tar commands
[WARNING] Entry: bitrepository-reference-pillar-1.10-SNAPSHOT/lib/listenablefuture-9999.0-empty-to-avoid-conflict-with-guava.jar longer than 100 characters.
[INFO] Building tar: /home/cibuild01/workspace/Bitrepository-reference-test/bitrepository-reference-pillar/target/bitrepository-reference-pillar-1.10-SNAPSHOT-deploy.tar.gz
[INFO] Building tar: /home/cibuild01/workspace/Bitrepository-reference-test/bitrepository-reference-pillar/target/bitrepository-reference-pillar-1.10-SNAPSHOT-acceptance-test-deploy.tar.gz
[INFO] 
[INFO] --- maven-install-plugin:3.0.0-M1:install (default-install) @ bitrepository-reference-pillar ---
[INFO] Installing /home/cibuild01/workspace/Bitrepository-reference-test/bitrepository-reference-pillar/target/bitrepository-reference-pillar-1.10-SNAPSHOT.jar to /home/cibuild01/.m2/repository/org/bitrepository/reference/bitrepository-reference-pillar/1.10-SNAPSHOT/bitrepository-reference-pillar-1.10-SNAPSHOT.jar
[INFO] Installing /home/cibuild01/workspace/Bitrepository-reference-test/bitrepository-reference-pillar/pom.xml to /home/cibuild01/.m2/repository/org/bitrepository/reference/bitrepository-reference-pillar/1.10-SNAPSHOT/bitrepository-reference-pillar-1.10-SNAPSHOT.pom
[INFO] Installing /home/cibuild01/workspace/Bitrepository-reference-test/bitrepository-reference-pillar/target/bitrepository-reference-pillar-1.10-SNAPSHOT-tests.jar to /home/cibuild01/.m2/repository/org/bitrepository/reference/bitrepository-reference-pillar/1.10-SNAPSHOT/bitrepository-reference-pillar-1.10-SNAPSHOT-tests.jar
[INFO] Installing /home/cibuild01/workspace/Bitrepository-reference-test/bitrepository-reference-pillar/target/bitrepository-reference-pillar-1.10-SNAPSHOT-sources.jar to /home/cibuild01/.m2/repository/org/bitrepository/reference/bitrepository-reference-pillar/1.10-SNAPSHOT/bitrepository-reference-pillar-1.10-SNAPSHOT-sources.jar
[INFO] Installing /home/cibuild01/workspace/Bitrepository-reference-test/bitrepository-reference-pillar/target/bitrepository-reference-pillar-1.10-SNAPSHOT-distribution.tar.gz to /home/cibuild01/.m2/repository/org/bitrepository/reference/bitrepository-reference-pillar/1.10-SNAPSHOT/bitrepository-reference-pillar-1.10-SNAPSHOT-distribution.tar.gz
[INFO] Installing /home/cibuild01/workspace/Bitrepository-reference-test/bitrepository-reference-pillar/target/bitrepository-reference-pillar-1.10-SNAPSHOT-acceptance-test.tar.gz to /home/cibuild01/.m2/repository/org/bitrepository/reference/bitrepository-reference-pillar/1.10-SNAPSHOT/bitrepository-reference-pillar-1.10-SNAPSHOT-acceptance-test.tar.gz
[INFO] Installing /home/cibuild01/workspace/Bitrepository-reference-test/bitrepository-reference-pillar/target/bitrepository-reference-pillar-1.10-SNAPSHOT-deploy.tar.gz to /home/cibuild01/.m2/repository/org/bitrepository/reference/bitrepository-reference-pillar/1.10-SNAPSHOT/bitrepository-reference-pillar-1.10-SNAPSHOT-deploy.tar.gz
[INFO] Installing /home/cibuild01/workspace/Bitrepository-reference-test/bitrepository-reference-pillar/target/bitrepository-reference-pillar-1.10-SNAPSHOT-acceptance-test-deploy.tar.gz to /home/cibuild01/.m2/repository/org/bitrepository/reference/bitrepository-reference-pillar/1.10-SNAPSHOT/bitrepository-reference-pillar-1.10-SNAPSHOT-acceptance-test-deploy.tar.gz
[INFO] 
[INFO] --- maven-deploy-plugin:3.0.0-M1:deploy (default-deploy) @ bitrepository-reference-pillar ---
[INFO] Downloading: https://sbforge.org/nexus/content/repositories/snapshots/org/bitrepository/reference/bitrepository-reference-pillar/1.10-SNAPSHOT/maven-metadata.xml
[INFO] Downloaded: https://sbforge.org/nexus/content/repositories/snapshots/org/bitrepository/reference/bitrepository-reference-pillar/1.10-SNAPSHOT/maven-metadata.xml (3 KB at 90.4 KB/sec)
[INFO] Uploading: https://sbforge.org/nexus/content/repositories/snapshots/org/bitrepository/reference/bitrepository-reference-pillar/1.10-SNAPSHOT/bitrepository-reference-pillar-1.10-20200904.075403-52.jar
[INFO] Uploaded: https://sbforge.org/nexus/content/repositories/snapshots/org/bitrepository/reference/bitrepository-reference-pillar/1.10-SNAPSHOT/bitrepository-reference-pillar-1.10-20200904.075403-52.jar (128 KB at 872.0 KB/sec)
[INFO] Uploading: https://sbforge.org/nexus/content/repositories/snapshots/org/bitrepository/reference/bitrepository-reference-pillar/1.10-SNAPSHOT/bitrepository-reference-pillar-1.10-20200904.075403-52.pom
[INFO] Uploaded: https://sbforge.org/nexus/content/repositories/snapshots/org/bitrepository/reference/bitrepository-reference-pillar/1.10-SNAPSHOT/bitrepository-reference-pillar-1.10-20200904.075403-52.pom (6 KB at 194.8 KB/sec)
[INFO] Uploading: https://sbforge.org/nexus/content/repositories/snapshots/org/bitrepository/reference/bitrepository-reference-pillar/1.10-SNAPSHOT/bitrepository-reference-pillar-1.10-20200904.075403-52-tests.jar
[INFO] Uploaded: https://sbforge.org/nexus/content/repositories/snapshots/org/bitrepository/reference/bitrepository-reference-pillar/1.10-SNAPSHOT/bitrepository-reference-pillar-1.10-20200904.075403-52-tests.jar (250 KB at 4704.9 KB/sec)
[INFO] Uploading: https://sbforge.org/nexus/content/repositories/snapshots/org/bitrepository/reference/bitrepository-reference-pillar/1.10-SNAPSHOT/bitrepository-reference-pillar-1.10-20200904.075403-52-sources.jar
[INFO] Uploaded: https://sbforge.org/nexus/content/repositories/snapshots/org/bitrepository/reference/bitrepository-reference-pillar/1.10-SNAPSHOT/bitrepository-reference-pillar-1.10-20200904.075403-52-sources.jar (106 KB at 5038.7 KB/sec)
[INFO] Uploading: https://sbforge.org/nexus/content/repositories/snapshots/org/bitrepository/reference/bitrepository-reference-pillar/1.10-SNAPSHOT/bitrepository-reference-pillar-1.10-20200904.075403-52-distribution.tar.gz
[INFO] Uploaded: https://sbforge.org/nexus/content/repositories/snapshots/org/bitrepository/reference/bitrepository-reference-pillar/1.10-SNAPSHOT/bitrepository-reference-pillar-1.10-20200904.075403-52-distribution.tar.gz (14768 KB at 32455.8 KB/sec)
[INFO] Uploading: https://sbforge.org/nexus/content/repositories/snapshots/org/bitrepository/reference/bitrepository-reference-pillar/1.10-SNAPSHOT/bitrepository-reference-pillar-1.10-20200904.075403-52-acceptance-test.tar.gz
[INFO] Uploaded: https://sbforge.org/nexus/content/repositories/snapshots/org/bitrepository/reference/bitrepository-reference-pillar/1.10-SNAPSHOT/bitrepository-reference-pillar-1.10-20200904.075403-52-acceptance-test.tar.gz (21344 KB at 37314.1 KB/sec)
[INFO] Uploading: https://sbforge.org/nexus/content/repositories/snapshots/org/bitrepository/reference/bitrepository-reference-pillar/1.10-SNAPSHOT/bitrepository-reference-pillar-1.10-20200904.075403-52-deploy.tar.gz
[INFO] Uploaded: https://sbforge.org/nexus/content/repositories/snapshots/org/bitrepository/reference/bitrepository-reference-pillar/1.10-SNAPSHOT/bitrepository-reference-pillar-1.10-20200904.075403-52-deploy.tar.gz (4 KB at 125.6 KB/sec)
[INFO] Uploading: https://sbforge.org/nexus/content/repositories/snapshots/org/bitrepository/reference/bitrepository-reference-pillar/1.10-SNAPSHOT/bitrepository-reference-pillar-1.10-20200904.075403-52-acceptance-test-deploy.tar.gz
[INFO] Uploaded: https://sbforge.org/nexus/content/repositories/snapshots/org/bitrepository/reference/bitrepository-reference-pillar/1.10-SNAPSHOT/bitrepository-reference-pillar-1.10-20200904.075403-52-acceptance-test-deploy.tar.gz (4 KB at 119.9 KB/sec)
[INFO] Downloading: https://sbforge.org/nexus/content/repositories/snapshots/org/bitrepository/reference/bitrepository-reference-pillar/maven-metadata.xml
[INFO] Downloaded: https://sbforge.org/nexus/content/repositories/snapshots/org/bitrepository/reference/bitrepository-reference-pillar/maven-metadata.xml (494 B at 23.0 KB/sec)
[INFO] Uploading: https://sbforge.org/nexus/content/repositories/snapshots/org/bitrepository/reference/bitrepository-reference-pillar/1.10-SNAPSHOT/maven-metadata.xml
[INFO] Uploaded: https://sbforge.org/nexus/content/repositories/snapshots/org/bitrepository/reference/bitrepository-reference-pillar/1.10-SNAPSHOT/maven-metadata.xml (3 KB at 71.7 KB/sec)
[INFO] Uploading: https://sbforge.org/nexus/content/repositories/snapshots/org/bitrepository/reference/bitrepository-reference-pillar/maven-metadata.xml
[INFO] Uploaded: https://sbforge.org/nexus/content/repositories/snapshots/org/bitrepository/reference/bitrepository-reference-pillar/maven-metadata.xml (494 B at 21.0 KB/sec)
[JENKINS] Archiving disabled